[Testbot] Plone 5.0 - Python 2.7 - Build # 1313 - Still failing! - 6 failure(s)

jenkins at plone.org jenkins at plone.org
Tue Jan 28 15:01:53 UTC 2014


This commit violated the Plone Continous Integration rule "Don’t Check In on a Broken Build": https://buildoutcoredev.readthedocs.org/en/latest/continous-integration.html#dont-check-in-on-a-broken-build

-------------------------------------------------------------------------------

-------------------------------------------------------------------------------
BUILD
-------------------------------------------------------------------------------

http://jenkins.plone.org/job/plone-5.0-python-2.7/1313/


-------------------------------------------------------------------------------
CHANGES
-------------------------------------------------------------------------------

Repository: buildout.coredev
Branch: refs/heads/5.0
Date: 2014-01-28T06:05:19-08:00
Author: Timo Stollenwerk () <contact at timostollenwerk.net>
Commit: https://github.com/plone/buildout.coredev/commit/95dd3c45e610c881025760655d1500bb9a7d3450

Remove TEST-FIXES-TODO.rst. All tests have been fixed by now.

Files changed:
D TEST-FIXES-TODO.rst

diff --git a/TEST-FIXES-TODO.rst b/TEST-FIXES-TODO.rst
deleted file mode 100644
index 5d11285..0000000
--- a/TEST-FIXES-TODO.rst
+++ /dev/null
@@ -1,80 +0,0 @@
-TEST-FIXES TODO LIST
-====================
-
-Just add your name to the package that you are working on.
-
-| [ ] Products.CMFPlacefulWorkflow (tisto)
-| [ ] Products.CMFPlone
-|
-| [ ] plone.app.caching (tisto)
-| [ ] plone.app.contentlisting
-| [ ] plone.app.layout
-| [ ] plone.app.theming (maartenkling)
-| [ ] plone.app.users
-| [ ] plone.app.versioningbehavior
-
-
-DONE
-----
-
-| [X] Products.TinyMCE (excluded from tests)
-| [X] collective.elephantvocabulary (tisto)
-| [X] grokcore.security (davisagli)
-| [X] plone.app.content (tisto)
-| [X] plone.app.controlpanel (davisagli)
-| [X] plone.app.dexterity (davisagli)
-| [X] plone.app.discussion (tisto)
-| [X] plone.app.intid (tisto)
-| [X] plone.app.portlets (thet)
-| [X] plone.app.redirector (tisto)
-| [X] plone.app.uuid (tisto)
-| [X] plone.dexterity (davisagli)
-| [X] plone.formwidget.datetime (thet)
-| [X] plone.formwidget.recurrence (thet)
-| [X] plone.portlet.collection (tisto)
-| [X] plonetheme.sunburst (thet)
-| [X] zope.testing/zc.relation (tisto)
-
-
-How To Fix
-==========
-
-plone.app.contenttypes fixture
-------------------------------
-
-setup.py::
-
-    extras_require={
-        'test': [
-            'plone.app.contenttypes',
-        ]
-    }
-
-testing.py::
-
-    from plone.app.contenttypes.testing import PLONE_APP_CONTENTTYPES_FIXTURE
-
-    class PloneAppDiscussion(PloneSandboxLayer):
-
-        defaultBases = (PLONE_APP_CONTENTTYPES_FIXTURE,)
-
-
-dexterity
----------
-
-setup.py::
-
-    extras_require={
-        'test': [
-            'dexterity',
-        ]
-    }
-
-testing.py::
-
-    from plone.dexterity.fti import DexterityFTI
-
-    def setUpPlone(self, portal):
-        fti = DexterityFTI('Document')
-        types_tool = getToolByName(portal, "portal_types")
-        types_tool._setObject('Document', fti)





-------------------------------------------------------------------------------
CONSOLE
-------------------------------------------------------------------------------

Started by user User Name
Building remotely on Slave5 in workspace /home/jenkins/workspace/plone-5.0-python-2.7

Deleting project workspace... done

Checkout:plone-5.0-python-2.7 / /home/jenkins/workspace/plone-5.0-python-2.7 - hudson.remoting.Channel at 371690c6:Slave5
Using strategy: Default
Last Built Revision: Revision ae115cd9cc0fd2c735985a4c96bb898c73b66b4a (origin/5.0)
Cloning the remote Git repository
Cloning repository git://github.com/plone/buildout.coredev.git
git --version
git version 1.7.9.5
Fetching upstream changes from origin
Commencing build of Revision 95dd3c45e610c881025760655d1500bb9a7d3450 (origin/5.0)
Checking out Revision 95dd3c45e610c881025760655d1500bb9a7d3450 (origin/5.0)
No emails were triggered.
Allocating TCP port ZSERVER_PORT
  -> Assigned 56103
TCP port allocation complete
Xvfb starting$ /usr/bin/Xvfb :3 -screen 0 1024x768x24 -fbdir /home/jenkins/2014-01-28_14-09-424392179098282524886xvfb
[plone-5.0-python-2.7] $ /bin/bash -xe /tmp/hudson8681890186732159317.sh
+ echo 'Save to CHANGES.log'
Save to CHANGES.log
+ wget http://jenkins.plone.org/roboto/static/changeset/2dc425e4fd6e4681a8463595f67526c3 -O CHANGES.log
--2014-01-28 15:06:27--  http://jenkins.plone.org/roboto/static/changeset/2dc425e4fd6e4681a8463595f67526c3
Resolving jenkins.plone.org (jenkins.plone.org)... 162.159.242.57, 162.159.241.57
Connecting to jenkins.plone.org (jenkins.plone.org)|162.159.242.57|:80... connected.
HTTP request sent, awaiting response... 200 OK
Length: 2326 (2.3K) [application/octet-stream]
Saving to: `CHANGES.log'

     0K ..                                                    100%  262M=0s

2014-01-28 15:06:28 (262 MB/s) - `CHANGES.log' saved [2326/2326]

+ echo 'Run the bootstrap/buildout/jenkins-alltests'
Run the bootstrap/buildout/jenkins-alltests
+ /usr/bin/python2.7 bootstrap.py -c jenkins.cfg
Downloading https://pypi.python.org/packages/source/s/setuptools/setuptools-0.9.6.tar.gz
Extracting in /tmp/tmpWZnQlT
Now working in /tmp/tmpWZnQlT/setuptools-0.9.6
Building a Setuptools egg in /tmp/tmpqbh82W
/tmp/tmpqbh82W/setuptools-0.9.6-py2.7.egg
Creating directory '/home/jenkins/workspace/plone-5.0-python-2.7/bin'.
Creating directory '/home/jenkins/workspace/plone-5.0-python-2.7/parts'.
Creating directory '/home/jenkins/workspace/plone-5.0-python-2.7/develop-eggs'.
Generated script '/home/jenkins/workspace/plone-5.0-python-2.7/bin/buildout'.
+ bin/buildout -c jenkins.cfg
mr.developer: Creating missing sources dir /home/jenkins/workspace/plone-5.0-python-2.7/src.
mr.developer: Queued 'Plone' for checkout.
mr.developer: Queued 'Products.ATContentTypes' for checkout.
mr.developer: Queued 'Products.Archetypes' for checkout.
mr.developer: Queued 'Products.CMFDefault' for checkout.
mr.developer: Queued 'Products.CMFPlacefulWorkflow' for checkout.
mr.developer: Queued 'Products.CMFPlone' for checkout.
mr.developer: Queued 'Products.MimetypesRegistry' for checkout.
mr.developer: Queued 'Products.PasswordResetTool' for checkout.
mr.developer: Queued 'Products.PlacelessTranslationService' for checkout.
mr.developer: Queued 'Products.PlonePAS' for checkout.
mr.developer: Queued 'Products.PloneTestCase' for checkout.
mr.developer: Queued 'Products.PortalTransforms' for checkout.
mr.developer: Queued 'Products.ZCatalog' for checkout.
mr.developer: Queued 'archetypes.querywidget' for checkout.
mr.developer: Queued 'archetypes.referencebrowserwidget' for checkout.
mr.developer: Queued 'archetypes.schemaextender' for checkout.
mr.developer: Queued 'borg.localrole' for checkout.
mr.developer: Queued 'collective.elephantvocabulary' for checkout.
mr.developer: Queued 'five.pt' for checkout.
mr.developer: Queued 'plone.app.blob' for checkout.
mr.developer: Queued 'plone.app.caching' for checkout.
mr.developer: Queued 'plone.app.content' for checkout.
mr.developer: Queued 'plone.app.contentlisting' for checkout.
mr.developer: Queued 'plone.app.contentmenu' for checkout.
mr.developer: Queued 'plone.app.contentrules' for checkout.
mr.developer: Queued 'plone.app.contenttypes' for checkout.
mr.developer: Queued 'plone.app.controlpanel' for checkout.
mr.developer: Queued 'plone.app.customerize' for checkout.
mr.developer: Queued 'plone.app.dexterity' for checkout.
mr.developer: Queued 'plone.app.discussion' for checkout.
mr.developer: Queued 'plone.app.event' for checkout.
mr.developer: Queued 'plone.app.folder' for checkout.
mr.developer: Queued 'plone.app.form' for checkout.
mr.developer: Queued 'plone.app.imaging' for checkout.
mr.developer: Queued 'plone.app.intid' for checkout.
mr.developer: Queued 'plone.app.iterate' for checkout.
mr.developer: Queued 'plone.app.jquerytools' for checkout.
mr.developer: Queued 'plone.app.layout' for checkout.
mr.developer: Queued 'plone.app.linkintegrity' for checkout.
mr.developer: Queued 'plone.app.locales' for checkout.
mr.developer: Queued 'plone.app.portlets' for checkout.
mr.developer: Queued 'plone.app.redirector' for checkout.
mr.developer: Queued 'plone.app.search' for checkout.
mr.developer: Queued 'plone.app.testing' for checkout.
mr.developer: Queued 'plone.app.theming' for checkout.
mr.developer: Queued 'plone.app.upgrade' for checkout.
mr.developer: Queued 'plone.app.uuid' for checkout.
mr.developer: Queued 'plone.app.versioningbehavior' for checkout.
mr.developer: Queued 'plone.app.vocabularies' for checkout.
mr.developer: Queued 'plone.app.workflow' for checkout.
mr.developer: Queued 'plone.app.z3cform' for checkout.
mr.developer: Queued 'plone.autoform' for checkout.
mr.developer: Queued 'plone.cachepurging' for checkout.
mr.developer: Queued 'plone.contentrules' for checkout.
mr.developer: Queued 'plone.dexterity' for checkout.
mr.developer: Queued 'plone.event' for checkout.
mr.developer: Queued 'plone.formwidget.datetime' for checkout.
mr.developer: Queued 'plone.formwidget.querystring' for checkout.
mr.developer: Queued 'plone.formwidget.recurrence' for checkout.
mr.developer: Queued 'plone.namedfile' for checkout.
mr.developer: Queued 'plone.openid' for checkout.
mr.developer: Queued 'plone.outputfilters' for checkout.
mr.developer: Queued 'plone.portlet.collection' for checkout.
mr.developer: Queued 'plone.recipe.alltests' for checkout.
mr.developer: Queued 'plone.schemaeditor' for checkout.
mr.developer: Queued 'plone.stringinterp' for checkout.
mr.developer: Queued 'plone.supermodel' for checkout.
mr.developer: Queued 'plone.testing' for checkout.
mr.developer: Queued 'plone.theme' for checkout.
mr.developer: Queued 'plonetheme.sunburst' for checkout.
mr.developer: Cloned 'Products.CMFPlacefulWorkflow' with git.
mr.developer: Cloned 'Plone' with git.
mr.developer: Cloned 'Products.ATContentTypes' with git.
mr.developer: Cloned 'Products.Archetypes' with git.
mr.developer: Cloned 'Products.MimetypesRegistry' with git.
mr.developer: Cloned 'Products.PasswordResetTool' with git.
mr.developer: Cloned 'Products.PlacelessTranslationService' with git.
mr.developer: Cloned 'Products.PloneTestCase' with git.
mr.developer: Checked out 'Products.CMFDefault' with subversion.
mr.developer: Cloned 'Products.PortalTransforms' with git.
mr.developer: Cloned 'Products.PlonePAS' with git.
mr.developer: Cloned 'archetypes.querywidget' with git.
mr.developer: Cloned 'Products.ZCatalog' with git.
mr.developer: Cloned 'archetypes.schemaextender' with git.
mr.developer: Cloned 'borg.localrole' with git.
mr.developer: Cloned 'archetypes.referencebrowserwidget' with git.
mr.developer: Cloned 'collective.elephantvocabulary' with git.
mr.developer: Cloned 'Products.CMFPlone' with git.
mr.developer: Cloned 'five.pt' with git.
mr.developer: Cloned 'plone.app.contentlisting' with git.
mr.developer: Cloned 'plone.app.caching' with git.
mr.developer: Cloned 'plone.app.blob' with git.
mr.developer: Cloned 'plone.app.content' with git.
mr.developer: Cloned 'plone.app.contentmenu' with git.
mr.developer: Cloned 'plone.app.customerize' with git.
mr.developer: Cloned 'plone.app.contentrules' with git.
mr.developer: Cloned 'plone.app.contenttypes' with git.
mr.developer: Cloned 'plone.app.controlpanel' with git.
mr.developer: Cloned 'plone.app.dexterity' with git.
mr.developer: Cloned 'plone.app.folder' with git.
mr.developer: Cloned 'plone.app.discussion' with git.
mr.developer: Cloned 'plone.app.form' with git.
mr.developer: Cloned 'plone.app.intid' with git.
mr.developer: Cloned 'plone.app.event' with git.
mr.developer: Cloned 'plone.app.imaging' with git.
mr.developer: Cloned 'plone.app.iterate' with git.
mr.developer: Cloned 'plone.app.linkintegrity' with git.
mr.developer: Cloned 'plone.app.redirector' with git.
mr.developer: Cloned 'plone.app.layout' with git.
mr.developer: Cloned 'plone.app.portlets' with git.
mr.developer: Cloned 'plone.app.search' with git.
mr.developer: Cloned 'plone.app.testing' with git.
mr.developer: Cloned 'plone.app.jquerytools' with git.
mr.developer: Cloned 'plone.app.uuid' with git.
mr.developer: Cloned 'plone.app.versioningbehavior' with git.
mr.developer: Cloned 'plone.app.theming' with git.
mr.developer: Cloned 'plone.app.vocabularies' with git.
mr.developer: Cloned 'plone.app.upgrade' with git.
mr.developer: Cloned 'plone.app.workflow' with git.
mr.developer: Cloned 'plone.autoform' with git.
mr.developer: Cloned 'plone.cachepurging' with git.
mr.developer: Cloned 'plone.app.z3cform' with git.
mr.developer: Cloned 'plone.contentrules' with git.
mr.developer: Cloned 'plone.event' with git.
mr.developer: Cloned 'plone.formwidget.datetime' with git.
mr.developer: Cloned 'plone.formwidget.querystring' with git.
mr.developer: Cloned 'plone.dexterity' with git.
mr.developer: Cloned 'plone.openid' with git.
mr.developer: Cloned 'plone.namedfile' with git.
mr.developer: Cloned 'plone.outputfilters' with git.
mr.developer: Cloned 'plone.formwidget.recurrence' with git.
mr.developer: Cloned 'plone.portlet.collection' with git.
mr.developer: Cloned 'plone.stringinterp' with git.
mr.developer: Cloned 'plone.recipe.alltests' with git.
mr.developer: Cloned 'plone.schemaeditor' with git.
mr.developer: Cloned 'plone.theme' with git.
mr.developer: Cloned 'plone.supermodel' with git.
mr.developer: Cloned 'plone.testing' with git.
mr.developer: Cloned 'plonetheme.sunburst' with git.
mr.developer: Cloned 'plone.app.locales' with git.
Upgraded:
  setuptools version 1.3.2;
restarting.
Generated script '/home/jenkins/workspace/plone-5.0-python-2.7/bin/buildout'.
mr.developer: Queued 'Plone' for checkout.
mr.developer: Queued 'Products.ATContentTypes' for checkout.
mr.developer: Queued 'Products.Archetypes' for checkout.
mr.developer: Queued 'Products.CMFDefault' for checkout.
mr.developer: Queued 'Products.CMFPlacefulWorkflow' for checkout.
mr.developer: Queued 'Products.CMFPlone' for checkout.
mr.developer: Queued 'Products.MimetypesRegistry' for checkout.
mr.developer: Queued 'Products.PasswordResetTool' for checkout.
mr.developer: Queued 'Products.PlacelessTranslationService' for checkout.
mr.developer: Queued 'Products.PlonePAS' for checkout.
mr.developer: Queued 'Products.PloneTestCase' for checkout.
mr.developer: Queued 'Products.PortalTransforms' for checkout.
mr.developer: Queued 'Products.ZCatalog' for checkout.
mr.developer: Queued 'archetypes.querywidget' for checkout.
mr.developer: Queued 'archetypes.referencebrowserwidget' for checkout.
mr.developer: Queued 'archetypes.schemaextender' for checkout.
mr.developer: Queued 'borg.localrole' for checkout.
mr.developer: Queued 'collective.elephantvocabulary' for checkout.
mr.developer: Queued 'five.pt' for checkout.
mr.developer: Queued 'plone.app.blob' for checkout.
mr.developer: Queued 'plone.app.caching' for checkout.
mr.developer: Queued 'plone.app.content' for checkout.
mr.developer: Queued 'plone.app.contentlisting' for checkout.
mr.developer: Queued 'plone.app.contentmenu' for checkout.
mr.developer: Queued 'plone.app.contentrules' for checkout.
mr.developer: Queued 'plone.app.contenttypes' for checkout.
mr.developer: Queued 'plone.app.controlpanel' for checkout.
mr.developer: Queued 'plone.app.customerize' for checkout.
mr.developer: Queued 'plone.app.dexterity' for checkout.
mr.developer: Queued 'plone.app.discussion' for checkout.
mr.developer: Queued 'plone.app.event' for checkout.
mr.developer: Queued 'plone.app.folder' for checkout.
mr.developer: Queued 'plone.app.form' for checkout.
mr.developer: Queued 'plone.app.imaging' for checkout.
mr.developer: Queued 'plone.app.intid' for checkout.
mr.developer: Queued 'plone.app.iterate' for checkout.
mr.developer: Queued 'plone.app.jquerytools' for checkout.
mr.developer: Queued 'plone.app.layout' for checkout.
mr.developer: Queued 'plone.app.linkintegrity' for checkout.
mr.developer: Queued 'plone.app.locales' for checkout.
mr.developer: Queued 'plone.app.portlets' for checkout.
mr.developer: Queued 'plone.app.redirector' for checkout.
mr.developer: Queued 'plone.app.search' for checkout.
mr.developer: Queued 'plone.app.testing' for checkout.
mr.developer: Queued 'plone.app.theming' for checkout.
mr.developer: Queued 'plone.app.upgrade' for checkout.
mr.developer: Queued 'plone.app.uuid' for checkout.
mr.developer: Queued 'plone.app.versioningbehavior' for checkout.
mr.developer: Queued 'plone.app.vocabularies' for checkout.
mr.developer: Queued 'plone.app.workflow' for checkout.
mr.developer: Queued 'plone.app.z3cform' for checkout.
mr.developer: Queued 'plone.autoform' for checkout.
mr.developer: Queued 'plone.cachepurging' for checkout.
mr.developer: Queued 'plone.contentrules' for checkout.
mr.developer: Queued 'plone.dexterity' for checkout.
mr.developer: Queued 'plone.event' for checkout.
mr.developer: Queued 'plone.formwidget.datetime' for checkout.
mr.developer: Queued 'plone.formwidget.querystring' for checkout.
mr.developer: Queued 'plone.formwidget.recurrence' for checkout.
mr.developer: Queued 'plone.namedfile' for checkout.
mr.developer: Queued 'plone.openid' for checkout.
mr.developer: Queued 'plone.outputfilters' for checkout.
mr.developer: Queued 'plone.portlet.collection' for checkout.
mr.developer: Queued 'plone.recipe.alltests' for checkout.
mr.developer: Queued 'plone.schemaeditor' for checkout.
mr.developer: Queued 'plone.stringinterp' for checkout.
mr.developer: Queued 'plone.supermodel' for checkout.
mr.developer: Queued 'plone.testing' for checkout.
mr.developer: Queued 'plone.theme' for checkout.
mr.developer: Queued 'plonetheme.sunburst' for checkout.
mr.developer: Updated 'Products.CMFPlacefulWorkflow' with git.
mr.developer: Updated 'Products.ATContentTypes' with git.
mr.developer: Updated 'Products.Archetypes' with git.
mr.developer: Updated 'Products.MimetypesRegistry' with git.
mr.developer: Updated 'Products.PasswordResetTool' with git.
mr.developer: Updated 'Products.CMFPlone' with git.
mr.developer: Updated 'Products.PlacelessTranslationService' with git.
mr.developer: Updated 'Products.PloneTestCase' with git.
mr.developer: Updated 'Products.PlonePAS' with git.
mr.developer: Updated 'Products.PortalTransforms' with git.
mr.developer: Updated 'Products.ZCatalog' with git.
mr.developer: Updated 'archetypes.querywidget' with git.
mr.developer: Switched 'Products.CMFDefault' with subversion.
mr.developer: Updated 'Plone' with git.
mr.developer: Updated 'archetypes.schemaextender' with git.
mr.developer: Updated 'borg.localrole' with git.
mr.developer: Updated 'archetypes.referencebrowserwidget' with git.
mr.developer: Updated 'collective.elephantvocabulary' with git.
mr.developer: Updated 'five.pt' with git.
mr.developer: Updated 'plone.app.blob' with git.
mr.developer: Updated 'plone.app.caching' with git.
mr.developer: Updated 'plone.app.content' with git.
mr.developer: Updated 'plone.app.contentlisting' with git.
mr.developer: Updated 'plone.app.contentmenu' with git.
mr.developer: Updated 'plone.app.contentrules' with git.
mr.developer: Updated 'plone.app.contenttypes' with git.
mr.developer: Updated 'plone.app.controlpanel' with git.
mr.developer: Updated 'plone.app.customerize' with git.
mr.developer: Updated 'plone.app.dexterity' with git.
mr.developer: Updated 'plone.app.discussion' with git.
mr.developer: Updated 'plone.app.folder' with git.
mr.developer: Updated 'plone.app.event' with git.
mr.developer: Updated 'plone.app.form' with git.
mr.developer: Updated 'plone.app.imaging' with git.
mr.developer: Updated 'plone.app.intid' with git.
mr.developer: Updated 'plone.app.jquerytools' with git.
mr.developer: Updated 'plone.app.iterate' with git.
mr.developer: Updated 'plone.app.layout' with git.
mr.developer: Updated 'plone.app.linkintegrity' with git.
mr.developer: Updated 'plone.app.locales' with git.
mr.developer: Updated 'plone.app.redirector' with git.
mr.developer: Updated 'plone.app.portlets' with git.
mr.developer: Updated 'plone.app.search' with git.
mr.developer: Updated 'plone.app.testing' with git.
mr.developer: Updated 'plone.app.theming' with git.
mr.developer: Updated 'plone.app.upgrade' with git.
mr.developer: Updated 'plone.app.uuid' with git.
mr.developer: Updated 'plone.app.versioningbehavior' with git.
mr.developer: Updated 'plone.app.vocabularies' with git.
mr.developer: Updated 'plone.app.workflow' with git.
mr.developer: Updated 'plone.autoform' with git.
mr.developer: Updated 'plone.app.z3cform' with git.
mr.developer: Updated 'plone.cachepurging' with git.
mr.developer: Updated 'plone.contentrules' with git.
mr.developer: Updated 'plone.dexterity' with git.
mr.developer: Updated 'plone.event' with git.
mr.developer: Updated 'plone.formwidget.querystring' with git.
mr.developer: Updated 'plone.formwidget.datetime' with git.
mr.developer: Updated 'plone.formwidget.recurrence' with git.
mr.developer: Updated 'plone.namedfile' with git.
mr.developer: Updated 'plone.openid' with git.
mr.developer: Updated 'plone.outputfilters' with git.
mr.developer: Updated 'plone.portlet.collection' with git.
mr.developer: Updated 'plone.recipe.alltests' with git.
mr.developer: Updated 'plone.schemaeditor' with git.
mr.developer: Updated 'plone.supermodel' with git.
mr.developer: Updated 'plone.stringinterp' with git.
mr.developer: Updated 'plone.testing' with git.
mr.developer: Updated 'plone.theme' with git.
mr.developer: Updated 'plonetheme.sunburst' with git.
Develop: '/home/jenkins/workspace/plone-5.0-python-2.7/src/plone.app.testing'
warning: no files found matching '*.txt'
warning: no previously-included files matching '*pyc' found anywhere in distribution
Develop: '/home/jenkins/workspace/plone-5.0-python-2.7/src/plone.portlet.collection'
warning: no files found matching '*.txt'
warning: no previously-included files matching '*pyc' found anywhere in distribution
Develop: '/home/jenkins/workspace/plone-5.0-python-2.7/src/plone.supermodel'
warning: no files found matching '*.txt'
warning: no previously-included files matching '*pyc' found anywhere in distribution
Develop: '/home/jenkins/workspace/plone-5.0-python-2.7/src/plone.app.blob'
warning: no previously-included files matching '*pyc' found anywhere in distribution
Develop: '/home/jenkins/workspace/plone-5.0-python-2.7/src/plone.app.contentrules'
warning: no files found matching '*.txt'
warning: no previously-included files matching '*pyc' found anywhere in distribution
Develop: '/home/jenkins/workspace/plone-5.0-python-2.7/src/plone.theme'
warning: no previously-included files matching '*pyc' found anywhere in distribution
Develop: '/home/jenkins/workspace/plone-5.0-python-2.7/src/plone.app.form'
warning: no previously-included files matching '*pyc' found anywhere in distribution
Develop: '/home/jenkins/workspace/plone-5.0-python-2.7/src/plone.namedfile'
warning: no previously-included files matching '*.pyc' found anywhere in distribution
Develop: '/home/jenkins/workspace/plone-5.0-python-2.7/src/plone.app.layout'
warning: no previously-included files matching '*.pyc' found anywhere in distribution
Develop: '/home/jenkins/workspace/plone-5.0-python-2.7/src/Products.Archetypes'
warning: no previously-included files matching '*pyc' found anywhere in distribution
Develop: '/home/jenkins/workspace/plone-5.0-python-2.7/src/plone.app.workflow'
warning: no previously-included files matching '*pyc' found anywhere in distribution
Develop: '/home/jenkins/workspace/plone-5.0-python-2.7/src/Products.PasswordResetTool'
warning: no previously-included files matching '*pyc' found anywhere in distribution
Develop: '/home/jenkins/workspace/plone-5.0-python-2.7/src/plone.app.intid'
warning: no previously-included files matching '*.pyc' found anywhere in distribution
Develop: '/home/jenkins/workspace/plone-5.0-python-2.7/src/plone.app.folder'
warning: no previously-included files matching '*pyc' found anywhere in distribution
Develop: '/home/jenkins/workspace/plone-5.0-python-2.7/src/plone.dexterity'
warning: no files found matching '*.mo' anywhere in distribution
Develop: '/home/jenkins/workspace/plone-5.0-python-2.7/src/plone.recipe.alltests'
warning: no previously-included files matching '*pyc' found anywhere in distribution
Develop: '/home/jenkins/workspace/plone-5.0-python-2.7/src/collective.elephantvocabulary'
warning: no previously-included files matching '*.pyc' found anywhere in distribution
Develop: '/home/jenkins/workspace/plone-5.0-python-2.7/src/plone.app.iterate'
warning: no previously-included files matching '*pyc' found anywhere in distribution
Develop: '/home/jenkins/workspace/plone-5.0-python-2.7/src/plone.autoform'
warning: no previously-included files matching '*pyc' found anywhere in distribution
Develop: '/home/jenkins/workspace/plone-5.0-python-2.7/src/plone.app.upgrade'
warning: no previously-included files matching '*pyc' found anywhere in distribution
Develop: '/home/jenkins/workspace/plone-5.0-python-2.7/src/archetypes.querywidget'
warning: no files found matching '*.txt'
warning: no previously-included files matching '*pyc' found anywhere in distribution
Develop: '/home/jenkins/workspace/plone-5.0-python-2.7/src/plone.app.search'
warning: no previously-included files matching '*pyc' found anywhere in distribution
Develop: '/home/jenkins/workspace/plone-5.0-python-2.7/src/Products.PlacelessTranslationService'
warning: no previously-included files matching '*pyc' found anywhere in distribution
Develop: '/home/jenkins/workspace/plone-5.0-python-2.7/src/plone.app.dexterity'
warning: no previously-included files matching '*.pyc' found anywhere in distribution
Develop: '/home/jenkins/workspace/plone-5.0-python-2.7/src/plone.app.linkintegrity'
warning: no previously-included files matching '*.pyc' found anywhere in distribution
Develop: '/home/jenkins/workspace/plone-5.0-python-2.7/src/plonetheme.sunburst'
warning: no files found matching '*.txt'
warning: no previously-included files matching '*pyc' found anywhere in distribution
Develop: '/home/jenkins/workspace/plone-5.0-python-2.7/src/plone.openid'
warning: no previously-included files matching '*pyc' found anywhere in distribution
Develop: '/home/jenkins/workspace/plone-5.0-python-2.7/src/Products.PortalTransforms'
warning: no previously-included files matching '*pyc' found anywhere in distribution
Develop: '/home/jenkins/workspace/plone-5.0-python-2.7/src/Products.CMFDefault'

Installed /home/jenkins/workspace/plone-5.0-python-2.7/src/Products.CMFDefault/eggtestinfo-0.3-py2.7.egg
warning: no previously-included files matching '*.pyc' found anywhere in distribution
Develop: '/home/jenkins/workspace/plone-5.0-python-2.7/src/plone.app.contentlisting'
warning: no previously-included files matching '*pyc' found anywhere in distribution
Develop: '/home/jenkins/workspace/plone-5.0-python-2.7/src/plone.app.controlpanel'
warning: no previously-included files matching '*pyc' found anywhere in distribution
Develop: '/home/jenkins/workspace/plone-5.0-python-2.7/src/plone.app.contenttypes'
warning: no previously-included files matching '*.pyc' found anywhere in distribution
warning: no previously-included files found matching 'bootstrap.py'
warning: no previously-included files found matching '*.cfg'
warning: no previously-included files found matching '*.yml'
warning: no previously-included files found matching '*.sh'
no previously-included directories found matching 'templates'
Develop: '/home/jenkins/workspace/plone-5.0-python-2.7/src/plone.app.locales'
warning: no files found matching '*.mo' anywhere in distribution
warning: no previously-included files matching '*pyc' found anywhere in distribution
warning: no previously-included files matching '*pyo' found anywhere in distribution
Develop: '/home/jenkins/workspace/plone-5.0-python-2.7/src/Products.CMFPlone'
warning: no previously-included files matching '*.pyc' found anywhere in distribution
Develop: '/home/jenkins/workspace/plone-5.0-python-2.7/src/plone.app.caching'
warning: no previously-included files matching '*pyc' found anywhere in distribution
Develop: '/home/jenkins/workspace/plone-5.0-python-2.7/src/plone.app.customerize'
warning: no previously-included files matching '*pyc' found anywhere in distribution
Develop: '/home/jenkins/workspace/plone-5.0-python-2.7/src/plone.app.imaging'
warning: no previously-included files matching '*pyc' found anywhere in distribution
Develop: '/home/jenkins/workspace/plone-5.0-python-2.7/src/plone.testing'
warning: no previously-included files matching '*pyc' found anywhere in distribution
Develop: '/home/jenkins/workspace/plone-5.0-python-2.7/src/plone.app.z3cform'
warning: no previously-included files matching '*pyc' found anywhere in distribution
Develop: '/home/jenkins/workspace/plone-5.0-python-2.7/src/plone.app.jquerytools'
warning: no previously-included files matching '*.pyc' found anywhere in distribution
warning: no previously-included files matching '*~' found anywhere in distribution
warning: no previously-included files matching '*.mo' found anywhere in distribution
warning: no previously-included files matching '*.jar' found anywhere in distribution
warning: no previously-included files matching 'jslint.js' found anywhere in distribution
warning: no previously-included files matching 'jqt_checkout_build' found anywhere in distribution
Develop: '/home/jenkins/workspace/plone-5.0-python-2.7/src/plone.formwidget.datetime'
warning: no files found matching '*.mo' anywhere in distribution
warning: no previously-included files matching '*pyc' found anywhere in distribution
Develop: '/home/jenkins/workspace/plone-5.0-python-2.7/src/five.pt'
warning: no files found matching '*.txt'
warning: no previously-included files matching '*.pyc' found anywhere in distribution
warning: no previously-included files matching '*.pyo' found anywhere in distribution
Develop: '/home/jenkins/workspace/plone-5.0-python-2.7/src/Products.ATContentTypes'
warning: no previously-included files matching '*.pyc' found anywhere in distribution
Develop: '/home/jenkins/workspace/plone-5.0-python-2.7/src/plone.stringinterp'
warning: no previously-included files matching '*pyc' found anywhere in distribution
Develop: '/home/jenkins/workspace/plone-5.0-python-2.7/src/archetypes.referencebrowserwidget'
warning: no previously-included files matching '*pyc' found anywhere in distribution
Develop: '/home/jenkins/workspace/plone-5.0-python-2.7/src/plone.contentrules'
warning: no previously-included files matching '*pyc' found anywhere in distribution
Develop: '/home/jenkins/workspace/plone-5.0-python-2.7/src/plone.app.portlets'
warning: no previously-included files matching '*pyc' found anywhere in distribution
Develop: '/home/jenkins/workspace/plone-5.0-python-2.7/src/Products.CMFPlacefulWorkflow'
warning: no previously-included files matching '*pyc' found anywhere in distribution
Develop: '/home/jenkins/workspace/plone-5.0-python-2.7/src/plone.app.redirector'
warning: no previously-included files matching '*pyc' found anywhere in distribution
Develop: '/home/jenkins/workspace/plone-5.0-python-2.7/src/plone.cachepurging'
warning: no previously-included files matching '*pyc' found anywhere in distribution
Develop: '/home/jenkins/workspace/plone-5.0-python-2.7/src/plone.app.content'
warning: no previously-included files matching '*pyc' found anywhere in distribution
Develop: '/home/jenkins/workspace/plone-5.0-python-2.7/src/Products.PlonePAS'
warning: no previously-included files matching '*.pyc' found anywhere in distribution
Develop: '/home/jenkins/workspace/plone-5.0-python-2.7/src/plone.app.uuid'
warning: no files found matching '*.txt'
warning: no previously-included files matching '*pyc' found anywhere in distribution
Develop: '/home/jenkins/workspace/plone-5.0-python-2.7/src/plone.app.contentmenu'
warning: no previously-included files matching '*pyc' found anywhere in distribution
Develop: '/home/jenkins/workspace/plone-5.0-python-2.7/src/plone.formwidget.recurrence'
warning: no files found matching '*.mo' anywhere in distribution
warning: no previously-included files matching '*pyc' found anywhere in distribution
Develop: '/home/jenkins/workspace/plone-5.0-python-2.7/src/Products.PloneTestCase'
warning: no previously-included files matching '*pyc' found anywhere in distribution
Develop: '/home/jenkins/workspace/plone-5.0-python-2.7/src/plone.outputfilters'
warning: no previously-included files matching '*pyc' found anywhere in distribution
Develop: '/home/jenkins/workspace/plone-5.0-python-2.7/src/Products.MimetypesRegistry'
warning: no previously-included files matching '*pyc' found anywhere in distribution
Develop: '/home/jenkins/workspace/plone-5.0-python-2.7/src/plone.app.discussion'
warning: no files found matching '*.txt'
warning: no files found matching '*.mo' anywhere in distribution
warning: no previously-included files matching '*.pyc' found anywhere in distribution
Develop: '/home/jenkins/workspace/plone-5.0-python-2.7/src/plone.app.vocabularies'
warning: no files found matching '*' under directory 'docs'
warning: no previously-included files matching '*pyc' found anywhere in distribution
Develop: '/home/jenkins/workspace/plone-5.0-python-2.7/src/plone.app.versioningbehavior'
warning: no files found matching '*' under directory 'docs'
warning: no files found matching '*.txt'
warning: no previously-included files found matching '.gitignore'
warning: no previously-included files matching '*.pyc' found anywhere in distribution
Develop: '/home/jenkins/workspace/plone-5.0-python-2.7/src/borg.localrole'
warning: no previously-included files matching '*pyc' found anywhere in distribution
Develop: '/home/jenkins/workspace/plone-5.0-python-2.7/src/Products.ZCatalog'
warning: no previously-included files matching '*.pyc' found anywhere in distribution
warning: no previously-included files matching '*.pyo' found anywhere in distribution
Develop: '/home/jenkins/workspace/plone-5.0-python-2.7/src/plone.event'
warning: no files found matching '*.mo' anywhere in distribution
warning: no previously-included files matching '*pyc' found anywhere in distribution
Develop: '/home/jenkins/workspace/plone-5.0-python-2.7/src/plone.app.event'
warning: no files found matching '*.mo' anywhere in distribution
warning: no previously-included files matching '*pyc' found anywhere in distribution
Develop: '/home/jenkins/workspace/plone-5.0-python-2.7/src/plone.schemaeditor'
warning: no files found matching '*.mo' anywhere in distribution
Develop: '/home/jenkins/workspace/plone-5.0-python-2.7/src/plone.formwidget.querystring'
warning: no previously-included files matching '*.pyc' found anywhere in distribution
Develop: '/home/jenkins/workspace/plone-5.0-python-2.7/src/archetypes.schemaextender'
warning: no previously-included files matching '*pyc' found anywhere in distribution
Develop: '/home/jenkins/workspace/plone-5.0-python-2.7/src/Plone'
Develop: '/home/jenkins/workspace/plone-5.0-python-2.7/src/plone.app.theming'
warning: no previously-included files matching '*pyc' found anywhere in distribution
Unused options for buildout: 'download-directory'.
Installing _mr.developer.
Generated script '/home/jenkins/workspace/plone-5.0-python-2.7/bin/develop'.
Installing zopepy.
Generated interpreter '/home/jenkins/workspace/plone-5.0-python-2.7/bin/zopepy'.
Installing test.
Generated script '/home/jenkins/workspace/plone-5.0-python-2.7/bin/test'.
Installing alltests.
Generated script '/home/jenkins/workspace/plone-5.0-python-2.7/bin/alltests'.
Installing alltests-at.
Generated script '/home/jenkins/workspace/plone-5.0-python-2.7/bin/alltests-at'.
Installing checkversions.
Generated script '/home/jenkins/workspace/plone-5.0-python-2.7/bin/checkversions'.
Installing pep8.
Generated script '/home/jenkins/workspace/plone-5.0-python-2.7/bin/pep8'.
Installing releaser.
Generated script '/home/jenkins/workspace/plone-5.0-python-2.7/bin/fullrelease'.
Generated script '/home/jenkins/workspace/plone-5.0-python-2.7/bin/postrelease'.
Generated script '/home/jenkins/workspace/plone-5.0-python-2.7/bin/lasttagdiff'.
Generated script '/home/jenkins/workspace/plone-5.0-python-2.7/bin/prerelease'.
Generated script '/home/jenkins/workspace/plone-5.0-python-2.7/bin/release'.
Generated script '/home/jenkins/workspace/plone-5.0-python-2.7/bin/longtest'.
Generated script '/home/jenkins/workspace/plone-5.0-python-2.7/bin/lasttaglog'.
Installing jenkins-test.
Generated script '/home/jenkins/workspace/plone-5.0-python-2.7/bin/jenkins-test'.
Installing jenkins-test-robot.
Generated script '/home/jenkins/workspace/plone-5.0-python-2.7/bin/jenkins-test-robot'.
Installing jenkins-test-coverage.
Installing coverage.
Generated script '/home/jenkins/workspace/plone-5.0-python-2.7/bin/coverage'.
Generated interpreter '/home/jenkins/workspace/plone-5.0-python-2.7/bin/zopepy'.
Installing jenkins-alltests.
Generated script '/home/jenkins/workspace/plone-5.0-python-2.7/bin/jenkins-alltests'.
Installing jenkins-alltests-at.
Generated script '/home/jenkins/workspace/plone-5.0-python-2.7/bin/jenkins-alltests-at'.
Installing jenkins-test-at.
Generated script '/home/jenkins/workspace/plone-5.0-python-2.7/bin/jenkins-test-at'.
Versions had to be automatically picked.
The following part definition lists the versions picked:
[versions]

# Required by:
# Products.CMFTestCase==0.9.12
Products.CMFCalendar = 2.2.2

# Required by:
# collective.xmltestreport==1.3.1
z3c.recipe.scripts = 1.0.1
+ bin/jenkins-alltests --all
/home/jenkins/.buildout/eggs/setuptools-1.3.2-py2.7.egg/pkg_resources.py:979: UserWarning: /home/jenkins/.python-eggs is writable by group/others and vulnerable to attack when used with get_resource_filename. Consider a more secure location (set with .set_extraction_path or the PYTHON_EGG_CACHE environment variable).
  warnings.warn(msg, UserWarning)
Running Products.CMFTestCase.layer.CMFSite tests:
  Set up Testing.ZopeTestCase.layer.ZopeLite in 0.482 seconds.
  Set up Products.CMFTestCase.layer.ZCML in 9.223 seconds.
  Set up Products.CMFTestCase.layer.CMFSite in 1.372 seconds.
  Ran 31 tests with 0 failures and 0 errors in 1.252 seconds.
Running Products.PloneTestCase.layer.PloneSite tests:
  Tear down Products.CMFTestCase.layer.CMFSite in 0.028 seconds.
  Tear down Products.CMFTestCase.layer.ZCML in 0.002 seconds.
  Set up Products.PloneTestCase.layer.ZCML in 3.251 seconds.
  Set up Products.PloneTestCase.layer.PloneSite in 4.042 seconds.
  Ran 606 tests with 0 failures and 0 errors in 1 minutes 15.917 seconds.
Running plone.app.testing.bbb.PloneTestCase:Functional tests:
  Tear down Products.PloneTestCase.layer.PloneSite in 0.094 seconds.
  Tear down Products.PloneTestCase.layer.ZCML in 0.003 seconds.
  Tear down Testing.ZopeTestCase.layer.ZopeLite in 0.000 seconds.
  Set up plone.testing.zca.LayerCleanup in 0.000 seconds.
  Set up plone.testing.z2.Startup in 0.083 seconds.
  Set up plone.app.testing.layers.PloneFixture in 4.965 seconds.
  Set up plone.app.testing.bbb.PloneTestCaseFixture in 1.846 seconds.
  Set up plone.app.testing.bbb.PloneTestCase:Functional in 0.000 seconds.
  Ran 28 tests with 0 failures and 0 errors in 6.963 seconds.
Running zope.testrunner.layer.UnitTests tests:
  Tear down plone.app.testing.bbb.PloneTestCase:Functional in 0.000 seconds.
  Tear down plone.app.testing.bbb.PloneTestCaseFixture in 0.006 seconds.
  Tear down plone.app.testing.layers.PloneFixture in 0.057 seconds.
  Tear down plone.testing.z2.Startup in 0.005 seconds.
  Tear down plone.testing.zca.LayerCleanup in 0.002 seconds.
  Set up zope.testrunner.layer.UnitTests in 0.000 seconds.
  Ran 6 tests with 0 failures and 0 errors in 0.033 seconds.
Tearing down left over layers:
  Tear down zope.testrunner.layer.UnitTests in 0.000 seconds.
Total: 671 tests, 0 failures, 0 errors in 1 minutes 50.528 seconds.
/home/jenkins/.buildout/eggs/setuptools-1.3.2-py2.7.egg/pkg_resources.py:979: UserWarning: /home/jenkins/.python-eggs is writable by group/others and vulnerable to attack when used with get_resource_filename. Consider a more secure location (set with .set_extraction_path or the PYTHON_EGG_CACHE environment variable).
  warnings.warn(msg, UserWarning)
Running Testing.ZopeTestCase.layer.ZopeLite tests:
  Set up Testing.ZopeTestCase.layer.ZopeLite in 0.403 seconds.
  Ran 9 tests with 0 failures and 0 errors in 0.073 seconds.
Running Products.Archetypes.tests.layer.ZCML tests:
  Set up Products.CMFCore.testing.FunctionalZCMLLayer in 0.177 seconds.
  Set up Products.Archetypes.tests.layer.ZCML in 0.249 seconds.
  Ran 75 tests with 0 failures and 0 errors in 2.840 seconds.
Running Products.Archetypes.tests.layer.ArchetypesSite tests:
  Set up Products.Archetypes.tests.layer.ArchetypesSite in 1.338 seconds.
  Ran 494 tests with 0 failures and 0 errors in 29.028 seconds.
Running Products.PloneTestCase.layer.PloneSite tests:
  Tear down Products.Archetypes.tests.layer.ArchetypesSite in 0.032 seconds.
  Tear down Products.Archetypes.tests.layer.ZCML in 0.003 seconds.
  Tear down Products.CMFCore.testing.FunctionalZCMLLayer in 0.000 seconds.
  Set up Products.PloneTestCase.layer.ZCML in 4.259 seconds.
  Set up Products.PloneTestCase.layer.PloneSite in 4.037 seconds.
  Ran 10 tests with 0 failures and 0 errors in 1.024 seconds.
Running zope.testrunner.layer.UnitTests tests:
  Tear down Products.PloneTestCase.layer.PloneSite in 0.101 seconds.
  Tear down Products.PloneTestCase.layer.ZCML in 0.002 seconds.
  Tear down Testing.ZopeTestCase.layer.ZopeLite in 0.000 seconds.
  Set up zope.testrunner.layer.UnitTests in 0.000 seconds.
  Ran 27 tests with 0 failures and 0 errors in 1.820 seconds.
Tearing down left over layers:
  Tear down zope.testrunner.layer.UnitTests in 0.000 seconds.
Total: 615 tests, 0 failures, 0 errors in 46.194 seconds.
Running Testing.ZopeTestCase.layer.ZopeLite tests:
  Set up Testing.ZopeTestCase.layer.ZopeLite in 0.042 seconds.
  Ran 230 tests with 0 failures and 0 errors in 0.901 seconds.
Running Products.CMFCore.testing.EventZCMLLayer tests:
  Set up Products.CMFCore.testing.EventZCMLLayer in 0.000 seconds.
  Ran 8 tests with 0 failures and 0 errors in 0.158 seconds.
Running Products.CMFCore.testing.TraversingEventZCMLLayer tests:
  Tear down Products.CMFCore.testing.EventZCMLLayer in 0.000 seconds.
  Set up Products.CMFCore.testing.TraversingEventZCMLLayer in 0.000 seconds.
  Ran 7 tests with 0 failures and 0 errors in 0.247 seconds.
Running Products.CMFDefault.testing.FunctionalLayer tests:
  Tear down Products.CMFCore.testing.TraversingEventZCMLLayer in 0.000 seconds.
  Set up Products.CMFCore.testing.FunctionalZCMLLayer in 0.130 seconds.
  Set up Products.CMFDefault.testing.FunctionalLayer in 0.251 seconds.
  Ran 32 tests with 0 failures and 0 errors in 3.289 seconds.
Running Products.CMFUid.testing.UidEventZCMLLayer tests:
  Tear down Products.CMFDefault.testing.FunctionalLayer in 0.011 seconds.
  Tear down Products.CMFCore.testing.FunctionalZCMLLayer in 0.001 seconds.
  Set up Products.CMFUid.testing.UidEventZCMLLayer in 0.000 seconds.
  Ran 12 tests with 0 failures and 0 errors in 0.236 seconds.
Running Products.DCWorkflow.testing.ExportImportZCMLLayer tests:
  Tear down Products.CMFUid.testing.UidEventZCMLLayer in 0.000 seconds.
  Set up Products.DCWorkflow.testing.ExportImportZCMLLayer in 0.110 seconds.
  Ran 42 tests with 0 failures and 0 errors in 0.623 seconds.
Running Products.GenericSetup.testing.ExportImportZCMLLayer tests:
  Tear down Products.DCWorkflow.testing.ExportImportZCMLLayer in 0.000 seconds.
  Set up Products.GenericSetup.testing.ExportImportZCMLLayer in 0.035 seconds.
  Ran 208 tests with 0 failures and 0 errors in 0.538 seconds.
Running zope.testrunner.layer.UnitTests tests:
  Tear down Products.GenericSetup.testing.ExportImportZCMLLayer in 0.000 seconds.
  Tear down Testing.ZopeTestCase.layer.ZopeLite in 0.000 seconds.
  Set up zope.testrunner.layer.UnitTests in 0.000 seconds.
  Ran 237 tests with 0 failures and 0 errors in 0.223 seconds.
Tearing down left over layers:
  Tear down zope.testrunner.layer.UnitTests in 0.000 seconds.
Total: 776 tests, 0 failures, 0 errors in 7.414 seconds.
/home/jenkins/.buildout/eggs/setuptools-1.3.2-py2.7.egg/pkg_resources.py:979: UserWarning: /home/jenkins/.python-eggs is writable by group/others and vulnerable to attack when used with get_resource_filename. Consider a more secure location (set with .set_extraction_path or the PYTHON_EGG_CACHE environment variable).
  warnings.warn(msg, UserWarning)
Running Testing.ZopeTestCase.layer.ZopeLite tests:
  Set up Testing.ZopeTestCase.layer.ZopeLite in 0.526 seconds.
  Ran 27 tests with 0 failures and 0 errors in 0.045 seconds.
Running Products.PloneTestCase.layer.PloneSite tests:
  Set up Products.PloneTestCase.layer.ZCML in 4.147 seconds.
  Set up Products.PloneTestCase.layer.PloneSite in 5.021 seconds.
  Ran 139 tests with 0 failures and 0 errors in 18.595 seconds.
Running Products.CMFDiffTool.testing.PackageLayer tests:
  Set up collective.testcaselayer.ptc.PTCLayer in 0.018 seconds.
  Set up collective.testcaselayer.mail.MockMailHostLayer in 0.321 seconds.
  Set up collective.testcaselayer.common.CommonPTCLayer in 0.004 seconds.
  Set up Products.CMFDiffTool.testing.PackageLayer in 0.018 seconds.
  Ran 8 tests with 0 failures and 0 errors in 0.591 seconds.
Running Products.CMFDiffTool.tests.BaseTestCase.CMFDiffToolLayer tests:
  Tear down Products.CMFDiffTool.testing.PackageLayer in 0.000 seconds.
  Tear down collective.testcaselayer.common.CommonPTCLayer in 0.000 seconds.
  Tear down collective.testcaselayer.mail.MockMailHostLayer in 0.000 seconds.
  Tear down collective.testcaselayer.ptc.PTCLayer in 0.000 seconds.
  Set up Products.CMFDiffTool.tests.BaseTestCase.CMFDiffToolLayer in 0.011 seconds.
  Ran 2 tests with 0 failures and 0 errors in 0.183 seconds.
Running Products.CMFTestCase.layer.CMFSite tests:
  Tear down Products.CMFDiffTool.tests.BaseTestCase.CMFDiffToolLayer in 0.101 seconds.
  Tear down Products.PloneTestCase.layer.PloneSite in 0.005 seconds.
  Tear down Products.PloneTestCase.layer.ZCML in 0.002 seconds.
  Set up Products.CMFTestCase.layer.ZCML in 3.242 seconds.
  Set up Products.CMFTestCase.layer.CMFSite in 1.144 seconds.
  Ran 20 tests with 0 failures and 0 errors in 0.328 seconds.
Running plone.app.blob.tests.layer.BlobReplacementLayer tests:
  Tear down Products.CMFTestCase.layer.CMFSite in 0.028 seconds.
  Tear down Products.CMFTestCase.layer.ZCML in 0.002 seconds.
  Set up Products.PloneTestCase.layer.ZCML in 3.261 seconds.
  Set up Products.PloneTestCase.layer.PloneSite in 4.113 seconds.
  Set up plone.app.blob.tests.layer.BlobLayer in 0.051 seconds.
  Set up plone.app.blob.tests.layer.BlobReplacementLayer in 0.087 seconds.
  Ran 7 tests with 0 failures and 0 errors in 1.896 seconds.
Running zope.testrunner.layer.UnitTests tests:
  Tear down plone.app.blob.tests.layer.BlobReplacementLayer in 0.000 seconds.
  Tear down plone.app.blob.tests.layer.BlobLayer in 0.000 seconds.
  Tear down Products.PloneTestCase.layer.PloneSite in 0.109 seconds.
  Tear down Products.PloneTestCase.layer.ZCML in 0.003 seconds.
  Tear down Testing.ZopeTestCase.layer.ZopeLite in 0.000 seconds.
  Set up zope.testrunner.layer.UnitTests in 0.000 seconds.
  Ran 8 tests with 0 failures and 0 errors in 0.018 seconds.
Tearing down left over layers:
  Tear down zope.testrunner.layer.UnitTests in 0.000 seconds.
Total: 211 tests, 0 failures, 0 errors in 45.136 seconds.
/home/jenkins/.buildout/eggs/setuptools-1.3.2-py2.7.egg/pkg_resources.py:979: UserWarning: /home/jenkins/.python-eggs is writable by group/others and vulnerable to attack when used with get_resource_filename. Consider a more secure location (set with .set_extraction_path or the PYTHON_EGG_CACHE environment variable).
  warnings.warn(msg, UserWarning)
Running Testing.ZopeTestCase.layer.ZopeLite tests:
  Set up Testing.ZopeTestCase.layer.ZopeLite in 0.537 seconds.
  Ran 5 tests with 0 failures and 0 errors in 4.857 seconds.
Running Products.PloneTestCase.layer.PloneSite tests:
  Set up Products.PloneTestCase.layer.ZCML in 4.018 seconds.
  Set up Products.PloneTestCase.layer.PloneSite in 4.367 seconds.
  Ran 3 tests with 0 failures and 0 errors in 2.756 seconds.
Running plone.app.textfield.tests.IntegrationTestLayer tests:
  Set up collective.testcaselayer.ptc.PTCLayer in 0.018 seconds.
  Set up plone.app.textfield.tests.IntegrationTestLayer in 0.003 seconds.
  Ran 7 tests with 0 failures and 0 errors in 0.073 seconds.
Running plone.app.textfield.tests.UnitTestLayer tests:
  Tear down plone.app.textfield.tests.IntegrationTestLayer in 0.000 seconds.
  Tear down collective.testcaselayer.ptc.PTCLayer in 0.000 seconds.
  Tear down Products.PloneTestCase.layer.PloneSite in 0.085 seconds.
  Tear down Products.PloneTestCase.layer.ZCML in 0.002 seconds.
  Tear down Testing.ZopeTestCase.layer.ZopeLite in 0.000 seconds.
  Set up plone.app.textfield.tests.UnitTestLayer in 0.000 seconds.
  Ran 3 tests with 0 failures and 0 errors in 0.043 seconds.
Running plone.app.z3cform.tests.layer.InlineValidationTestLayer tests:
  Tear down plone.app.textfield.tests.UnitTestLayer in 0.000 seconds.
  Set up plone.app.z3cform.tests.layer.InlineValidationTestLayer in 0.225 seconds.
  Ran 13 tests with 0 failures and 0 errors in 0.022 seconds.
Running plone.app.z3cform.tests.layer.IntegrationTestLayer tests:
  Tear down plone.app.z3cform.tests.layer.InlineValidationTestLayer in 0.002 seconds.
  Set up Testing.ZopeTestCase.layer.ZopeLite in 0.002 seconds.
  Set up Products.PloneTestCase.layer.ZCML in 3.260 seconds.
  Set up Products.PloneTestCase.layer.PloneSite in 3.475 seconds.
  Set up collective.testcaselayer.ptc.PTCLayer in 0.019 seconds.
  Set up plone.app.z3cform.tests.layer.IntegrationTestLayer in 0.004 seconds.
  Ran 2 tests with 0 failures and 0 errors in 0.081 seconds.
Running plone.app.z3cform.tests.layer.plone.app.z3cform:Acceptance tests:
  Tear down plone.app.z3cform.tests.layer.IntegrationTestLayer in 0.001 seconds.
  Tear down collective.testcaselayer.ptc.PTCLayer in 0.000 seconds.
  Tear down Products.PloneTestCase.layer.PloneSite in 0.085 seconds.
  Tear down Products.PloneTestCase.layer.ZCML in 0.004 seconds.
  Tear down Testing.ZopeTestCase.layer.ZopeLite in 0.000 seconds.
  Set up plone.testing.zca.LayerCleanup in 0.002 seconds.
  Set up plone.testing.z2.Startup in 0.079 seconds.
  Set up plone.app.testing.layers.PloneFixture in 4.920 seconds.
  Set up plone.app.z3cform.tests.layer.FunctionalLayer in 0.026 seconds.
  Set up plone.testing.z2.ZServer in 0.502 seconds.
  Set up plone.app.z3cform.tests.layer.plone.app.z3cform:Acceptance in 0.000 seconds.
  Ran 1 tests with 0 failures and 0 errors in 12.356 seconds.
Running plone.folder.tests.layer.PloneFolderLayer tests:
  Tear down plone.app.z3cform.tests.layer.plone.app.z3cform:Acceptance in 0.000 seconds.
  Tear down plone.testing.z2.ZServer in 5.376 seconds.
  Tear down plone.app.z3cform.tests.layer.FunctionalLayer in 0.002 seconds.
  Tear down plone.app.testing.layers.PloneFixture in 0.059 seconds.
  Tear down plone.testing.z2.Startup in 0.004 seconds.
  Tear down plone.testing.zca.LayerCleanup in 0.003 seconds.
  Set up plone.folder.tests.layer.PloneFolderLayer in 0.005 seconds.
  Ran 67 tests with 0 failures and 0 errors in 0.088 seconds.
Running plone.namedfile.tests.base.NamedFileLayer tests:
  Tear down plone.folder.tests.layer.PloneFolderLayer in 0.000 seconds.
  Set up Testing.ZopeTestCase.layer.ZopeLite in 0.002 seconds.
  Set up plone.namedfile.tests.base.NamedFileLayer in 0.029 seconds.
  Ran 33 tests with 0 failures and 0 errors in 0.163 seconds.
Running plone.schemaeditor.testing.ACCEPTANCE tests:
  Tear down plone.namedfile.tests.base.NamedFileLayer in 0.002 seconds.
  Tear down Testing.ZopeTestCase.layer.ZopeLite in 0.000 seconds.
  Set up plone.testing.zca.LayerCleanup in 0.001 seconds.
  Set up plone.testing.z2.Startup in 0.079 seconds.
  Set up plone.app.testing.layers.PloneFixture in 5.248 seconds.
  Set up plone.schemaeditor.testing.ROBOT/home/jenkins/.buildout/eggs/zope.configuration-3.7.4-py2.7.egg/zope/configuration/fields.py:417: UserWarning: You did not specify an i18n translation domain for the 'description' field in /home/jenkins/workspace/plone-5.0-python-2.7/src/plone.schemaeditor/plone/schemaeditor/tests/robot_testing.zcml
  "'%s' field in %s" % (self.getName(), context.info.file )
/home/jenkins/.buildout/eggs/zope.configuration-3.7.4-py2.7.egg/zope/configuration/fields.py:417: UserWarning: You did not specify an i18n translation domain for the 'title' field in /home/jenkins/workspace/plone-5.0-python-2.7/src/plone.schemaeditor/plone/schemaeditor/tests/robot_testing.zcml
  "'%s' field in %s" % (self.getName(), context.info.file )
 in 0.579 seconds.
  Set up plone.app.robotframework.remote.AutoLoginRemoteLibrary:RobotRemote in 0.003 seconds.
  Set up plone.testing.z2.ZServer in 0.501 seconds.
  Set up plone.schemaeditor.testing.ACCEPTANCE in 0.000 seconds.
  Ran 6 tests with 0 failures and 0 errors in 2 minutes 25.006 seconds.
Running plone.z3cform.tests.plone.z3cform:Functional tests:
  Tear down plone.schemaeditor.testing.ACCEPTANCE in 0.000 seconds.
  Tear down plone.schemaeditor.testing.ROBOT in 0.003 seconds.
  Tear down plone.testing.z2.ZServer in 5.081 seconds.
  Tear down plone.app.robotframework.remote.AutoLoginRemoteLibrary:RobotRemote in 0.003 seconds.
  Tear down plone.app.testing.layers.PloneFixture in 0.059 seconds.
  Set up plone.z3cform.tests.P3FLayer in 0.082 seconds.
  Set up plone.z3cform.tests.plone.z3cform:Functional in 0.000 seconds.
  Ran 4 tests with 0 failures and 0 errors in 0.802 seconds.
Running zope.testrunner.layer.UnitTests tests:
  Tear down plone.z3cform.tests.plone.z3cform:Functional in 0.000 seconds.
  Tear down plone.z3cform.tests.P3FLayer in 0.000 seconds.
  Tear down plone.testing.z2.Startup in 0.005 seconds.
  Tear down plone.testing.zca.LayerCleanup in 0.003 seconds.
  Set up zope.testrunner.layer.UnitTests in 0.000 seconds.
  Ran 123 tests with 0 failures and 0 errors in 0.924 seconds.
Tearing down left over layers:
  Tear down zope.testrunner.layer.UnitTests in 0.000 seconds.
Total: 267 tests, 0 failures, 0 errors in 3 minutes 28.464 seconds.
/home/jenkins/.buildout/eggs/setuptools-1.3.2-py2.7.egg/pkg_resources.py:979: UserWarning: /home/jenkins/.python-eggs is writable by group/others and vulnerable to attack when used with get_resource_filename. Consider a more secure location (set with .set_extraction_path or the PYTHON_EGG_CACHE environment variable).
  warnings.warn(msg, UserWarning)
Running Products.CMFTestCase.layer.CMFSite tests:
  Set up Testing.ZopeTestCase.layer.ZopeLite in 0.398 seconds.
  Set up Products.CMFTestCase.layer.ZCML in 4.132 seconds.
  Set up Products.CMFTestCase.layer.CMFSite in 0.178 seconds.
  Ran 31 tests with 0 failures and 0 errors in 1.967 seconds.
Running Products.CMFQuickInstallerTool.tests.test_install.QILayer tests:
  Set up Products.CMFQuickInstallerTool.tests.test_install.QILayer in 0.003 seconds.
  Ran 3 tests with 0 failures and 0 errors in 2.743 seconds.
Running Products.PloneTestCase.layer.PloneSite tests:
  Tear down Products.CMFQuickInstallerTool.tests.test_install.QILayer in 0.002 seconds.
  Tear down Products.CMFTestCase.layer.CMFSite in 0.014 seconds.
  Tear down Products.CMFTestCase.layer.ZCML in 0.002 seconds.
  Set up Products.PloneTestCase.layer.ZCML in 3.234 seconds.
  Set up Products.PloneTestCase.layer.PloneSite in 4.029 seconds.


Failure in test /home/jenkins/workspace/plone-5.0-python-2.7/src/plone.app.controlpanel/plone/app/controlpanel/tests/security.txt
Failed doctest test for security.txt
  File "/home/jenkins/workspace/plone-5.0-python-2.7/src/plone.app.controlpanel/plone/app/controlpanel/tests/security.txt", line 0

----------------------------------------------------------------------
File "/home/jenkins/workspace/plone-5.0-python-2.7/src/plone.app.controlpanel/plone/app/controlpanel/tests/security.txt", line 74, in security.txt
Failed example:
    user_id == 'newie'
Expected:
    False
Got:
    True
----------------------------------------------------------------------
File "/home/jenkins/workspace/plone-5.0-python-2.7/src/plone.app.controlpanel/plone/app/controlpanel/tests/security.txt", line 78, in security.txt
Failed example:
    from plone.app.users.utils import uuid_userid_generator
Exception raised:
    Traceback (most recent call last):
      File "/usr/lib/python2.7/doctest.py", line 1289, in __run
        compileflags, 1) in test.globs
      File "<doctest security.txt[34]>", line 1, in <module>
        from plone.app.users.utils import uuid_userid_generator
    ImportError: No module named utils
----------------------------------------------------------------------
File "/home/jenkins/workspace/plone-5.0-python-2.7/src/plone.app.controlpanel/plone/app/controlpanel/tests/security.txt", line 79, in security.txt
Failed example:
    len(user_id) == len(uuid_userid_generator())
Exception raised:
    Traceback (most recent call last):
      File "/usr/lib/python2.7/doctest.py", line 1289, in __run
        compileflags, 1) in test.globs
      File "<doctest security.txt[35]>", line 1, in <module>
        len(user_id) == len(uuid_userid_generator())
    NameError: name 'uuid_userid_generator' is not defined
----------------------------------------------------------------------
File "/home/jenkins/workspace/plone-5.0-python-2.7/src/plone.app.controlpanel/plone/app/controlpanel/tests/security.txt", line 126, in security.txt
Failed example:
    browser.getControl('Register').click()
Exception raised:
    Traceback (most recent call last):
      File "/usr/lib/python2.7/doctest.py", line 1289, in __run
        compileflags, 1) in test.globs
      File "<doctest security.txt[58]>", line 1, in <module>
        browser.getControl('Register').click()
      File "/home/jenkins/.buildout/eggs/zope.testbrowser-3.11.1-py2.7.egg/zope/testbrowser/browser.py", line 639, in click
        self.browser._clickSubmit(self.mech_form, self.mech_control, (1,1))
      File "/home/jenkins/.buildout/eggs/zope.testbrowser-3.11.1-py2.7.egg/zope/testbrowser/browser.py", line 418, in _clickSubmit
        label=label, coord=coord)
      File "build/bdist.linux-i686/egg/mechanize/_mechanize.py", line 541, in submit
      File "build/bdist.linux-i686/egg/mechanize/_mechanize.py", line 203, in open
      File "build/bdist.linux-i686/egg/mechanize/_mechanize.py", line 255, in _mech_open
    HTTPError: HTTP Error 500: Internal Server Error
----------------------------------------------------------------------
File "/home/jenkins/workspace/plone-5.0-python-2.7/src/plone.app.controlpanel/plone/app/controlpanel/tests/security.txt", line 127, in security.txt
Failed example:
    len(pas.searchUsers(name='UserTwo at Example.Com'))
Expected:
    1
Got:
    0
----------------------------------------------------------------------
File "/home/jenkins/workspace/plone-5.0-python-2.7/src/plone.app.controlpanel/plone/app/controlpanel/tests/security.txt", line 130, in security.txt
Failed example:
    user.getId()
Exception raised:
    Traceback (most recent call last):
      File "/usr/lib/python2.7/doctest.py", line 1289, in __run
        compileflags, 1) in test.globs
      File "<doctest security.txt[61]>", line 1, in <module>
        user.getId()
    AttributeError: 'NoneType' object has no attribute 'getId'
----------------------------------------------------------------------
File "/home/jenkins/workspace/plone-5.0-python-2.7/src/plone.app.controlpanel/plone/app/controlpanel/tests/security.txt", line 132, in security.txt
Failed example:
    user.getUserName()
Exception raised:
    Traceback (most recent call last):
      File "/usr/lib/python2.7/doctest.py", line 1289, in __run
        compileflags, 1) in test.globs
      File "<doctest security.txt[62]>", line 1, in <module>
        user.getUserName()
    AttributeError: 'NoneType' object has no attribute 'getUserName'



Failure in test test_user_registration_form_blocks_escalation (plone.app.controlpanel.tests.test_siteadmin_role.TestSiteAdministratorRoleFunctional)
Traceback (most recent call last):
  File "/usr/lib/python2.7/unittest/case.py", line 327, in run
    testMethod()
  File "/home/jenkins/workspace/plone-5.0-python-2.7/src/plone.app.controlpanel/plone/app/controlpanel/tests/test_siteadmin_role.py", line 215, in test_user_registration_form_blocks_escalation
    self.assertNotEqual(200, res.status)
  File "/usr/lib/python2.7/unittest/case.py", line 520, in assertNotEqual
    raise self.failureException(msg)
AssertionError: 200 == 200

/home/jenkins/.buildout/eggs/Products.CMFCore-2.2.7-py2.7.egg/Products/CMFCore/DirectoryView.py:493: UserWarning: DirectoryView classic_ecmascript refers to a non-existing path 'plonetheme.classic:skins/classic_ecmascript'
  (self.id, reg_key), UserWarning)
  Ran 261 tests with 2 failures and 0 errors in 1 minutes 34.186 seconds.
Running plone.app.contentrules.tests.test_configuration.TestContentrulesGSLayer tests:
  Set up plone.app.contentrules.tests.test_configuration.TestContentrulesGSLayer in 0.003 seconds.
  Ran 7 tests with 2 failures and 0 errors in 3.267 seconds.
Running plone.app.customerize.tests.layer.PloneCustomerize tests:
  Tear down plone.app.contentrules.tests.test_configuration.TestContentrulesGSLayer in 0.000 seconds.
  Set up plone.app.customerize.tests.layer.PloneCustomerize in 0.010 seconds.
  Ran 2 tests with 2 failures and 0 errors in 3.047 seconds.
Running plone.app.testing.layers.Plone:Integration tests:
  Tear down plone.app.customerize.tests.layer.PloneCustomerize in 0.000 seconds.
  Tear down Products.PloneTestCase.layer.PloneSite in 0.091 seconds.
  Tear down Products.PloneTestCase.layer.ZCML in 0.003 seconds.
  Tear down Testing.ZopeTestCase.layer.ZopeLite in 0.000 seconds.
  Set up plone.testing.zca.LayerCleanup in 0.000 seconds.
  Set up plone.testing.z2.Startup in 0.088 seconds.
  Set up plone.app.testing.layers.PloneFixture in 4.975 seconds.
  Set up plone.app.testing.layers.Plone:Integration in 0.000 seconds.
  Ran 2 tests with 2 failures and 0 errors in 0.014 seconds.
Running plone.app.upgrade.tests.base.FunctionalUpgradeLayer tests:
  Tear down plone.app.testing.layers.Plone:Integration in 0.000 seconds.
  Tear down plone.app.testing.layers.PloneFixture in 0.060 seconds.
  Tear down plone.testing.z2.Startup in 0.005 seconds.
  Tear down plone.testing.zca.LayerCleanup in 0.001 seconds.
  Set up Testing.ZopeTestCase.layer.ZopeLite in 0.006 seconds.
  Set up Products.PloneTestCase.layer.ZCML in 3.339 seconds.
  Set up Products.PloneTestCase.layer.PloneSite in 3.660 seconds.
  Set up plone.app.upgrade.tests.base.FunctionalUpgradeLayer in 0.000 seconds.
  Ran 13 tests with 2 failures and 0 errors in 2 minutes 21.873 seconds.
Running zope.testrunner.layer.UnitTests tests:
  Tear down plone.app.upgrade.tests.base.FunctionalUpgradeLayer in 0.000 seconds.
  Tear down Products.PloneTestCase.layer.PloneSite in 0.097 seconds.
  Tear down Products.PloneTestCase.layer.ZCML in 0.003 seconds.
  Tear down Testing.ZopeTestCase.layer.ZopeLite in 0.000 seconds.
  Set up zope.testrunner.layer.UnitTests in 0.000 seconds.
  Ran 55 tests with 2 failures and 0 errors in 0.605 seconds.
Tearing down left over layers:
  Tear down zope.testrunner.layer.UnitTests in 0.000 seconds.
Total: 374 tests, 2 failures, 0 errors in 4 minutes 34.140 seconds.
/home/jenkins/.buildout/eggs/setuptools-1.3.2-py2.7.egg/pkg_resources.py:979: UserWarning: /home/jenkins/.python-eggs is writable by group/others and vulnerable to attack when used with get_resource_filename. Consider a more secure location (set with .set_extraction_path or the PYTHON_EGG_CACHE environment variable).
  warnings.warn(msg, UserWarning)
Running Testing.ZopeTestCase.layer.ZopeLite tests:
  Set up Testing.ZopeTestCase.layer.ZopeLite in 0.060 seconds.
  Ran 168 tests with 0 failures and 0 errors in 0.553 seconds.
Running plone.app.testing.bbb.PloneTestCase:Functional tests:
  Tear down Testing.ZopeTestCase.layer.ZopeLite in 0.000 seconds.
  Set up plone.testing.zca.LayerCleanup in 0.000 seconds.
  Set up plone.testing.z2.Startup in 0.092 seconds.
  Set up plone.app.testing.layers.PloneFixture in 8.009 seconds.
  Set up plone.app.testing.bbb.PloneTestCaseFixture in 2.297 seconds.
  Set up plone.app.testing.bbb.PloneTestCase:Functional in 0.000 seconds.
  Ran 161 tests with 0 failures and 0 errors in 3.510 seconds.
Running zope.testrunner.layer.UnitTests tests:
  Tear down plone.app.testing.bbb.PloneTestCase:Functional in 0.000 seconds.
  Tear down plone.app.testing.bbb.PloneTestCaseFixture in 0.006 seconds.
  Tear down plone.app.testing.layers.PloneFixture in 0.059 seconds.
  Tear down plone.testing.z2.Startup in 0.005 seconds.
  Tear down plone.testing.zca.LayerCleanup in 0.002 seconds.
  Set up zope.testrunner.layer.UnitTests in 0.000 seconds.
  Ran 417 tests with 0 failures and 0 errors in 0.174 seconds.
Tearing down left over layers:
  Tear down zope.testrunner.layer.UnitTests in 0.000 seconds.
Total: 746 tests, 0 failures, 0 errors in 15.201 seconds.
/home/jenkins/.buildout/eggs/setuptools-1.3.2-py2.7.egg/pkg_resources.py:979: UserWarning: /home/jenkins/.python-eggs is writable by group/others and vulnerable to attack when used with get_resource_filename. Consider a more secure location (set with .set_extraction_path or the PYTHON_EGG_CACHE environment variable).
  warnings.warn(msg, UserWarning)
Running Testing.ZopeTestCase.layer.ZopeLite tests:
  Set up Testing.ZopeTestCase.layer.ZopeLite in 0.000 seconds.
  Ran 2 tests with 0 failures and 0 errors in 0.009 seconds.
Running Products.PloneTestCase.layer.PloneSite tests:
  Set up Products.PloneTestCase.layer.ZCML in 3.201 seconds.
  Set up Products.PloneTestCase.layer.PloneSite in 4.119 seconds.
  Ran 23 tests with 0 failures and 0 errors in 38.088 seconds.
Running archetypes.referencebrowserwidget.tests.base.layer tests:
  Set up archetypes.referencebrowserwidget.tests.base.layer in 0.000 seconds.
  Ran 39 tests with 0 failures and 0 errors in 7.957 seconds.
Running archetypes.schemaextender.tests.base.layer tests:
  Tear down archetypes.referencebrowserwidget.tests.base.layer in 0.000 seconds.
  Set up archetypes.schemaextender.tests.base.layer in 0.000 seconds.
  Ran 4 tests with 0 failures and 0 errors in 1.577 seconds.
Running plone.app.folder.tests.layer.IntegrationLayer tests:
  Tear down archetypes.schemaextender.tests.base.layer in 0.000 seconds.
  Set up plone.app.folder.tests.layer.IntegrationLayer in 0.042 seconds.
  Ran 27 tests with 0 failures and 0 errors in 5.642 seconds.
Running plone.app.folder.tests.layer.PartialOrderingIntegrationLayer tests:
  Set up plone.app.folder.tests.layer.PartialOrderingIntegrationLayer in 0.000 seconds.
  Ran 3 tests with 0 failures and 0 errors in 0.255 seconds.
Running plone.app.querystring.tests.base.QuerystringInstalled tests:
  Tear down plone.app.folder.tests.layer.PartialOrderingIntegrationLayer in 0.000 seconds.
  Tear down plone.app.folder.tests.layer.IntegrationLayer in 0.000 seconds.
  Set up collective.testcaselayer.ptc.PTCLayer in 0.019 seconds.
  Set up collective.testcaselayer.mail.MockMailHostLayer in 0.304 seconds.
  Set up collective.testcaselayer.common.CommonPTCLayer in 0.004 seconds.
  Set up collective.testcaselayer.ptc.BasePTCLayer in 0.004 seconds.
  Set up plone.app.querystring.tests.base.QuerystringInstalled in 0.004 seconds.
  Ran 7 tests with 0 failures and 0 errors in 0.074 seconds.
Running plone.app.querystring.tests.base.RealGSProfile tests:
  Set up plone.app.querystring.tests.base.RealGSProfile in 0.588 seconds.
  Ran 12 tests with 0 failures and 0 errors in 0.833 seconds.
Running plone.app.querystring.tests.base.RegistryLayer tests:
  Tear down plone.app.querystring.tests.base.RealGSProfile in 0.000 seconds.
  Tear down plone.app.querystring.tests.base.QuerystringInstalled in 0.000 seconds.
  Tear down collective.testcaselayer.ptc.BasePTCLayer in 0.000 seconds.
  Tear down collective.testcaselayer.common.CommonPTCLayer in 0.000 seconds.
  Tear down collective.testcaselayer.mail.MockMailHostLayer in 0.000 seconds.
  Tear down collective.testcaselayer.ptc.PTCLayer in 0.000 seconds.
  Tear down Products.PloneTestCase.layer.PloneSite in 0.100 seconds.
  Tear down Products.PloneTestCase.layer.ZCML in 0.003 seconds.
  Tear down Testing.ZopeTestCase.layer.ZopeLite in 0.000 seconds.
  Set up plone.app.querystring.tests.base.UnittestLayer in 0.000 seconds.
  Set up plone.app.querystring.tests.base.RegistryLayer in 0.000 seconds.
  Ran 15 tests with 0 failures and 0 errors in 0.007 seconds.
Running plone.app.querystring.tests.base.TestGSProfile tests:
  Tear down plone.app.querystring.tests.base.RegistryLayer in 0.000 seconds.
  Tear down plone.app.querystring.tests.base.UnittestLayer in 0.000 seconds.
  Set up Testing.ZopeTestCase.layer.ZopeLite in 0.000 seconds.
  Set up Products.PloneTestCase.layer.ZCML in 3.274 seconds.
  Set up Products.PloneTestCase.layer.PloneSite in 3.387 seconds.
  Set up collective.testcaselayer.ptc.PTCLayer in 0.018 seconds.
  Set up collective.testcaselayer.mail.MockMailHostLayer in 0.306 seconds.
  Set up collective.testcaselayer.common.CommonPTCLayer in 0.005 seconds.
  Set up collective.testcaselayer.ptc.BasePTCLayer in 0.004 seconds.
  Set up plone.app.querystring.tests.base.QuerystringInstalled in 0.004 seconds.
  Set up plone.app.querystring.tests.base.TestGSProfile in 0.533 seconds.
  Ran 3 tests with 0 failures and 0 errors in 0.029 seconds.
Running plone.app.testing.bbb.PloneTestCase:Functional tests:
  Tear down plone.app.querystring.tests.base.TestGSProfile in 0.000 seconds.
  Tear down plone.app.querystring.tests.base.QuerystringInstalled in 0.000 seconds.
  Tear down collective.testcaselayer.ptc.BasePTCLayer in 0.000 seconds.
  Tear down collective.testcaselayer.common.CommonPTCLayer in 0.000 seconds.
  Tear down collective.testcaselayer.mail.MockMailHostLayer in 0.000 seconds.
  Tear down collective.testcaselayer.ptc.PTCLayer in 0.000 seconds.
  Tear down Products.PloneTestCase.layer.PloneSite in 0.092 seconds.
  Tear down Products.PloneTestCase.layer.ZCML in 0.003 seconds.
  Tear down Testing.ZopeTestCase.layer.ZopeLite in 0.000 seconds.
  Set up plone.testing.zca.LayerCleanup in 0.000 seconds.
  Set up plone.testing.z2.Startup in 0.081 seconds.
  Set up plone.app.testing.layers.PloneFixture in 4.942 seconds.
  Set up plone.app.testing.bbb.PloneTestCaseFixture in 1.819 seconds.
  Set up plone.app.testing.bbb.PloneTestCase:Functional in 0.000 seconds.
  Ran 4 tests with 0 failures and 0 errors in 1.453 seconds.
Running plone.browserlayer.tests.test_doctest.PloneBrowserLayerLayer tests:
  Tear down plone.app.testing.bbb.PloneTestCase:Functional in 0.000 seconds.
  Tear down plone.app.testing.bbb.PloneTestCaseFixture in 0.006 seconds.
  Tear down plone.app.testing.layers.PloneFixture in 0.057 seconds.
  Tear down plone.testing.z2.Startup in 0.004 seconds.
  Tear down plone.testing.zca.LayerCleanup in 0.002 seconds.
  Set up Testing.ZopeTestCase.layer.ZopeLite in 0.095 seconds.
  Set up Products.PloneTestCase.layer.ZCML in 3.311 seconds.
  Set up Products.PloneTestCase.layer.PloneSite in 3.858 seconds.
  Set up plone.browserlayer.tests.test_doctest.PloneBrowserLayerLayer in 0.006 seconds.
  Ran 1 tests with 0 failures and 0 errors in 1.659 seconds.
Running plone.outputfilters.tests.base.layer tests:
  Tear down plone.browserlayer.tests.test_doctest.PloneBrowserLayerLayer in 0.000 seconds.
  Set up plone.outputfilters.tests.base.layer in 0.000 seconds.
  Ran 47 tests with 0 failures and 0 errors in 7.308 seconds.
Running plone.theme.tests.test_doctest.PloneThemeLayer tests:
  Tear down plone.outputfilters.tests.base.layer in 0.000 seconds.
  Set up plone.theme.tests.test_doctest.PloneThemeLayer in 0.004 seconds.
  Ran 1 tests with 0 failures and 0 errors in 0.094 seconds.
Running plonetheme.sunburst.tests.base.PloneTestCase:Functional tests:
  Tear down plone.theme.tests.test_doctest.PloneThemeLayer in 0.000 seconds.
  Tear down Products.PloneTestCase.layer.PloneSite in 0.093 seconds.
  Tear down Products.PloneTestCase.layer.ZCML in 0.003 seconds.
  Tear down Testing.ZopeTestCase.layer.ZopeLite in 0.000 seconds.
  Set up plone.testing.zca.LayerCleanup in 0.000 seconds.
  Set up plone.testing.z2.Startup in 0.080 seconds.
  Set up plone.app.testing.layers.PloneFixture in 4.981 seconds.
  Set up plonetheme.sunburst.tests.base.SunburstFixture in 0.289 seconds.
  Set up plonetheme.sunburst.tests.base.PloneTestCase:Functional in 0.000 seconds.
  Ran 2 tests with 0 failures and 0 errors in 0.005 seconds.
Running zope.testrunner.layer.UnitTests tests:
  Tear down plonetheme.sunburst.tests.base.PloneTestCase:Functional in 0.000 seconds.
  Tear down plonetheme.sunburst.tests.base.SunburstFixture in 0.002 seconds.
  Tear down plone.app.testing.layers.PloneFixture in 0.059 seconds.
  Tear down plone.testing.z2.Startup in 0.005 seconds.
  Tear down plone.testing.zca.LayerCleanup in 0.002 seconds.
  Set up zope.testrunner.layer.UnitTests in 0.000 seconds.
  Ran 45 tests with 0 failures and 0 errors in 0.233 seconds.
Tearing down left over layers:
  Tear down zope.testrunner.layer.UnitTests in 0.000 seconds.
Total: 235 tests, 0 failures, 0 errors in 1 minutes 45.017 seconds.
/home/jenkins/.buildout/eggs/setuptools-1.3.2-py2.7.egg/pkg_resources.py:979: UserWarning: /home/jenkins/.python-eggs is writable by group/others and vulnerable to attack when used with get_resource_filename. Consider a more secure location (set with .set_extraction_path or the PYTHON_EGG_CACHE environment variable).
  warnings.warn(msg, UserWarning)
Running Products.PloneTestCase.layer.PloneSite tests:
  Set up Testing.ZopeTestCase.layer.ZopeLite in 0.505 seconds.
  Set up Products.PloneTestCase.layer.ZCML in 4.331 seconds.
  Set up Products.PloneTestCase.layer.PloneSite in 4.057 seconds.
  Ran 2 tests with 0 failures and 0 errors in 0.055 seconds.
Running zope.testrunner.layer.UnitTests tests:
  Tear down Products.PloneTestCase.layer.PloneSite in 0.090 seconds.
  Tear down Products.PloneTestCase.layer.ZCML in 0.002 seconds.
  Tear down Testing.ZopeTestCase.layer.ZopeLite in 0.000 seconds.
  Set up zope.testrunner.layer.UnitTests in 0.000 seconds.
  Ran 384 tests with 0 failures and 0 errors in 6.149 seconds.
Tearing down left over layers:
  Tear down zope.testrunner.layer.UnitTests in 0.000 seconds.
Total: 386 tests, 0 failures, 0 errors in 15.548 seconds.
/home/jenkins/.buildout/eggs/setuptools-1.3.2-py2.7.egg/pkg_resources.py:979: UserWarning: /home/jenkins/.python-eggs is writable by group/others and vulnerable to attack when used with get_resource_filename. Consider a more secure location (set with .set_extraction_path or the PYTHON_EGG_CACHE environment variable).
  warnings.warn(msg, UserWarning)
Running Products.CMFPlone.testing.CMFPloneLayer:Acceptance tests:
  Set up plone.testing.zca.LayerCleanup in 0.000 seconds.
  Set up plone.testing.z2.Startup in 0.176 seconds.
  Set up plone.app.testing.layers.PloneFixture in 6.896 seconds.
  Set up plone.app.event.testing.PAEventLayer in 0.988 seconds.
  Set up plone.app.contenttypes.testing.PloneAppContenttypes in 1.534 seconds.
  Set up Products.CMFPlone.testing.ProductsCMFPloneLayer in 0.087 seconds.
  Set up plone.app.robotframework.remote.CMFPloneRobotRemoteLibrary:RobotRemote in 0.004 seconds.
  Set up plone.testing.z2.ZServer in 0.502 seconds.
  Set up Products.CMFPlone.testing.CMFPloneLayer:Acceptance in 0.000 seconds.

==============================================================================
Test Overlays :: These tests are just testing the overlay behavior not the\...
==============================================================================
Scenario: Register user overlay remains on wrong data                 | FAIL |
Element 'name=form.buttons.register' did not appear in 30 seconds
------------------------------------------------------------------------------
Test Overlays :: These tests are just testing the overlay behavior... | FAIL |
1 critical test, 0 passed, 1 failed
1 test total, 0 passed, 1 failed
==============================================================================
Output:  /home/jenkins/workspace/plone-5.0-python-2.7/parts/jenkins-test/test_overlays/Scenario_Register_user_overlay_remains_on_wrong_data/output.xml
Log:     /home/jenkins/workspace/plone-5.0-python-2.7/parts/jenkins-test/test_overlays/Scenario_Register_user_overlay_remains_on_wrong_data/log.html
Report:  /home/jenkins/workspace/plone-5.0-python-2.7/parts/jenkins-test/test_overlays/Scenario_Register_user_overlay_remains_on_wrong_data/report.html



Failure in test Scenario Register user overlay remains on wrong data (test_overlays.robot)
Traceback (most recent call last):
  File "/home/jenkins/.buildout/eggs/unittest2-0.5.1-py2.7.egg/unittest2/case.py", line 340, in run
    testMethod()
  File "/home/jenkins/.buildout/eggs/robotsuite-1.4.1-py2.7.egg/robotsuite/__init__.py", line 395, in runTest
    assert last_status == 'PASS', last_message
AssertionError: Element 'name=form.buttons.register' did not appear in 30 seconds


==============================================================================
Test Overlays :: These tests are just testing the overlay behavior not the\...
==============================================================================
Scenario: New user overlay remains on wrong data                      | FAIL |
Element 'name=form.buttons.register' did not appear in 30 seconds
------------------------------------------------------------------------------
Test Overlays :: These tests are just testing the overlay behavior... | FAIL |
1 critical test, 0 passed, 1 failed
1 test total, 0 passed, 1 failed
==============================================================================
Output:  /home/jenkins/workspace/plone-5.0-python-2.7/parts/jenkins-test/test_overlays/Scenario_New_user_overlay_remains_on_wrong_data/output.xml
Log:     /home/jenkins/workspace/plone-5.0-python-2.7/parts/jenkins-test/test_overlays/Scenario_New_user_overlay_remains_on_wrong_data/log.html
Report:  /home/jenkins/workspace/plone-5.0-python-2.7/parts/jenkins-test/test_overlays/Scenario_New_user_overlay_remains_on_wrong_data/report.html



Failure in test Scenario New user overlay remains on wrong data (test_overlays.robot)
Traceback (most recent call last):
  File "/home/jenkins/.buildout/eggs/unittest2-0.5.1-py2.7.egg/unittest2/case.py", line 340, in run
    testMethod()
  File "/home/jenkins/.buildout/eggs/robotsuite-1.4.1-py2.7.egg/robotsuite/__init__.py", line 395, in runTest
    assert last_status == 'PASS', last_message
AssertionError: Element 'name=form.buttons.register' did not appear in 30 seconds


==============================================================================
Test Overlays :: These tests are just testing the overlay behavior not the\...
==============================================================================
Scenario: New user overlay closes on valid data                       | FAIL |
Element 'name=form.widgets.password_ctl' did not appear in 30 seconds
------------------------------------------------------------------------------
Test Overlays :: These tests are just testing the overlay behavior... | FAIL |
1 critical test, 0 passed, 1 failed
1 test total, 0 passed, 1 failed
==============================================================================
Output:  /home/jenkins/workspace/plone-5.0-python-2.7/parts/jenkins-test/test_overlays/Scenario_New_user_overlay_closes_on_valid_data/output.xml
Log:     /home/jenkins/workspace/plone-5.0-python-2.7/parts/jenkins-test/test_overlays/Scenario_New_user_overlay_closes_on_valid_data/log.html
Report:  /home/jenkins/workspace/plone-5.0-python-2.7/parts/jenkins-test/test_overlays/Scenario_New_user_overlay_closes_on_valid_data/report.html



Failure in test Scenario New user overlay closes on valid data (test_overlays.robot)
Traceback (most recent call last):
  File "/home/jenkins/.buildout/eggs/unittest2-0.5.1-py2.7.egg/unittest2/case.py", line 340, in run
    testMethod()
  File "/home/jenkins/.buildout/eggs/robotsuite-1.4.1-py2.7.egg/robotsuite/__init__.py", line 395, in runTest
    assert last_status == 'PASS', last_message
AssertionError: Element 'name=form.widgets.password_ctl' did not appear in 30 seconds

  Ran 39 tests with 3 failures and 0 errors in 10 minutes 18.098 seconds.
Running Products.CMFPlone.testing.CMFPloneLayer:Functional tests:
  Tear down Products.CMFPlone.testing.CMFPloneLayer:Acceptance in 0.000 seconds.
  Tear down plone.app.robotframework.remote.CMFPloneRobotRemoteLibrary:RobotRemote in 0.003 seconds.
  Tear down plone.testing.z2.ZServer in 4.632 seconds.
  Set up Products.CMFPlone.testing.CMFPloneLayer:Functional in 0.000 seconds.
  Ran 28 tests with 3 failures and 0 errors in 7.687 seconds.
Running archetypes.querywidget.tests.base.ArchetypesQueryWidget:Integration tests:
  Tear down Products.CMFPlone.testing.CMFPloneLayer:Functional in 0.000 seconds.
  Tear down Products.CMFPlone.testing.ProductsCMFPloneLayer in 0.021 seconds.
  Tear down plone.app.contenttypes.testing.PloneAppContenttypes in 0.096 seconds.
  Tear down plone.app.event.testing.PAEventLayer in 0.004 seconds.
  Set up archetypes.querywidget.tests.base.ArchetypesQueryWidgetLayer in 2.025 seconds.
  Set up archetypes.querywidget.tests.base.ArchetypesQueryWidget:Integration in 0.000 seconds.
  Ran 2 tests with 3 failures and 0 errors in 5.219 seconds.
Running collective.elephantvocabulary.testing.VocabularyLayer tests:
  Tear down archetypes.querywidget.tests.base.ArchetypesQueryWidget:Integration in 0.000 seconds.
  Tear down archetypes.querywidget.tests.base.ArchetypesQueryWidgetLayer in 0.002 seconds.
  Tear down plone.app.testing.layers.PloneFixture in 0.059 seconds.
  Tear down plone.testing.z2.Startup in 0.005 seconds.
  Set up collective.elephantvocabulary.testing.VocabularyLayer in 0.000 seconds.
  Ran 2 tests with 3 failures and 0 errors in 0.006 seconds.
Running plone.app.caching.testing.PloneAppCaching:Functional tests:
  Tear down collective.elephantvocabulary.testing.VocabularyLayer in 0.000 seconds.
  Set up plone.testing.z2.Startup in 0.078 seconds.
  Set up plone.app.testing.layers.PloneFixture in 6.555 seconds.
  Set up plone.app.event.testing.PAEventLayer in 0.704 seconds.
  Set up plone.app.contenttypes.testing.PloneAppContenttypes in 1.701 seconds.
  Set up plone.app.caching.testing.PloneAppCaching in 0.452 seconds.
  Set up plone.app.caching.testing.PloneAppCaching:Functional in 0.000 seconds.
  Ran 17 tests with 3 failures and 0 errors in 17.840 seconds.
Running plone.app.contentlisting.tests.base.ContentListing:Functional tests:
  Tear down plone.app.caching.testing.PloneAppCaching:Functional in 0.000 seconds.
  Tear down plone.app.caching.testing.PloneAppCaching in 0.003 seconds.
  Set up plone.app.contentlisting.tests.base.ContentListingLayer in 0.024 seconds.
  Set up plone.app.contentlisting.tests.base.ContentListing:Functional in 0.000 seconds.
  Ran 40 tests with 3 failures and 0 errors in 14.474 seconds.
Running plone.app.contenttypes.testing.PloneAppContenttypes:Functional tests:
  Tear down plone.app.contentlisting.tests.base.ContentListing:Functional in 0.000 seconds.
  Tear down plone.app.contentlisting.tests.base.ContentListingLayer in 0.002 seconds.
  Set up plone.app.contenttypes.testing.PloneAppContenttypes:Functional in 0.000 seconds.
  Ran 36 tests with 3 failures and 0 errors in 21.825 seconds.
Running plone.app.contenttypes.testing.PloneAppContenttypes:Integration tests:
  Tear down plone.app.contenttypes.testing.PloneAppContenttypes:Functional in 0.000 seconds.
  Set up plone.app.contenttypes.testing.PloneAppContenttypes:Integration in 0.000 seconds.
  Ran 83 tests with 3 failures and 0 errors in 11.785 seconds.
Running plone.app.contenttypes.testing.PloneAppContenttypes:Migration tests:
  Tear down plone.app.contenttypes.testing.PloneAppContenttypes:Integration in 0.000 seconds.
  Tear down plone.app.contenttypes.testing.PloneAppContenttypes in 0.094 seconds.
  Tear down plone.app.event.testing.PAEventLayer in 0.004 seconds.
  Set up plone.app.contenttypes.testing.PloneAppContenttypesMigration in 1.892 seconds.
  Set up plone.app.contenttypes.testing.PloneAppContenttypes:Migration in 0.000 seconds.
  Ran 40 tests with 3 failures and 0 errors in 1 minutes 6.650 seconds.
Running plone.app.contenttypes.testing.PloneAppContenttypes:Robot tests:
  Tear down plone.app.contenttypes.testing.PloneAppContenttypes:Migration in 0.000 seconds.
  Tear down plone.app.contenttypes.testing.PloneAppContenttypesMigration in 0.009 seconds.
  Set up plone.app.event.testing.PAEventLayer in 0.715 seconds.
  Set up plone.app.contenttypes.testing.PloneAppContenttypes in 1.560 seconds.
  Set up plone.testing.z2.ZServer in 0.503 seconds.
  Set up plone.app.contenttypes.testing.PloneAppContenttypes:Robot in 0.000 seconds.
The following test left new threads behind:
Scenario Test Folderlisting (test_contenttypes.robot)
New thread(s): [<_DummyThread(Dummy-1, started daemon -1247806656)>]
  Ran 7 tests with 3 failures and 0 errors in 3 minutes 10.465 seconds.
Running plone.app.contenttypes.tests.test_content_profile.PloneAppContenttypesContent:Integration tests:
  Tear down plone.app.contenttypes.testing.PloneAppContenttypes:Robot in 0.000 seconds.
  Tear down plone.testing.z2.ZServer in 4.129 seconds.
  Set up plone.app.contenttypes.tests.test_content_profile.PloneAppContenttypesContent in 3.838 seconds.
  Set up plone.app.contenttypes.tests.test_content_profile.PloneAppContenttypesContent:Integration in 0.000 seconds.
  Ran 16 tests with 3 failures and 0 errors in 0.029 seconds.
Running plone.app.dexterity.testing.dexterity:Acceptance tests:
  Tear down plone.app.contenttypes.tests.test_content_profile.PloneAppContenttypesContent:Integration in 0.000 seconds.
  Tear down plone.app.contenttypes.tests.test_content_profile.PloneAppContenttypesContent in 0.003 seconds.
  Tear down plone.app.contenttypes.testing.PloneAppContenttypes in 0.100 seconds.
  Tear down plone.app.event.testing.PAEventLayer in 0.005 seconds.
  Set up plone.app.dexterity.testing.DexterityFixture in 0.571 seconds.
  Set up plone.app.robotframework.remote.AutoLoginRemoteLibrary:RobotRemote in 0.004 seconds.
  Set up plone.testing.z2.ZServer in 0.502 seconds.
  Set up plone.app.dexterity.testing.dexterity:Acceptance in 0.000 seconds.
  Ran 1 tests with 3 failures and 0 errors in 11.445 seconds.
Running plone.app.dexterity.testing.dexterity:Functional tests:
  Tear down plone.app.dexterity.testing.dexterity:Acceptance in 0.000 seconds.
  Tear down plone.app.robotframework.remote.AutoLoginRemoteLibrary:RobotRemote in 0.002 seconds.
  Tear down plone.testing.z2.ZServer in 3.976 seconds.
  Set up plone.app.dexterity.testing.dexterity:Functional in 0.000 seconds.
  Ran 14 tests with 3 failures and 0 errors in 18.777 seconds.
Running plone.app.dexterity.testing.dexterity:Integration tests:
  Tear down plone.app.dexterity.testing.dexterity:Functional in 0.000 seconds.
  Set up plone.app.dexterity.testing.dexterity:Integration in 0.000 seconds.
  Ran 34 tests with 3 failures and 0 errors in 4.911 seconds.
Running plone.app.discussion.testing.PloneAppDiscussion:Functional tests:
  Tear down plone.app.dexterity.testing.dexterity:Integration in 0.000 seconds.
  Tear down plone.app.dexterity.testing.DexterityFixture in 0.003 seconds.
  Set up plone.app.event.testing.PAEventLayer in 0.707 seconds.
  Set up plone.app.contenttypes.testing.PloneAppContenttypes in 1.564 seconds.
  Set up plone.app.discussion.testing.PloneAppDiscussion in 0.442 seconds.
  Set up plone.app.discussion.testing.PloneAppDiscussion:Functional in 0.000 seconds.
  Ran 2 tests with 3 failures and 0 errors in 6.615 seconds.
Running plone.app.discussion.testing.PloneAppDiscussion:Integration tests:
  Tear down plone.app.discussion.testing.PloneAppDiscussion:Functional in 0.000 seconds.
  Set up plone.app.discussion.testing.PloneAppDiscussion:Integration in 0.000 seconds.
  Ran 154 tests with 3 failures and 0 errors in 15.989 seconds.
Running plone.app.event.testing.PAEvent:Integration tests:
  Tear down plone.app.discussion.testing.PloneAppDiscussion:Integration in 0.000 seconds.
  Tear down plone.app.discussion.testing.PloneAppDiscussion in 0.005 seconds.
  Tear down plone.app.contenttypes.testing.PloneAppContenttypes in 0.099 seconds.
  Set up plone.app.event.testing.PAEvent:Integration in 0.000 seconds.
  Ran 34 tests with 3 failures and 0 errors in 2.054 seconds.
Running plone.app.event.testing.PAEventAT:Functional tests:
  Tear down plone.app.event.testing.PAEvent:Integration in 0.000 seconds.
  Set up plone.app.event.testing.PAEventATLayer in 2.436 seconds.
  Set up plone.app.event.testing.PAEventAT:Functional in 0.000 seconds.
  Ran 5 tests with 3 failures and 0 errors in 8.429 seconds.
Running plone.app.event.testing.PAEventAT:Integration tests:
  Tear down plone.app.event.testing.PAEventAT:Functional in 0.000 seconds.
  Set up plone.app.event.testing.PAEventAT:Integration in 0.000 seconds.
  Ran 65 tests with 3 failures and 0 errors in 10.170 seconds.
Running plone.app.event.testing.PAEventDX:Functional tests:
  Tear down plone.app.event.testing.PAEventAT:Integration in 0.000 seconds.
  Tear down plone.app.event.testing.PAEventATLayer in 0.003 seconds.
  Set up plone.app.event.testing.PAEventDXLayer in 1.930 seconds.
  Set up plone.app.event.testing.PAEventDX:Functional in 0.000 seconds.
  Ran 5 tests with 3 failures and 0 errors in 6.477 seconds.
Running plone.app.event.testing.PAEventDX:Integration tests:
  Tear down plone.app.event.testing.PAEventDX:Functional in 0.000 seconds.
  Set up plone.app.event.testing.PAEventDX:Integration in 0.000 seconds.
  Ran 44 tests with 3 failures and 0 errors in 12.884 seconds.
Running plone.app.intid.testing.IntidSetupFixture:Setup tests:
  Tear down plone.app.event.testing.PAEventDX:Integration in 0.000 seconds.
  Tear down plone.app.event.testing.PAEventDXLayer in 0.004 seconds.
  Tear down plone.app.event.testing.PAEventLayer in 0.004 seconds.
  Set up plone.app.intid.testing.IntidSetupFixture in 0.024 seconds.
  Set up plone.app.intid.testing.IntidSetupFixture:Setup in 0.000 seconds.
  Ran 1 tests with 3 failures and 0 errors in 0.288 seconds.
Running plone.app.layout.testing.plone.app.layout:Integration tests:
  Tear down plone.app.intid.testing.IntidSetupFixture:Setup in 0.000 seconds.
  Tear down plone.app.intid.testing.IntidSetupFixture in 0.003 seconds.
  Set up plone.app.event.testing.PAEventLayer in 0.712 seconds.
  Set up plone.app.contenttypes.testing.PloneAppContenttypes in 1.563 seconds.
  Set up plone.app.layout.testing.Fixture in 0.027 seconds.
  Set up plone.app.layout.testing.plone.app.layout:Integration in 0.000 seconds.
  Ran 1 tests with 3 failures and 0 errors in 0.104 seconds.
Running plone.app.redirector.testing.PloneAppRedirector:Functional tests:
  Tear down plone.app.layout.testing.plone.app.layout:Integration in 0.000 seconds.
  Tear down plone.app.layout.testing.Fixture in 0.002 seconds.
  Set up plone.app.redirector.testing.PloneAppRedirector in 0.025 seconds.
  Set up plone.app.redirector.testing.PloneAppRedirector:Functional in 0.000 seconds.
  Ran 1 tests with 3 failures and 0 errors in 1.051 seconds.
Running plone.app.redirector.testing.PloneAppRedirector:Integration tests:
  Tear down plone.app.redirector.testing.PloneAppRedirector:Functional in 0.000 seconds.
  Set up plone.app.redirector.testing.PloneAppRedirector:Integration in 0.000 seconds.
  Ran 31 tests with 3 failures and 0 errors in 6.315 seconds.
Running plone.app.registry.testing.plone.app.registry:Integration tests:
  Tear down plone.app.redirector.testing.PloneAppRedirector:Integration in 0.000 seconds.
  Tear down plone.app.redirector.testing.PloneAppRedirector in 0.004 seconds.
  Tear down plone.app.contenttypes.testing.PloneAppContenttypes in 0.100 seconds.
  Tear down plone.app.event.testing.PAEventLayer in 0.004 seconds.
  Set up plone.app.registry.testing.PloneAppRegistry in 0.322 seconds.
  Set up plone.app.registry.testing.plone.app.registry:Integration in 0.000 seconds.
  Ran 2 tests with 3 failures and 0 errors in 0.004 seconds.
Running plone.app.search.tests.base.Search:Integration tests:
  Tear down plone.app.registry.testing.plone.app.registry:Integration in 0.000 seconds.
  Tear down plone.app.registry.testing.PloneAppRegistry in 0.002 seconds.
  Set up plone.app.search.tests.base.SearchLayer in 4.003 seconds.
  Set up plone.app.search.tests.base.Search:Integration in 0.000 seconds.
  Ran 4 tests with 3 failures and 0 errors in 0.211 seconds.
Running plone.app.testing.bbb.PloneTestCase:Functional tests:
  Tear down plone.app.search.tests.base.Search:Integration in 0.000 seconds.
  Tear down plone.app.search.tests.base.SearchLayer in 0.003 seconds.
  Set up plone.app.testing.bbb.PloneTestCaseFixture in 1.919 seconds.
  Set up plone.app.testing.bbb.PloneTestCase:Functional in 0.000 seconds.
/home/jenkins/.buildout/eggs/Products.CMFCore-2.2.7-py2.7.egg/Products/CMFCore/DirectoryView.py:493: UserWarning: DirectoryView classic_ecmascript refers to a non-existing path 'plonetheme.classic:skins/classic_ecmascript'
  (self.id, reg_key), UserWarning)


Failure in test /home/jenkins/workspace/plone-5.0-python-2.7/src/Products.CMFPlone/Products/CMFPlone/tests/emaillogin.txt
Failed doctest test for emaillogin.txt
  File "/home/jenkins/workspace/plone-5.0-python-2.7/src/Products.CMFPlone/Products/CMFPlone/tests/emaillogin.txt", line 0

----------------------------------------------------------------------
File "/home/jenkins/workspace/plone-5.0-python-2.7/src/Products.CMFPlone/Products/CMFPlone/tests/emaillogin.txt", line 78, in emaillogin.txt
Failed example:
    self.assertTrue('You have been registered.' in browser.contents)
Exception raised:
    Traceback (most recent call last):
      File "/usr/lib/python2.7/doctest.py", line 1289, in __run
        compileflags, 1) in test.globs
      File "<doctest emaillogin.txt[36]>", line 1, in <module>
        self.assertTrue('You have been registered.' in browser.contents)
      File "/usr/lib/python2.7/unittest/case.py", line 420, in assertTrue
        raise self.failureException(msg)
    AssertionError: False is not true
----------------------------------------------------------------------
File "/home/jenkins/workspace/plone-5.0-python-2.7/src/Products.CMFPlone/Products/CMFPlone/tests/emaillogin.txt", line 91, in emaillogin.txt
Failed example:
    self.assertTrue('You are now logged in' in browser.contents)
Exception raised:
    Traceback (most recent call last):
      File "/usr/lib/python2.7/doctest.py", line 1289, in __run
        compileflags, 1) in test.globs
      File "<doctest emaillogin.txt[42]>", line 1, in <module>
        self.assertTrue('You are now logged in' in browser.contents)
      File "/usr/lib/python2.7/unittest/case.py", line 420, in assertTrue
        raise self.failureException(msg)
    AssertionError: False is not true
----------------------------------------------------------------------
File "/home/jenkins/workspace/plone-5.0-python-2.7/src/Products.CMFPlone/Products/CMFPlone/tests/emaillogin.txt", line 101, in emaillogin.txt
Failed example:
    self.assertFalse('Log in' in browser.contents)
Exception raised:
    Traceback (most recent call last):
      File "/usr/lib/python2.7/doctest.py", line 1289, in __run
        compileflags, 1) in test.globs
      File "<doctest emaillogin.txt[44]>", line 1, in <module>
        self.assertFalse('Log in' in browser.contents)
      File "/usr/lib/python2.7/unittest/case.py", line 414, in assertFalse
        raise self.failureException(msg)
    AssertionError: True is not false
----------------------------------------------------------------------
File "/home/jenkins/workspace/plone-5.0-python-2.7/src/Products.CMFPlone/Products/CMFPlone/tests/emaillogin.txt", line 178, in emaillogin.txt
Failed example:
    self.assertFalse('Changes saved.' in browser.contents)
Exception raised:
    Traceback (most recent call last):
      File "/usr/lib/python2.7/doctest.py", line 1289, in __run
        compileflags, 1) in test.globs
      File "<doctest emaillogin.txt[84]>", line 1, in <module>
        self.assertFalse('Changes saved.' in browser.contents)
      File "/usr/lib/python2.7/unittest/case.py", line 414, in assertFalse
        raise self.failureException(msg)
    AssertionError: True is not false
----------------------------------------------------------------------
File "/home/jenkins/workspace/plone-5.0-python-2.7/src/Products.CMFPlone/Products/CMFPlone/tests/emaillogin.txt", line 200, in emaillogin.txt
Failed example:
    self.assertTrue('Password reset confirmation sent' in browser.contents)
Exception raised:
    Traceback (most recent call last):
      File "/usr/lib/python2.7/doctest.py", line 1289, in __run
        compileflags, 1) in test.globs
      File "<doctest emaillogin.txt[93]>", line 1, in <module>
        self.assertTrue('Password reset confirmation sent' in browser.contents)
      File "/usr/lib/python2.7/unittest/case.py", line 420, in assertTrue
        raise self.failureException(msg)
    AssertionError: False is not true
----------------------------------------------------------------------
File "/home/jenkins/workspace/plone-5.0-python-2.7/src/Products.CMFPlone/Products/CMFPlone/tests/emaillogin.txt", line 207, in emaillogin.txt
Failed example:
    len(mailhost.messages)
Expected:
    1
Got:
    0
----------------------------------------------------------------------
File "/home/jenkins/workspace/plone-5.0-python-2.7/src/Products.CMFPlone/Products/CMFPlone/tests/emaillogin.txt", line 209, in emaillogin.txt
Failed example:
    msg = mailhost.messages[0]
Exception raised:
    Traceback (most recent call last):
      File "/usr/lib/python2.7/doctest.py", line 1289, in __run
        compileflags, 1) in test.globs
      File "<doctest emaillogin.txt[96]>", line 1, in <module>
        msg = mailhost.messages[0]
      File "/usr/lib/python2.7/UserList.py", line 31, in __getitem__
        def __getitem__(self, i): return self.data[i]
    IndexError: list index out of range
----------------------------------------------------------------------
File "/home/jenkins/workspace/plone-5.0-python-2.7/src/Products.CMFPlone/Products/CMFPlone/tests/emaillogin.txt", line 214, in emaillogin.txt
Failed example:
    "To: email2 at example.org" in msg
Exception raised:
    Traceback (most recent call last):
      File "/usr/lib/python2.7/doctest.py", line 1289, in __run
        compileflags, 1) in test.globs
      File "<doctest emaillogin.txt[97]>", line 1, in <module>
        "To: email2 at example.org" in msg
    NameError: name 'msg' is not defined
----------------------------------------------------------------------
File "/home/jenkins/workspace/plone-5.0-python-2.7/src/Products.CMFPlone/Products/CMFPlone/tests/emaillogin.txt", line 220, in emaillogin.txt
Failed example:
    msg = quopri.decodestring(msg)
Exception raised:
    Traceback (most recent call last):
      File "/usr/lib/python2.7/doctest.py", line 1289, in __run
        compileflags, 1) in test.globs
      File "<doctest emaillogin.txt[99]>", line 1, in <module>
        msg = quopri.decodestring(msg)
    NameError: name 'msg' is not defined
----------------------------------------------------------------------
File "/home/jenkins/workspace/plone-5.0-python-2.7/src/Products.CMFPlone/Products/CMFPlone/tests/emaillogin.txt", line 221, in emaillogin.txt
Failed example:
    url_index = msg.index('http://nohost/plone/passwordreset/')
Exception raised:
    Traceback (most recent call last):
      File "/usr/lib/python2.7/doctest.py", line 1289, in __run
        compileflags, 1) in test.globs
      File "<doctest emaillogin.txt[100]>", line 1, in <module>
        url_index = msg.index('http://nohost/plone/passwordreset/')
    NameError: name 'msg' is not defined
----------------------------------------------------------------------
File "/home/jenkins/workspace/plone-5.0-python-2.7/src/Products.CMFPlone/Products/CMFPlone/tests/emaillogin.txt", line 222, in emaillogin.txt
Failed example:
    address = msg[url_index:].split()[0]
Exception raised:
    Traceback (most recent call last):
      File "/usr/lib/python2.7/doctest.py", line 1289, in __run
        compileflags, 1) in test.globs
      File "<doctest emaillogin.txt[101]>", line 1, in <module>
        address = msg[url_index:].split()[0]
    NameError: name 'msg' is not defined
----------------------------------------------------------------------
File "/home/jenkins/workspace/plone-5.0-python-2.7/src/Products.CMFPlone/Products/CMFPlone/tests/emaillogin.txt", line 226, in emaillogin.txt
Failed example:
    browser.open(address)
Exception raised:
    Traceback (most recent call last):
      File "/usr/lib/python2.7/doctest.py", line 1289, in __run
        compileflags, 1) in test.globs
      File "<doctest emaillogin.txt[102]>", line 1, in <module>
        browser.open(address)
    NameError: name 'address' is not defined
----------------------------------------------------------------------
File "/home/jenkins/workspace/plone-5.0-python-2.7/src/Products.CMFPlone/Products/CMFPlone/tests/emaillogin.txt", line 227, in emaillogin.txt
Failed example:
    "Set your password" in browser.contents
Expected:
    True
Got:
    False
----------------------------------------------------------------------
File "/home/jenkins/workspace/plone-5.0-python-2.7/src/Products.CMFPlone/Products/CMFPlone/tests/emaillogin.txt", line 229, in emaillogin.txt
Failed example:
    form = browser.getForm(name='pwreset_action')
Exception raised:
    Traceback (most recent call last):
      File "/usr/lib/python2.7/doctest.py", line 1289, in __run
        compileflags, 1) in test.globs
      File "<doctest emaillogin.txt[104]>", line 1, in <module>
        form = browser.getForm(name='pwreset_action')
      File "/home/jenkins/.buildout/eggs/zope.testbrowser-3.11.1-py2.7.egg/zope/testbrowser/browser.py", line 403, in getForm
        form = disambiguate(matching_forms, '', index)
      File "/home/jenkins/.buildout/eggs/zope.testbrowser-3.11.1-py2.7.egg/zope/testbrowser/browser.py", line 48, in disambiguate
        raise LookupError(msg)
    LookupError
----------------------------------------------------------------------
File "/home/jenkins/workspace/plone-5.0-python-2.7/src/Products.CMFPlone/Products/CMFPlone/tests/emaillogin.txt", line 230, in emaillogin.txt
Failed example:
    form.getControl(name='userid').value = 'email2 at example.org'
Exception raised:
    Traceback (most recent call last):
      File "/usr/lib/python2.7/doctest.py", line 1289, in __run
        compileflags, 1) in test.globs
      File "<doctest emaillogin.txt[105]>", line 1, in <module>
        form.getControl(name='userid').value = 'email2 at example.org'
      File "/home/jenkins/.buildout/eggs/zope.testbrowser-3.11.1-py2.7.egg/zope/testbrowser/browser.py", line 778, in getControl
        raise zope.testbrowser.interfaces.ExpiredError
    ExpiredError
----------------------------------------------------------------------
File "/home/jenkins/workspace/plone-5.0-python-2.7/src/Products.CMFPlone/Products/CMFPlone/tests/emaillogin.txt", line 231, in emaillogin.txt
Failed example:
    form.getControl(name='password').value = 'secretion'
Exception raised:
    Traceback (most recent call last):
      File "/usr/lib/python2.7/doctest.py", line 1289, in __run
        compileflags, 1) in test.globs
      File "<doctest emaillogin.txt[106]>", line 1, in <module>
        form.getControl(name='password').value = 'secretion'
      File "/home/jenkins/.buildout/eggs/zope.testbrowser-3.11.1-py2.7.egg/zope/testbrowser/browser.py", line 778, in getControl
        raise zope.testbrowser.interfaces.ExpiredError
    ExpiredError
----------------------------------------------------------------------
File "/home/jenkins/workspace/plone-5.0-python-2.7/src/Products.CMFPlone/Products/CMFPlone/tests/emaillogin.txt", line 232, in emaillogin.txt
Failed example:
    form.getControl(name='password2').value = 'secretion'
Exception raised:
    Traceback (most recent call last):
      File "/usr/lib/python2.7/doctest.py", line 1289, in __run
        compileflags, 1) in test.globs
      File "<doctest emaillogin.txt[107]>", line 1, in <module>
        form.getControl(name='password2').value = 'secretion'
      File "/home/jenkins/.buildout/eggs/zope.testbrowser-3.11.1-py2.7.egg/zope/testbrowser/browser.py", line 778, in getControl
        raise zope.testbrowser.interfaces.ExpiredError
    ExpiredError
----------------------------------------------------------------------
File "/home/jenkins/workspace/plone-5.0-python-2.7/src/Products.CMFPlone/Products/CMFPlone/tests/emaillogin.txt", line 233, in emaillogin.txt
Failed example:
    form.submit()
Exception raised:
    Traceback (most recent call last):
      File "/usr/lib/python2.7/doctest.py", line 1289, in __run
        compileflags, 1) in test.globs
      File "<doctest emaillogin.txt[108]>", line 1, in <module>
        form.submit()
      File "/home/jenkins/.buildout/eggs/zope.testbrowser-3.11.1-py2.7.egg/zope/testbrowser/browser.py", line 747, in submit
        raise zope.testbrowser.interfaces.ExpiredError
    ExpiredError
----------------------------------------------------------------------
File "/home/jenkins/workspace/plone-5.0-python-2.7/src/Products.CMFPlone/Products/CMFPlone/tests/emaillogin.txt", line 234, in emaillogin.txt
Failed example:
    "Your password has been set successfully." in browser.contents
Expected:
    True
Got:
    False
----------------------------------------------------------------------
File "/home/jenkins/workspace/plone-5.0-python-2.7/src/Products.CMFPlone/Products/CMFPlone/tests/emaillogin.txt", line 244, in emaillogin.txt
Failed example:
    self.assertFalse('Log in' in browser.contents)
Exception raised:
    Traceback (most recent call last):
      File "/usr/lib/python2.7/doctest.py", line 1289, in __run
        compileflags, 1) in test.globs
      File "<doctest emaillogin.txt[115]>", line 1, in <module>
        self.assertFalse('Log in' in browser.contents)
      File "/usr/lib/python2.7/unittest/case.py", line 414, in assertFalse
        raise self.failureException(msg)
    AssertionError: True is not false
----------------------------------------------------------------------
File "/home/jenkins/workspace/plone-5.0-python-2.7/src/Products.CMFPlone/Products/CMFPlone/tests/emaillogin.txt", line 257, in emaillogin.txt
Failed example:
    len(mailhost.messages)
Expected:
    2
Got:
    1

  Ran 1180 tests with 4 failures and 0 errors in 3 minutes 36.955 seconds.
Running plone.app.theming.testing.Theming:Functional tests:
  Tear down plone.app.testing.bbb.PloneTestCase:Functional in 0.000 seconds.
  Tear down plone.app.testing.bbb.PloneTestCaseFixture in 0.008 seconds.
  Set up plone.app.event.testing.PAEventLayer in 0.709 seconds.
  Set up plone.app.contenttypes.testing.PloneAppContenttypes in 1.563 seconds.
  Set up plone.app.theming.testing.Theming in 0.420 seconds.
  Set up plone.app.theming.testing.Theming:Functional in 0.000 seconds.
  Ran 27 tests with 4 failures and 0 errors in 2.990 seconds.
Running plone.app.theming.testing.Theming:Integration tests:
  Tear down plone.app.theming.testing.Theming:Functional in 0.000 seconds.
  Set up plone.app.theming.testing.Theming:Integration in 0.000 seconds.
  Ran 13 tests with 4 failures and 0 errors in 0.038 seconds.
Running plone.app.theming.testing.Theming:IntegrationWithCaching tests:
  Tear down plone.app.theming.testing.Theming:Integration in 0.000 seconds.
  Tear down plone.app.theming.testing.Theming in 0.002 seconds.
  Set up plone.app.theming.testing.ThemingWithCaching in 0.634 seconds.
  Set up plone.app.theming.testing.Theming:IntegrationWithCaching in 0.000 seconds.
  Ran 3 tests with 4 failures and 0 errors in 1.431 seconds.
Running plone.app.uuid.testing.plone.app.uuid:Functional tests:
  Tear down plone.app.theming.testing.Theming:IntegrationWithCaching in 0.000 seconds.
  Tear down plone.app.theming.testing.ThemingWithCaching in 0.003 seconds.
  Tear down plone.app.contenttypes.testing.PloneAppContenttypes in 0.100 seconds.
  Tear down plone.app.event.testing.PAEventLayer in 0.004 seconds.
  Set up plone.app.uuid.testing.PloneAppUUID in 0.027 seconds.
  Set up plone.app.uuid.testing.plone.app.uuid:Functional in 0.000 seconds.
  Ran 3 tests with 4 failures and 0 errors in 0.382 seconds.
Running plone.app.uuid.testing.plone.app.uuid:Integration tests:
  Tear down plone.app.uuid.testing.plone.app.uuid:Functional in 0.000 seconds.
  Set up plone.app.uuid.testing.plone.app.uuid:Integration in 0.000 seconds.
  Ran 5 tests with 4 failures and 0 errors in 0.269 seconds.
Running plone.autoform.testing.plone.autoform:Integration tests:
  Tear down plone.app.uuid.testing.plone.app.uuid:Integration in 0.000 seconds.
  Tear down plone.app.uuid.testing.PloneAppUUID in 0.003 seconds.
  Tear down plone.app.testing.layers.PloneFixture in 0.060 seconds.
  Set up plone.testing.zca.plone.autoform:Fixture in 0.127 seconds.
  Set up plone.autoform.testing.plone.autoform:Integration in 0.000 seconds.
  Ran 22 tests with 4 failures and 0 errors in 0.014 seconds.
Running plone.formwidget.recurrence.tests.base.PloneFormwidgetRecurrenceLayer:Integration tests:
  Tear down plone.autoform.testing.plone.autoform:Integration in 0.000 seconds.
  Tear down plone.testing.zca.plone.autoform:Fixture in 0.000 seconds.
  Set up plone.app.testing.layers.PloneFixture in 6.664 seconds.
  Set up plone.formwidget.recurrence.tests.base.PloneFormwidgetRecurrenceLayer in 1.634 seconds.
  Set up plone.formwidget.recurrence.tests.base.PloneFormwidgetRecurrenceLayer:Integration in 0.000 seconds.
  Ran 4 tests with 4 failures and 0 errors in 4.528 seconds.
Running plone.portlet.collection.testing.PlonePortletCollection:Functional tests:
  Tear down plone.formwidget.recurrence.tests.base.PloneFormwidgetRecurrenceLayer:Integration in 0.000 seconds.
  Tear down plone.formwidget.recurrence.tests.base.PloneFormwidgetRecurrenceLayer in 0.003 seconds.
  Set up plone.app.event.testing.PAEventLayer in 0.726 seconds.
  Set up plone.app.contenttypes.testing.PloneAppContenttypes in 1.567 seconds.
  Set up plone.portlet.collection.testing.PlonePortletCollection in 0.603 seconds.
  Set up plone.portlet.collection.testing.PlonePortletCollection:Functional in 0.000 seconds.
  Ran 1 tests with 4 failures and 0 errors in 5.829 seconds.
Running plone.portlet.collection.testing.PlonePortletCollection:Integration tests:
  Tear down plone.portlet.collection.testing.PlonePortletCollection:Functional in 0.000 seconds.
  Set up plone.portlet.collection.testing.PlonePortletCollection:Integration in 0.000 seconds.
  Ran 11 tests with 4 failures and 0 errors in 1.649 seconds.
Running plone.resourceeditor.testing.plone.resourceeditor:Integration tests:
  Tear down plone.portlet.collection.testing.PlonePortletCollection:Integration in 0.000 seconds.
  Tear down plone.portlet.collection.testing.PlonePortletCollection in 0.003 seconds.
  Tear down plone.app.contenttypes.testing.PloneAppContenttypes in 0.100 seconds.
  Tear down plone.app.event.testing.PAEventLayer in 0.004 seconds.
  Set up plone.resourceeditor.testing.PloneResourceEditor in 0.072 seconds.
  Set up plone.resourceeditor.testing.plone.resourceeditor:Integration in 0.000 seconds.
  Ran 23 tests with 4 failures and 0 errors in 0.050 seconds.
Running plone.subrequest.testing.PloneSubrequest:Functional tests:
  Tear down plone.resourceeditor.testing.plone.resourceeditor:Integration in 0.000 seconds.
  Tear down plone.resourceeditor.testing.PloneResourceEditor in 0.002 seconds.
  Tear down plone.app.testing.layers.PloneFixture in 0.059 seconds.
  Set up plone.subrequest.testing.PLONE_SUBREQEST_FIXTURE in 0.018 seconds.
  Set up plone.subrequest.testing.PloneSubrequest:Functional in 0.000 seconds.
  Ran 4 tests with 4 failures and 0 errors in 0.019 seconds.
Running plone.subrequest.testing.PloneSubrequest:Integration tests:
  Tear down plone.subrequest.testing.PloneSubrequest:Functional in 0.000 seconds.
  Set up plone.subrequest.testing.PloneSubrequest:Integration in 0.000 seconds.
  Ran 69 tests with 4 failures and 0 errors in 0.093 seconds.
Running plone.testing.z2.ZServer:Functional tests:
  Tear down plone.subrequest.testing.PloneSubrequest:Integration in 0.000 seconds.
  Tear down plone.subrequest.testing.PLONE_SUBREQEST_FIXTURE in 0.000 seconds.
  Set up plone.testing.z2.ZServer in 0.502 seconds.
  Set up plone.testing.z2.ZServer:Functional in 0.000 seconds.
  Ran 63 tests with 4 failures and 0 errors in 0.214 seconds.
Running plone.testing.zca.UnitTesting tests:
  Tear down plone.testing.z2.ZServer:Functional in 0.000 seconds.
  Tear down plone.testing.z2.ZServer in 4.228 seconds.
  Tear down plone.testing.z2.Startup in 0.006 seconds.
  Tear down plone.testing.zca.LayerCleanup in 0.003 seconds.
  Set up plone.testing.zca.UnitTesting in 0.000 seconds.
  Ran 247 tests with 4 failures and 0 errors in 3.646 seconds.
Running zope.testrunner.layer.UnitTests tests:
  Tear down plone.testing.zca.UnitTesting in 0.000 seconds.
  Set up zope.testrunner.layer.UnitTests in 0.000 seconds.
  Ran 312 tests with 4 failures and 0 errors in 1 minutes 4.316 seconds.
Tearing down left over layers:
  Tear down zope.testrunner.layer.UnitTests in 0.000 seconds.
Total: 2695 tests, 4 failures, 0 errors in 24 minutes 20.089 seconds.
/home/jenkins/.buildout/eggs/setuptools-1.3.2-py2.7.egg/pkg_resources.py:979: UserWarning: /home/jenkins/.python-eggs is writable by group/others and vulnerable to attack when used with get_resource_filename. Consider a more secure location (set with .set_extraction_path or the PYTHON_EGG_CACHE environment variable).
  warnings.warn(msg, UserWarning)
Running Products.PloneTestCase.layer.PloneSite tests:
  Set up Testing.ZopeTestCase.layer.ZopeLite in 0.487 seconds.
  Set up Products.PloneTestCase.layer.ZCML in 4.134 seconds.
  Set up Products.PloneTestCase.layer.PloneSite in 3.889 seconds.
  Ran 159 tests with 0 failures and 0 errors in 16.736 seconds.
Running plone.app.portlets.tests.layer.PlonePortlets tests:
  Set up plone.app.portlets.tests.layer.PlonePortlets in 0.000 seconds.
  Ran 2 tests with 0 failures and 0 errors in 8.338 seconds.
Running plone.app.portlets.tests.test_configuration.TestPortletZCMLLayer tests:
  Tear down plone.app.portlets.tests.layer.PlonePortlets in 0.000 seconds.
  Set up plone.app.portlets.tests.test_configuration.TestPortletZCMLLayer in 0.008 seconds.
  Ran 18 tests with 0 failures and 0 errors in 10.627 seconds.
Running plone.app.portlets.tests.test_z3cforms.z3cPortletZCMLLayer tests:
  Tear down plone.app.portlets.tests.test_configuration.TestPortletZCMLLayer in 0.000 seconds.
  Set up plone.app.portlets.tests.test_z3cforms.z3cPortletZCMLLayer in 0.008 seconds.
  Ran 4 tests with 0 failures and 0 errors in 2.190 seconds.
Running zope.testrunner.layer.UnitTests tests:
  Tear down plone.app.portlets.tests.test_z3cforms.z3cPortletZCMLLayer in 0.000 seconds.
  Tear down Products.PloneTestCase.layer.PloneSite in 0.087 seconds.
  Tear down Products.PloneTestCase.layer.ZCML in 0.002 seconds.
  Tear down Testing.ZopeTestCase.layer.ZopeLite in 0.000 seconds.
  Set up zope.testrunner.layer.UnitTests in 0.000 seconds.
  Ran 5 tests with 0 failures and 0 errors in 0.121 seconds.
Tearing down left over layers:
  Tear down zope.testrunner.layer.UnitTests in 0.000 seconds.
Total: 188 tests, 0 failures, 0 errors in 47.546 seconds.
Running plone.app.relationfield.tests.UnitTestLayer tests:
  Set up plone.app.relationfield.tests.UnitTestLayer in 0.000 seconds.
  Ran 7 tests with 0 failures and 0 errors in 0.024 seconds.
Running plone.testing.zca.UnitTesting tests:
  Tear down plone.app.relationfield.tests.UnitTestLayer in 0.000 seconds.
  Set up plone.testing.zca.UnitTesting in 0.000 seconds.
  Ran 1 tests with 0 failures and 0 errors in 0.045 seconds.
Running zope.testrunner.layer.UnitTests tests:
  Tear down plone.testing.zca.UnitTesting in 0.000 seconds.
  Set up zope.testrunner.layer.UnitTests in 0.000 seconds.
>From grok.testing's warn():
/home/jenkins/.buildout/eggs/plone.caching-1.0-py2.7.egg/plone/caching/tests/test_utils.py:30: PendingDeprecationWarning: Please use assertTrue instead.
  self.failUnless(result is _marker)
>From grok.testing's warn():
/home/jenkins/.buildout/eggs/plone.caching-1.0-py2.7.egg/plone/caching/tests/test_utils.py:24: PendingDeprecationWarning: Please use assertTrue instead.
  self.failUnless(result is _marker)
>From grok.testing's warn():
/home/jenkins/workspace/plone-5.0-python-2.7/src/plone.dexterity/plone/dexterity/tests/test_content.py:459: PendingDeprecationWarning: Please use assertTrue instead.
  self.assertTrue(tab in containerOptions, "Tab %s not found" % tab)
>From grok.testing's warn():
/home/jenkins/workspace/plone-5.0-python-2.7/src/plone.dexterity/plone/dexterity/tests/test_content.py:459: PendingDeprecationWarning: Please use assertTrue instead.
  self.assertTrue(tab in containerOptions, "Tab %s not found" % tab)
>From grok.testing's warn():
/home/jenkins/workspace/plone-5.0-python-2.7/src/plone.dexterity/plone/dexterity/tests/test_content.py:459: PendingDeprecationWarning: Please use assertTrue instead.
  self.assertTrue(tab in containerOptions, "Tab %s not found" % tab)
>From grok.testing's warn():
/home/jenkins/workspace/plone-5.0-python-2.7/src/plone.dexterity/plone/dexterity/tests/test_content.py:459: PendingDeprecationWarning: Please use assertTrue instead.
  self.assertTrue(tab in containerOptions, "Tab %s not found" % tab)
>From grok.testing's warn():
/home/jenkins/workspace/plone-5.0-python-2.7/src/plone.dexterity/plone/dexterity/tests/test_content.py:459: PendingDeprecationWarning: Please use assertTrue instead.
  self.assertTrue(tab in containerOptions, "Tab %s not found" % tab)
>From grok.testing's warn():
/home/jenkins/workspace/plone-5.0-python-2.7/src/plone.dexterity/plone/dexterity/tests/test_content.py:459: PendingDeprecationWarning: Please use assertTrue instead.
  self.assertTrue(tab in containerOptions, "Tab %s not found" % tab)
>From grok.testing's warn():
/home/jenkins/workspace/plone-5.0-python-2.7/src/plone.dexterity/plone/dexterity/tests/test_content.py:459: PendingDeprecationWarning: Please use assertTrue instead.
  self.assertTrue(tab in containerOptions, "Tab %s not found" % tab)
>From grok.testing's warn():
/home/jenkins/workspace/plone-5.0-python-2.7/src/plone.dexterity/plone/dexterity/tests/test_content.py:466: PendingDeprecationWarning: Please use assertTrue instead.
  self.assertTrue(tab in containerOptions, "Tab %s not found" % tab)
>From grok.testing's warn():
/home/jenkins/workspace/plone-5.0-python-2.7/src/plone.dexterity/plone/dexterity/tests/test_content.py:466: PendingDeprecationWarning: Please use assertTrue instead.
  self.assertTrue(tab in containerOptions, "Tab %s not found" % tab)
>From grok.testing's warn():
/home/jenkins/workspace/plone-5.0-python-2.7/src/plone.dexterity/plone/dexterity/tests/test_content.py:466: PendingDeprecationWarning: Please use assertTrue instead.
  self.assertTrue(tab in containerOptions, "Tab %s not found" % tab)
>From grok.testing's warn():
/home/jenkins/workspace/plone-5.0-python-2.7/src/plone.dexterity/plone/dexterity/tests/test_content.py:466: PendingDeprecationWarning: Please use assertTrue instead.
  self.assertTrue(tab in containerOptions, "Tab %s not found" % tab)
>From grok.testing's warn():
/home/jenkins/workspace/plone-5.0-python-2.7/src/plone.dexterity/plone/dexterity/tests/test_content.py:466: PendingDeprecationWarning: Please use assertTrue instead.
  self.assertTrue(tab in containerOptions, "Tab %s not found" % tab)
>From grok.testing's warn():
/home/jenkins/workspace/plone-5.0-python-2.7/src/plone.dexterity/plone/dexterity/tests/test_content.py:466: PendingDeprecationWarning: Please use assertTrue instead.
  self.assertTrue(tab in containerOptions, "Tab %s not found" % tab)
>From grok.testing's warn():
/home/jenkins/workspace/plone-5.0-python-2.7/src/plone.dexterity/plone/dexterity/tests/test_content.py:651: PendingDeprecationWarning: Please use assertTrue instead.
  self.assertTrue(isinstance(c.effective_date, DateTime))
>From grok.testing's warn():
/home/jenkins/workspace/plone-5.0-python-2.7/src/plone.dexterity/plone/dexterity/tests/test_content.py:824: PendingDeprecationWarning: Please use assertFalse instead.
  self.assertFalse('test' in container)
>From grok.testing's warn():
/home/jenkins/workspace/plone-5.0-python-2.7/src/plone.dexterity/plone/dexterity/tests/test_content.py:802: PendingDeprecationWarning: Please use assertTrue instead.
  self.assertTrue(foo.listfield is not bar.listfield)
>From grok.testing's warn():
/home/jenkins/workspace/plone-5.0-python-2.7/src/plone.dexterity/plone/dexterity/tests/test_content.py:803: PendingDeprecationWarning: Please use assertTrue instead.
  self.assertTrue(foo.listfield is not baz.listfield)
>From grok.testing's warn():
/home/jenkins/workspace/plone-5.0-python-2.7/src/plone.dexterity/plone/dexterity/tests/test_content.py:444: PendingDeprecationWarning: Please use assertTrue instead.
  self.assertTrue(isinstance(content['foo'], Item))
>From grok.testing's warn():
/home/jenkins/workspace/plone-5.0-python-2.7/src/plone.dexterity/plone/dexterity/tests/test_content.py:448: PendingDeprecationWarning: Please use assertTrue instead.
  self.assertTrue(isinstance(content['quux'], Item))
>From grok.testing's warn():
/home/jenkins/workspace/plone-5.0-python-2.7/src/plone.dexterity/plone/dexterity/tests/test_content.py:451: PendingDeprecationWarning: Please use assertTrue instead.
  self.assertTrue(isinstance(getattr(content, 'quux'), Item))
>From grok.testing's warn():
/home/jenkins/workspace/plone-5.0-python-2.7/src/plone.dexterity/plone/dexterity/tests/test_content.py:621: PendingDeprecationWarning: Please use assertTrue instead.
  self.assertTrue(mock_addCreator.called)
>From grok.testing's warn():
/home/jenkins/workspace/plone-5.0-python-2.7/src/plone.dexterity/plone/dexterity/tests/test_content.py:504: PendingDeprecationWarning: Please use assertTrue instead.
  self.assertTrue(isinstance(i.__name__, unicode))
>From grok.testing's warn():
/home/jenkins/workspace/plone-5.0-python-2.7/src/plone.dexterity/plone/dexterity/tests/test_content.py:505: PendingDeprecationWarning: Please use assertTrue instead.
  self.assertTrue(isinstance(i.id, str))
>From grok.testing's warn():
/home/jenkins/workspace/plone-5.0-python-2.7/src/plone.dexterity/plone/dexterity/tests/test_content.py:506: PendingDeprecationWarning: Please use assertTrue instead.
  self.assertTrue(isinstance(i.getId(), str))
>From grok.testing's warn():
/home/jenkins/workspace/plone-5.0-python-2.7/src/plone.dexterity/plone/dexterity/tests/test_fti.py:674: PendingDeprecationWarning: Please use assertFalse instead.
  self.assertFalse('title' in IBlank)
>From grok.testing's warn():
/home/jenkins/workspace/plone-5.0-python-2.7/src/plone.dexterity/plone/dexterity/tests/test_fti.py:610: PendingDeprecationWarning: Please use assertTrue instead.
  self.assertTrue('title' in IBlank)
>From grok.testing's warn():
/home/jenkins/workspace/plone-5.0-python-2.7/src/plone.dexterity/plone/dexterity/tests/test_fti.py:611: PendingDeprecationWarning: Please use assertTrue instead.
  self.assertTrue(IBlank['title'].title == u"title")
>From grok.testing's warn():
/home/jenkins/workspace/plone-5.0-python-2.7/src/plone.dexterity/plone/dexterity/tests/test_fti.py:640: PendingDeprecationWarning: Please use assertTrue instead.
  self.assertTrue('title' in IBlank)
>From grok.testing's warn():
/home/jenkins/workspace/plone-5.0-python-2.7/src/plone.dexterity/plone/dexterity/tests/test_fti.py:641: PendingDeprecationWarning: Please use assertTrue instead.
  self.assertTrue(IBlank['title'].title == u"title")
>From grok.testing's warn():
/home/jenkins/workspace/plone-5.0-python-2.7/src/plone.dexterity/plone/dexterity/tests/test_schema.py:56: PendingDeprecationWarning: Please use assertTrue instead.
  self.assertTrue(isinstance(klass, InterfaceClass))
>From grok.testing's warn():
/home/jenkins/workspace/plone-5.0-python-2.7/src/plone.dexterity/plone/dexterity/tests/test_schema.py:57: PendingDeprecationWarning: Please use assertTrue instead.
  self.assertTrue(klass.isOrExtends(IDexteritySchema))
>From grok.testing's warn():
/home/jenkins/workspace/plone-5.0-python-2.7/src/plone.dexterity/plone/dexterity/tests/test_schema.py:58: PendingDeprecationWarning: Please use assertTrue instead.
  self.assertTrue(IContentType.providedBy(klass))
>From grok.testing's warn():
/home/jenkins/workspace/plone-5.0-python-2.7/src/plone.dexterity/plone/dexterity/tests/test_schema.py:86: PendingDeprecationWarning: Please use assertTrue instead.
  self.assertTrue(isinstance(klass, InterfaceClass))
>From grok.testing's warn():
/home/jenkins/workspace/plone-5.0-python-2.7/src/plone.dexterity/plone/dexterity/tests/test_schema.py:87: PendingDeprecationWarning: Please use assertFalse instead.
  self.assertFalse(klass.isOrExtends(IDexteritySchema)) # only default schema gets this
>From grok.testing's warn():
/home/jenkins/workspace/plone-5.0-python-2.7/src/plone.dexterity/plone/dexterity/tests/test_schema.py:88: PendingDeprecationWarning: Please use assertFalse instead.
  self.assertFalse(IContentType.providedBy(klass))
>From grok.testing's warn():
/home/jenkins/workspace/plone-5.0-python-2.7/src/plone.dexterity/plone/dexterity/tests/test_schema.py:29: PendingDeprecationWarning: Please use assertTrue instead.
  self.assertTrue(isinstance(klass, InterfaceClass))
>From grok.testing's warn():
/home/jenkins/workspace/plone-5.0-python-2.7/src/plone.dexterity/plone/dexterity/tests/test_schema.py:30: PendingDeprecationWarning: Please use assertTrue instead.
  self.assertTrue(klass.isOrExtends(IDexteritySchema))
>From grok.testing's warn():
/home/jenkins/workspace/plone-5.0-python-2.7/src/plone.dexterity/plone/dexterity/tests/test_schema.py:31: PendingDeprecationWarning: Please use assertTrue instead.
  self.assertTrue(IContentType.providedBy(klass))
>From grok.testing's warn():
/home/jenkins/workspace/plone-5.0-python-2.7/src/plone.dexterity/plone/dexterity/tests/test_schema.py:101: PendingDeprecationWarning: Please use assertTrue instead.
  self.assertTrue(isinstance(klass, InterfaceClass))
>From grok.testing's warn():
/home/jenkins/workspace/plone-5.0-python-2.7/src/plone.dexterity/plone/dexterity/tests/test_schema.py:102: PendingDeprecationWarning: Please use assertTrue instead.
  self.assertTrue(klass.isOrExtends(IDexteritySchema))
>From grok.testing's warn():
/home/jenkins/workspace/plone-5.0-python-2.7/src/plone.dexterity/plone/dexterity/tests/test_schema.py:103: PendingDeprecationWarning: Please use assertTrue instead.
  self.assertTrue(IContentType.providedBy(klass))
>From grok.testing's warn():
/home/jenkins/workspace/plone-5.0-python-2.7/src/plone.dexterity/plone/dexterity/tests/test_schema.py:111: PendingDeprecationWarning: Please use assertTrue instead.
  self.assertTrue(isinstance(klass, InterfaceClass))
>From grok.testing's warn():
/home/jenkins/workspace/plone-5.0-python-2.7/src/plone.dexterity/plone/dexterity/tests/test_schema.py:112: PendingDeprecationWarning: Please use assertTrue instead.
  self.assertTrue(klass.isOrExtends(IDexteritySchema))
>From grok.testing's warn():
/home/jenkins/workspace/plone-5.0-python-2.7/src/plone.dexterity/plone/dexterity/tests/test_schema.py:113: PendingDeprecationWarning: Please use assertTrue instead.
  self.assertTrue(IContentType.providedBy(klass))
>From grok.testing's warn():
/home/jenkins/workspace/plone-5.0-python-2.7/src/plone.dexterity/plone/dexterity/tests/test_schema.py:133: PendingDeprecationWarning: Please use assertTrue instead.
  self.assertTrue(isinstance(klass, InterfaceClass))
>From grok.testing's warn():
/home/jenkins/workspace/plone-5.0-python-2.7/src/plone.dexterity/plone/dexterity/tests/test_schema.py:134: PendingDeprecationWarning: Please use assertTrue instead.
  self.assertTrue(klass.isOrExtends(IDexteritySchema))
>From grok.testing's warn():
/home/jenkins/workspace/plone-5.0-python-2.7/src/plone.dexterity/plone/dexterity/tests/test_schema.py:135: PendingDeprecationWarning: Please use assertTrue instead.
  self.assertTrue(IContentType.providedBy(klass))
>From grok.testing's warn():
/home/jenkins/workspace/plone-5.0-python-2.7/src/plone.dexterity/plone/dexterity/tests/test_schema_cache.py:115: PendingDeprecationWarning: Please use assertTrue instead.
  self.assertTrue(schema1 is None)
>From grok.testing's warn():
/home/jenkins/workspace/plone-5.0-python-2.7/src/plone.dexterity/plone/dexterity/tests/test_schema_cache.py:116: PendingDeprecationWarning: Please use assertTrue instead.
  self.assertTrue(schema2 is None)
>From grok.testing's warn():
/home/jenkins/workspace/plone-5.0-python-2.7/src/plone.dexterity/plone/dexterity/tests/test_schema_cache.py:117: PendingDeprecationWarning: Please use assertTrue instead.
  self.assertTrue(schema3 is ISchema1)
>From grok.testing's warn():
/home/jenkins/workspace/plone-5.0-python-2.7/src/plone.dexterity/plone/dexterity/tests/test_schema_cache.py:94: PendingDeprecationWarning: Please use assertTrue instead.
  self.assertTrue(schema1 is None)
>From grok.testing's warn():
/home/jenkins/workspace/plone-5.0-python-2.7/src/plone.dexterity/plone/dexterity/tests/test_schema_cache.py:95: PendingDeprecationWarning: Please use assertTrue instead.
  self.assertTrue(schema2 is schema3 is ISchema1)
>From grok.testing's warn():
/home/jenkins/workspace/plone-5.0-python-2.7/src/plone.dexterity/plone/dexterity/tests/test_schema_cache.py:31: PendingDeprecationWarning: Please use assertTrue instead.
  self.assertTrue(schema1 is schema2 is ISchema)
>From grok.testing's warn():
/home/jenkins/workspace/plone-5.0-python-2.7/src/plone.dexterity/plone/dexterity/tests/test_schema_cache.py:52: PendingDeprecationWarning: Please use assertTrue instead.
  self.assertTrue(schema1 is schema2 and schema2 is ISchema1)
>From grok.testing's warn():
/home/jenkins/workspace/plone-5.0-python-2.7/src/plone.dexterity/plone/dexterity/tests/test_schema_cache.py:74: PendingDeprecationWarning: Please use assertTrue instead.
  self.assertTrue(schema1 is ISchema1)
>From grok.testing's warn():
/home/jenkins/workspace/plone-5.0-python-2.7/src/plone.dexterity/plone/dexterity/tests/test_schema_cache.py:75: PendingDeprecationWarning: Please use assertTrue instead.
  self.assertTrue(schema2 is ISchema2)
>From grok.testing's warn():
/home/jenkins/workspace/plone-5.0-python-2.7/src/plone.dexterity/plone/dexterity/tests/test_schema_cache.py:135: PendingDeprecationWarning: Please use assertTrue instead.
  self.assertTrue(schema1 is None)
>From grok.testing's warn():
/home/jenkins/workspace/plone-5.0-python-2.7/src/plone.dexterity/plone/dexterity/tests/test_schema_cache.py:136: PendingDeprecationWarning: Please use assertTrue instead.
  self.assertTrue(schema2 is schema3 is ISchema1)
>From grok.testing's warn():
/home/jenkins/workspace/plone-5.0-python-2.7/src/plone.dexterity/plone/dexterity/tests/test_security.py:103: PendingDeprecationWarning: Please use assertFalse instead.
  self.assertFalse(container.__allow_access_to_unprotected_subobjects__('test', u"foo"))
>From grok.testing's warn():
/home/jenkins/workspace/plone-5.0-python-2.7/src/plone.dexterity/plone/dexterity/tests/test_security.py:104: PendingDeprecationWarning: Please use assertTrue instead.
  self.assertTrue(container.__allow_access_to_unprotected_subobjects__('foo', u"bar"))
>From grok.testing's warn():
/home/jenkins/workspace/plone-5.0-python-2.7/src/plone.dexterity/plone/dexterity/tests/test_security.py:107: PendingDeprecationWarning: Please use assertTrue instead.
  self.assertTrue(container.__allow_access_to_unprotected_subobjects__('random', u"stuff"))
>From grok.testing's warn():
/home/jenkins/workspace/plone-5.0-python-2.7/src/plone.dexterity/plone/dexterity/tests/test_security.py:273: PendingDeprecationWarning: Please use assertTrue instead.
  self.assertTrue(item.__allow_access_to_unprotected_subobjects__('', u"foo"))
>From grok.testing's warn():
/home/jenkins/workspace/plone-5.0-python-2.7/src/plone.dexterity/plone/dexterity/tests/test_security.py:63: PendingDeprecationWarning: Please use assertFalse instead.
  self.assertFalse(item.__allow_access_to_unprotected_subobjects__('test', u"foo"))
>From grok.testing's warn():
/home/jenkins/workspace/plone-5.0-python-2.7/src/plone.dexterity/plone/dexterity/tests/test_security.py:64: PendingDeprecationWarning: Please use assertTrue instead.
  self.assertTrue(item.__allow_access_to_unprotected_subobjects__('foo', u"bar"))
>From grok.testing's warn():
/home/jenkins/workspace/plone-5.0-python-2.7/src/plone.dexterity/plone/dexterity/tests/test_security.py:67: PendingDeprecationWarning: Please use assertTrue instead.
  self.assertTrue(item.__allow_access_to_unprotected_subobjects__('random', u"stuff"))
>From grok.testing's warn():
/home/jenkins/workspace/plone-5.0-python-2.7/src/plone.dexterity/plone/dexterity/tests/test_security.py:213: PendingDeprecationWarning: Please use assertTrue instead.
  self.assertTrue(item.__allow_access_to_unprotected_subobjects__('test', u"foo"))
>From grok.testing's warn():
/home/jenkins/workspace/plone-5.0-python-2.7/src/plone.dexterity/plone/dexterity/tests/test_security.py:214: PendingDeprecationWarning: Please use assertTrue instead.
  self.assertTrue(item.__allow_access_to_unprotected_subobjects__('foo', u"bar"))
>From grok.testing's warn():
/home/jenkins/workspace/plone-5.0-python-2.7/src/plone.dexterity/plone/dexterity/tests/test_security.py:217: PendingDeprecationWarning: Please use assertTrue instead.
  self.assertTrue(item.__allow_access_to_unprotected_subobjects__('random', u"stuff"))
>From grok.testing's warn():
/home/jenkins/workspace/plone-5.0-python-2.7/src/plone.dexterity/plone/dexterity/tests/test_security.py:235: PendingDeprecationWarning: Please use assertTrue instead.
  self.assertTrue(item.__allow_access_to_unprotected_subobjects__('test', u"foo"))
>From grok.testing's warn():
/home/jenkins/workspace/plone-5.0-python-2.7/src/plone.dexterity/plone/dexterity/tests/test_security.py:236: PendingDeprecationWarning: Please use assertTrue instead.
  self.assertTrue(item.__allow_access_to_unprotected_subobjects__('foo', u"bar"))
>From grok.testing's warn():
/home/jenkins/workspace/plone-5.0-python-2.7/src/plone.dexterity/plone/dexterity/tests/test_security.py:237: PendingDeprecationWarning: Please use assertTrue instead.
  self.assertTrue(item.__allow_access_to_unprotected_subobjects__('random', u"stuff"))
>From grok.testing's warn():
/home/jenkins/workspace/plone-5.0-python-2.7/src/plone.dexterity/plone/dexterity/tests/test_security.py:175: PendingDeprecationWarning: Please use assertTrue instead.
  self.assertTrue(item.__allow_access_to_unprotected_subobjects__('test', u"foo"))
>From grok.testing's warn():
/home/jenkins/workspace/plone-5.0-python-2.7/src/plone.dexterity/plone/dexterity/tests/test_security.py:176: PendingDeprecationWarning: Please use assertTrue instead.
  self.assertTrue(item.__allow_access_to_unprotected_subobjects__('foo', u"bar"))
>From grok.testing's warn():
/home/jenkins/workspace/plone-5.0-python-2.7/src/plone.dexterity/plone/dexterity/tests/test_security.py:179: PendingDeprecationWarning: Please use assertTrue instead.
  self.assertTrue(item.__allow_access_to_unprotected_subobjects__('random', u"stuff"))
>From grok.testing's warn():
/home/jenkins/workspace/plone-5.0-python-2.7/src/plone.dexterity/plone/dexterity/tests/test_security.py:256: PendingDeprecationWarning: Please use assertTrue instead.
  self.assertTrue(item.__allow_access_to_unprotected_subobjects__('test', u"foo"))
>From grok.testing's warn():
/home/jenkins/workspace/plone-5.0-python-2.7/src/plone.dexterity/plone/dexterity/tests/test_security.py:257: PendingDeprecationWarning: Please use assertTrue instead.
  self.assertTrue(item.__allow_access_to_unprotected_subobjects__('foo', u"bar"))
>From grok.testing's warn():
/home/jenkins/workspace/plone-5.0-python-2.7/src/plone.dexterity/plone/dexterity/tests/test_security.py:258: PendingDeprecationWarning: Please use assertTrue instead.
  self.assertTrue(item.__allow_access_to_unprotected_subobjects__('random', u"stuff"))
>From grok.testing's warn():
/home/jenkins/workspace/plone-5.0-python-2.7/src/plone.dexterity/plone/dexterity/tests/test_security.py:146: PendingDeprecationWarning: Please use assertFalse instead.
  self.assertFalse(item.__allow_access_to_unprotected_subobjects__('test', u"foo"))
>From grok.testing's warn():
/home/jenkins/workspace/plone-5.0-python-2.7/src/plone.dexterity/plone/dexterity/tests/test_security.py:147: PendingDeprecationWarning: Please use assertTrue instead.
  self.assertTrue(item.__allow_access_to_unprotected_subobjects__('foo', u"bar"))
>From grok.testing's warn():
/home/jenkins/workspace/plone-5.0-python-2.7/src/plone.dexterity/plone/dexterity/tests/test_security.py:150: PendingDeprecationWarning: Please use assertTrue instead.
  self.assertTrue(item.__allow_access_to_unprotected_subobjects__('random', u"stuff"))
>From grok.testing's warn():
/home/jenkins/workspace/plone-5.0-python-2.7/src/plone.dexterity/plone/dexterity/tests/test_utils.py:85: PendingDeprecationWarning: Please use assertTrue instead.
  self.assertTrue(schemata is IBehaviorSchema)
>From grok.testing's warn():
/home/jenkins/workspace/plone-5.0-python-2.7/src/plone.dexterity/plone/dexterity/tests/test_webdav.py:1195: PendingDeprecationWarning: Please use assertTrue instead.
  self.assertTrue(isinstance(r, NullResource))
>From grok.testing's warn():
/home/jenkins/workspace/plone-5.0-python-2.7/src/plone.dexterity/plone/dexterity/tests/test_webdav.py:403: PendingDeprecationWarning: Please use assertTrue instead.
  self.assertTrue(isinstance(objects[0], FolderDataResource))
>From grok.testing's warn():
/home/jenkins/workspace/plone-5.0-python-2.7/src/plone.dexterity/plone/dexterity/tests/test_webdav.py:387: PendingDeprecationWarning: Please use assertTrue instead.
  self.assertTrue(isinstance(objects[0], FolderDataResource))
>From grok.testing's warn():
/home/jenkins/.buildout/eggs/z3c.pt-3.0.0a1-py2.7.egg/z3c/pt/tests/test_templates.py:55: PendingDeprecationWarning: Please use assertFalse instead.
  self.failIf('False' in result)
>From grok.testing's warn():
/home/jenkins/.buildout/eggs/z3c.pt-3.0.0a1-py2.7.egg/z3c/pt/tests/test_templates.py:56: PendingDeprecationWarning: Please use assertTrue instead.
  self.failUnless('checked="checked"' in result)
>From grok.testing's warn():
/home/jenkins/.buildout/eggs/z3c.pt-3.0.0a1-py2.7.egg/z3c/pt/tests/test_templates.py:43: PendingDeprecationWarning: Please use assertTrue instead.
  self.failUnless('ok' in result)
>From grok.testing's warn():
/home/jenkins/.buildout/eggs/z3c.pt-3.0.0a1-py2.7.egg/z3c/pt/tests/test_templates.py:49: PendingDeprecationWarning: Please use assertTrue instead.
  self.failUnless('False' in result)
>From grok.testing's warn():
/home/jenkins/.buildout/eggs/z3c.pt-3.0.0a1-py2.7.egg/z3c/pt/tests/test_templates.py:35: PendingDeprecationWarning: Please use assertTrue instead.
  self.failUnless(repr(dont_call) in result)
>From grok.testing's warn():
/home/jenkins/.buildout/eggs/z3c.pt-3.0.0a1-py2.7.egg/z3c/pt/tests/test_templates.py:69: PendingDeprecationWarning: Please use assertTrue instead.
  self.failUnless("supported" in result)
>From grok.testing's warn():
/home/jenkins/.buildout/eggs/z3c.pt-3.0.0a1-py2.7.egg/z3c/pt/tests/test_templates.py:70: PendingDeprecationWarning: Please use assertTrue instead.
  self.failUnless("some path" in result)
>From grok.testing's warn():
/home/jenkins/.buildout/eggs/z3c.pt-3.0.0a1-py2.7.egg/z3c/pt/tests/test_templates.py:130: PendingDeprecationWarning: Please use assertTrue instead.
  self.failUnless(repr(data) in result)
>From grok.testing's warn():
/home/jenkins/.buildout/eggs/z3c.pt-3.0.0a1-py2.7.egg/z3c/pt/tests/test_templates.py:131: PendingDeprecationWarning: Please use assertTrue instead.
  self.failUnless(repr({'context': context}) in result)
>From grok.testing's warn():
/home/jenkins/.buildout/eggs/z3c.relationfield-0.6.2-py2.7.egg/z3c/relationfield/tests.py:20: PendingDeprecationWarning: Please use assertTrue instead.
  self.failUnless(isinstance(f.value_type, Relation))
  Ran 959 tests with 0 failures and 0 errors in 3.555 seconds.
Tearing down left over layers:
  Tear down zope.testrunner.layer.UnitTests in 0.000 seconds.
Total: 967 tests, 0 failures, 0 errors in 3.826 seconds.
Running Testing.ZopeTestCase.layer.ZopeLite tests:
  Set up Testing.ZopeTestCase.layer.ZopeLite in 0.029 seconds.
  Ran 32 tests with 0 failures and 0 errors in 2.689 seconds.
Running zope.testrunner.layer.UnitTests tests:
  Tear down Testing.ZopeTestCase.layer.ZopeLite in 0.000 seconds.
  Set up zope.testrunner.layer.UnitTests in 0.000 seconds.
  Ran 1 tests with 0 failures and 0 errors in 0.033 seconds.
Tearing down left over layers:
  Tear down zope.testrunner.layer.UnitTests in 0.000 seconds.
Total: 33 tests, 0 failures, 0 errors in 2.852 seconds.
/home/jenkins/.buildout/eggs/setuptools-1.3.2-py2.7.egg/pkg_resources.py:979: UserWarning: /home/jenkins/.python-eggs is writable by group/others and vulnerable to attack when used with get_resource_filename. Consider a more secure location (set with .set_extraction_path or the PYTHON_EGG_CACHE environment variable).
  warnings.warn(msg, UserWarning)
Running Products.PloneTestCase.layer.PloneSite tests:
  Set up Testing.ZopeTestCase.layer.ZopeLite in 0.000 seconds.
  Set up Products.PloneTestCase.layer.ZCML in 3.149 seconds.
  Set up Products.PloneTestCase.layer.PloneSite in 4.467 seconds.
  Ran 24 tests with 0 failures and 0 errors in 8.888 seconds.
Running Products.CMFPlacefulWorkflow.tests.test_exportimport.ExportImportLayer tests:
  Set up Products.CMFPlacefulWorkflow.tests.test_exportimport.ExportImportLayer in 0.002 seconds.
  Ran 1 tests with 0 failures and 0 errors in 9.815 seconds.
Tearing down left over layers:
  Tear down Products.CMFPlacefulWorkflow.tests.test_exportimport.ExportImportLayer in 0.000 seconds.
  Tear down Products.PloneTestCase.layer.PloneSite in 0.090 seconds.
  Tear down Products.PloneTestCase.layer.ZCML in 0.003 seconds.
  Tear down Testing.ZopeTestCase.layer.ZopeLite in 0.000 seconds.
Total: 25 tests, 0 failures, 0 errors in 26.762 seconds.
Running Products.CMFTestCase.layer.CMFSite tests:
  Set up Testing.ZopeTestCase.layer.ZopeLite in 0.160 seconds.
  Set up Products.CMFTestCase.layer.ZCML in 0.321 seconds.
  Set up Products.CMFTestCase.layer.CMFSite in 0.183 seconds.
  Ran 58 tests with 0 failures and 0 errors in 0.189 seconds.
Tearing down left over layers:
  Tear down Products.CMFTestCase.layer.CMFSite in 0.013 seconds.
  Tear down Products.CMFTestCase.layer.ZCML in 0.000 seconds.
  Tear down Testing.ZopeTestCase.layer.ZopeLite in 0.000 seconds.
/home/jenkins/.buildout/eggs/setuptools-1.3.2-py2.7.egg/pkg_resources.py:979: UserWarning: /home/jenkins/.python-eggs is writable by group/others and vulnerable to attack when used with get_resource_filename. Consider a more secure location (set with .set_extraction_path or the PYTHON_EGG_CACHE environment variable).
  warnings.warn(msg, UserWarning)
Running Products.PloneTestCase.layer.PloneSite tests:
  Set up Testing.ZopeTestCase.layer.ZopeLite in 0.448 seconds.
  Set up Products.PloneTestCase.layer.ZCML in 4.285 seconds.
  Set up Products.PloneTestCase.layer.PloneSite in 3.874 seconds.
  Ran 2 tests with 0 failures and 0 errors in 8.821 seconds.
Tearing down left over layers:
  Tear down Products.PloneTestCase.layer.PloneSite in 0.088 seconds.
  Tear down Products.PloneTestCase.layer.ZCML in 0.002 seconds.
  Tear down Testing.ZopeTestCase.layer.ZopeLite in 0.000 seconds.
/home/jenkins/.buildout/eggs/setuptools-1.3.2-py2.7.egg/pkg_resources.py:979: UserWarning: /home/jenkins/.python-eggs is writable by group/others and vulnerable to attack when used with get_resource_filename. Consider a more secure location (set with .set_extraction_path or the PYTHON_EGG_CACHE environment variable).
  warnings.warn(msg, UserWarning)
Running Products.PloneTestCase.layer.PloneSite tests:
  Set up Testing.ZopeTestCase.layer.ZopeLite in 0.482 seconds.
  Set up Products.PloneTestCase.layer.ZCML in 4.263 seconds.
  Set up Products.PloneTestCase.layer.PloneSite in 4.047 seconds.
  Ran 264 tests with 0 failures and 0 errors in 31.438 seconds.
Running zope.testrunner.layer.UnitTests tests:
  Tear down Products.PloneTestCase.layer.PloneSite in 0.097 seconds.
  Tear down Products.PloneTestCase.layer.ZCML in 0.002 seconds.
  Tear down Testing.ZopeTestCase.layer.ZopeLite in 0.000 seconds.
  Set up zope.testrunner.layer.UnitTests in 0.000 seconds.
  Ran 62 tests with 0 failures and 0 errors in 0.011 seconds.
Tearing down left over layers:
  Tear down zope.testrunner.layer.UnitTests in 0.000 seconds.
Total: 326 tests, 0 failures, 0 errors in 40.690 seconds.
/home/jenkins/.buildout/eggs/setuptools-1.3.2-py2.7.egg/pkg_resources.py:979: UserWarning: /home/jenkins/.python-eggs is writable by group/others and vulnerable to attack when used with get_resource_filename. Consider a more secure location (set with .set_extraction_path or the PYTHON_EGG_CACHE environment variable).
  warnings.warn(msg, UserWarning)
Running Products.contentmigration.tests.layer.SchemaExtenderTestLayer tests:
  Set up Testing.ZopeTestCase.layer.ZopeLite in 0.503 seconds.
  Set up Products.PloneTestCase.layer.ZCML in 4.260 seconds.
  Set up Products.PloneTestCase.layer.PloneSite in 3.867 seconds.
  Set up Products.contentmigration.tests.layer.SchemaExtenderTestLayer in 0.004 seconds.
  Ran 1 tests with 0 failures and 0 errors in 0.179 seconds.
Running Products.contentmigration.tests.layer.TestLayer tests:
  Tear down Products.contentmigration.tests.layer.SchemaExtenderTestLayer in 0.000 seconds.
  Set up Products.contentmigration.tests.layer.TestLayer in 0.000 seconds.
  Ran 13 tests with 0 failures and 0 errors in 3.795 seconds.
Tearing down left over layers:
  Tear down Products.contentmigration.tests.layer.TestLayer in 0.000 seconds.
  Tear down Products.PloneTestCase.layer.PloneSite in 0.088 seconds.
  Tear down Products.PloneTestCase.layer.ZCML in 0.002 seconds.
  Tear down Testing.ZopeTestCase.layer.ZopeLite in 0.000 seconds.
Total: 14 tests, 0 failures, 0 errors in 13.045 seconds.
Running zope.testrunner.layer.UnitTests tests:
  Set up zope.testrunner.layer.UnitTests in 0.000 seconds.
  Ran 5 tests with 0 failures and 0 errors in 0.867 seconds.
Tearing down left over layers:
  Tear down zope.testrunner.layer.UnitTests in 0.000 seconds.
Running Testing.ZopeTestCase.layer.ZopeLite tests:
  Set up Testing.ZopeTestCase.layer.ZopeLite in 0.028 seconds.
  Ran 3 tests with 0 failures and 0 errors in 0.603 seconds.
Tearing down left over layers:
  Tear down Testing.ZopeTestCase.layer.ZopeLite in 0.000 seconds.
/home/jenkins/.buildout/eggs/setuptools-1.3.2-py2.7.egg/pkg_resources.py:979: UserWarning: /home/jenkins/.python-eggs is writable by group/others and vulnerable to attack when used with get_resource_filename. Consider a more secure location (set with .set_extraction_path or the PYTHON_EGG_CACHE environment variable).
  warnings.warn(msg, UserWarning)
***********************************************
WARNING: LinguaPlone not found. Skipping tests.
***********************************************
***********************************************
WARNING: LinguaPlone not found. Skipping tests.
***********************************************
Running plone.app.blob.tests.layer.BlobLayer tests:
  Set up Testing.ZopeTestCase.layer.ZopeLite in 0.486 seconds.
  Set up Products.PloneTestCase.layer.ZCML in 4.202 seconds.
  Set up Products.PloneTestCase.layer.PloneSite in 3.849 seconds.
  Set up plone.app.blob.tests.layer.BlobLayer in 0.045 seconds.
  Ran 27 tests with 0 failures and 0 errors in 13.037 seconds.
Running plone.app.blob.tests.layer.BlobReplacementLayer tests:
  Set up plone.app.blob.tests.layer.BlobReplacementLayer in 0.085 seconds.
  Ran 63 tests with 0 failures and 0 errors in 13.065 seconds.
Running zope.testrunner.layer.UnitTests tests:
  Tear down plone.app.blob.tests.layer.BlobReplacementLayer in 0.000 seconds.
  Tear down plone.app.blob.tests.layer.BlobLayer in 0.000 seconds.
  Tear down Products.PloneTestCase.layer.PloneSite in 0.086 seconds.
  Tear down Products.PloneTestCase.layer.ZCML in 0.003 seconds.
  Tear down Testing.ZopeTestCase.layer.ZopeLite in 0.000 seconds.
  Set up zope.testrunner.layer.UnitTests in 0.000 seconds.
  Ran 2 tests with 0 failures and 0 errors in 0.001 seconds.
Tearing down left over layers:
  Tear down zope.testrunner.layer.UnitTests in 0.000 seconds.
Total: 92 tests, 0 failures, 0 errors in 35.441 seconds.
/home/jenkins/.buildout/eggs/setuptools-1.3.2-py2.7.egg/pkg_resources.py:979: UserWarning: /home/jenkins/.python-eggs is writable by group/others and vulnerable to attack when used with get_resource_filename. Consider a more secure location (set with .set_extraction_path or the PYTHON_EGG_CACHE environment variable).
  warnings.warn(msg, UserWarning)
Running Products.PloneTestCase.layer.PloneSite tests:
  Set up Testing.ZopeTestCase.layer.ZopeLite in 0.495 seconds.
  Set up Products.PloneTestCase.layer.ZCML in 4.211 seconds.
  Set up Products.PloneTestCase.layer.PloneSite in 3.854 seconds.
  Ran 6 tests with 0 failures and 0 errors in 13.926 seconds.
Running plone.app.content.testing.PloneAppContent:Integration tests:
  Tear down Products.PloneTestCase.layer.PloneSite in 0.088 seconds.
  Tear down Products.PloneTestCase.layer.ZCML in 0.002 seconds.
  Tear down Testing.ZopeTestCase.layer.ZopeLite in 0.000 seconds.
  Set up plone.testing.zca.LayerCleanup in 0.000 seconds.
  Set up plone.testing.z2.Startup in 0.077 seconds.
  Set up plone.app.testing.layers.PloneFixture in 4.695 seconds.
  Set up plone.app.content.testing.PloneAppContent in 0.039 seconds.
  Set up plone.app.content.testing.PloneAppContent:Integration in 0.000 seconds.
  Ran 1 tests with 0 failures and 0 errors in 6.360 seconds.
Running zope.testrunner.layer.UnitTests tests:
  Tear down plone.app.content.testing.PloneAppContent:Integration in 0.000 seconds.
  Tear down plone.app.content.testing.PloneAppContent in 0.004 seconds.
  Tear down plone.app.testing.layers.PloneFixture in 0.057 seconds.
  Tear down plone.testing.z2.Startup in 0.004 seconds.
  Tear down plone.testing.zca.LayerCleanup in 0.001 seconds.
  Set up zope.testrunner.layer.UnitTests in 0.000 seconds.
  Ran 2 tests with 0 failures and 0 errors in 0.011 seconds.
Tearing down left over layers:
  Tear down zope.testrunner.layer.UnitTests in 0.000 seconds.
Total: 9 tests, 0 failures, 0 errors in 34.389 seconds.
/home/jenkins/.buildout/eggs/setuptools-1.3.2-py2.7.egg/pkg_resources.py:979: UserWarning: /home/jenkins/.python-eggs is writable by group/others and vulnerable to attack when used with get_resource_filename. Consider a more secure location (set with .set_extraction_path or the PYTHON_EGG_CACHE environment variable).
  warnings.warn(msg, UserWarning)
Running plone.app.imaging.testing.ImagingLayer tests:
  Set up Testing.ZopeTestCase.layer.ZopeLite in 0.497 seconds.
  Set up Products.PloneTestCase.layer.ZCML in 4.220 seconds.
  Set up Products.PloneTestCase.layer.PloneSite in 3.860 seconds.
  Set up collective.testcaselayer.ptc.PTCLayer in 0.018 seconds.
  Set up plone.app.imaging.testing.ImagingLayer in 0.063 seconds.
  Ran 47 tests with 0 failures and 0 errors in 12.246 seconds.
Running zope.testrunner.layer.UnitTests tests:
  Tear down plone.app.imaging.testing.ImagingLayer in 0.000 seconds.
  Tear down collective.testcaselayer.ptc.PTCLayer in 0.000 seconds.
  Tear down Products.PloneTestCase.layer.PloneSite in 0.088 seconds.
  Tear down Products.PloneTestCase.layer.ZCML in 0.002 seconds.
  Tear down Testing.ZopeTestCase.layer.ZopeLite in 0.000 seconds.
  Set up zope.testrunner.layer.UnitTests in 0.000 seconds.
  Ran 7 tests with 0 failures and 0 errors in 0.001 seconds.
Tearing down left over layers:
  Tear down zope.testrunner.layer.UnitTests in 0.000 seconds.
Total: 54 tests, 0 failures, 0 errors in 21.367 seconds.
/home/jenkins/.buildout/eggs/setuptools-1.3.2-py2.7.egg/pkg_resources.py:979: UserWarning: /home/jenkins/.python-eggs is writable by group/others and vulnerable to attack when used with get_resource_filename. Consider a more secure location (set with .set_extraction_path or the PYTHON_EGG_CACHE environment variable).
  warnings.warn(msg, UserWarning)
Running Products.PloneTestCase.layer.PloneSite tests:
  Set up Testing.ZopeTestCase.layer.ZopeLite in 0.491 seconds.
  Set up Products.PloneTestCase.layer.ZCML in 4.227 seconds.
  Set up Products.PloneTestCase.layer.PloneSite in 3.865 seconds.
  Ran 3 tests with 0 failures and 0 errors in 4.851 seconds.
Running plone.app.linkintegrity.tests.layer.PloneLinkintegrity tests:
  Set up collective.testcaselayer.ptc.PTCLayer in 0.017 seconds.
  Set up plone.app.linkintegrity.tests.layer.PloneLinkintegrity in 0.675 seconds.
  Ran 35 tests with 0 failures and 0 errors in 29.987 seconds.
Running zope.testrunner.layer.UnitTests tests:
  Tear down plone.app.linkintegrity.tests.layer.PloneLinkintegrity in 0.000 seconds.
  Tear down collective.testcaselayer.ptc.PTCLayer in 0.000 seconds.
  Tear down Products.PloneTestCase.layer.PloneSite in 0.089 seconds.
  Tear down Products.PloneTestCase.layer.ZCML in 0.002 seconds.
  Tear down Testing.ZopeTestCase.layer.ZopeLite in 0.000 seconds.
  Set up zope.testrunner.layer.UnitTests in 0.000 seconds.
  Ran 4 tests with 0 failures and 0 errors in 0.001 seconds.
Tearing down left over layers:
  Tear down zope.testrunner.layer.UnitTests in 0.000 seconds.
Total: 42 tests, 0 failures, 0 errors in 44.862 seconds.
Running plone.app.viewletmanager.tests.test_exportimport.Layer tests:
  Set up Testing.ZopeTestCase.layer.ZopeLite in 0.027 seconds.
  Set up Products.PloneTestCase.layer.ZCML/home/jenkins/.buildout/eggs/setuptools-1.3.2-py2.7.egg/pkg_resources.py:979: UserWarning: /home/jenkins/.python-eggs is writable by group/others and vulnerable to attack when used with get_resource_filename. Consider a more secure location (set with .set_extraction_path or the PYTHON_EGG_CACHE environment variable).
  warnings.warn(msg, UserWarning)
 in 5.567 seconds.
  Set up Products.PloneTestCase.layer.PloneSite in 0.000 seconds.
  Set up plone.app.viewletmanager.tests.test_exportimport.Layer in 0.000 seconds.
  Ran 17 tests with 0 failures and 0 errors in 0.050 seconds.
Running zope.testrunner.layer.UnitTests tests:
  Tear down plone.app.viewletmanager.tests.test_exportimport.Layer in 0.000 seconds.
  Tear down Products.PloneTestCase.layer.PloneSite in 0.000 seconds.
  Tear down Products.PloneTestCase.layer.ZCML in 0.001 seconds.
  Tear down Testing.ZopeTestCase.layer.ZopeLite in 0.000 seconds.
  Set up zope.testrunner.layer.UnitTests in 0.000 seconds.
  Ran 25 tests with 0 failures and 0 errors in 0.083 seconds.
Tearing down left over layers:
  Tear down zope.testrunner.layer.UnitTests in 0.000 seconds.
Total: 42 tests, 0 failures, 0 errors in 6.032 seconds.
Running plone.formwidget.autocomplete.tests.ZCMLLayer tests:
  Set up Testing.ZopeTestCase.layer.ZopeLite in 0.028 seconds.
  Set up Products.PloneTestCase.layer.ZCML in 0.122 seconds.
  Set up plone.formwidget.autocomplete.tests.ZCMLLayer in 0.069 seconds.
  Ran 1 tests with 0 failures and 0 errors in 1.418 seconds.
Tearing down left over layers:
  Tear down plone.formwidget.autocomplete.tests.ZCMLLayer in 0.000 seconds.
  Tear down Products.PloneTestCase.layer.ZCML in 0.000 seconds.
  Tear down Testing.ZopeTestCase.layer.ZopeLite in 0.000 seconds.
Running plone.formwidget.contenttree.testing_zcml_layer tests:
  Set up plone.formwidget.contenttree.testing_zcml_layer in 0.371 seconds.
  Ran 1 tests with 0 failures and 0 errors in 0.004 seconds.
Tearing down left over layers:
  Tear down plone.formwidget.contenttree.testing_zcml_layer ... not supported
Total: 0 tests, 0 failures, 0 errors in 0.000 seconds.
Running plone.resource.testing.plone.resource:DemoTraverser tests:
  Set up plone.testing.zca.LayerCleanup in 0.000 seconds.
  Set up plone.testing.z2.Startup in 0.168 seconds.
  Set up plone.testing.zca.ZCMLDirectives in 0.003 seconds.
  Set up plone.testing.security.Checkers in 0.000 seconds.
  Set up plone.testing.publisher.PublisherDirectives in 0.014 seconds.
  Set up plone.resource.testing.DemoTraverser in 0.006 seconds.
  Set up plone.resource.testing.plone.resource:DemoTraverser in 0.000 seconds.
  Ran 27 tests with 0 failures and 0 errors in 0.046 seconds.
Running plone.resource.testing.plone.resource:Integration tests:
  Tear down plone.resource.testing.plone.resource:DemoTraverser in 0.000 seconds.
  Tear down plone.resource.testing.DemoTraverser in 0.000 seconds.
  Tear down plone.testing.publisher.PublisherDirectives in 0.000 seconds.
  Tear down plone.testing.zca.ZCMLDirectives in 0.000 seconds.
  Tear down plone.testing.security.Checkers in 0.000 seconds.
  Set up plone.app.testing.layers.PloneFixture/home/jenkins/.buildout/eggs/setuptools-1.3.2-py2.7.egg/pkg_resources.py:979: UserWarning: /home/jenkins/.python-eggs is writable by group/others and vulnerable to attack when used with get_resource_filename. Consider a more secure location (set with .set_extraction_path or the PYTHON_EGG_CACHE environment variable).
  warnings.warn(msg, UserWarning)
 in 7.707 seconds.
  Set up plone.resource.testing.PloneResource in 0.067 seconds.
  Set up plone.resource.testing.plone.resource:Integration in 0.000 seconds.
  Ran 1 tests with 0 failures and 0 errors in 0.002 seconds.
Running plone.testing.zca.UnitTesting tests:
  Tear down plone.resource.testing.plone.resource:Integration in 0.000 seconds.
  Tear down plone.resource.testing.PloneResource in 0.002 seconds.
  Tear down plone.app.testing.layers.PloneFixture in 0.058 seconds.
  Tear down plone.testing.z2.Startup in 0.005 seconds.
  Tear down plone.testing.zca.LayerCleanup in 0.001 seconds.
  Set up plone.testing.zca.UnitTesting in 0.000 seconds.
  Ran 3 tests with 0 failures and 0 errors in 0.076 seconds.
Running zope.testrunner.layer.UnitTests tests:
  Tear down plone.testing.zca.UnitTesting in 0.000 seconds.
  Set up zope.testrunner.layer.UnitTests in 0.000 seconds.
  Ran 44 tests with 0 failures and 0 errors in 0.065 seconds.
Tearing down left over layers:
  Tear down zope.testrunner.layer.UnitTests in 0.000 seconds.
Total: 75 tests, 0 failures, 0 errors in 8.772 seconds.
Running zope.testrunner.layer.UnitTests tests:
  Set up zope.testrunner.layer.UnitTests in 0.000 seconds.
  Ran 7 tests with 0 failures and 0 errors in 13.113 seconds.
Tearing down left over layers:
  Tear down zope.testrunner.layer.UnitTests in 0.000 seconds.
#### Running tests for group ATCT ####
#### Finished tests for group ATCT ####

#### Running tests for group Archetypes ####
#### Finished tests for group Archetypes ####

#### Running tests for group CMF ####
#### Finished tests for group CMF ####

#### Running tests for group CMFEditions ####
#### Finished tests for group CMFEditions ####

#### Running tests for group Dexterity ####
#### Finished tests for group Dexterity ####

#### Running tests for group Plone ####
#### Finished tests for group Plone ####

#### Running tests for group PlonePAS ####
#### Finished tests for group PlonePAS ####

#### Running tests for group PloneTestCase ####
#### Finished tests for group PloneTestCase ####

#### Running tests for group plone ####
#### Finished tests for group plone ####

#### Running tests for group plone_app_testing ####
#### Finished tests for group plone_app_testing ####

#### Running tests for group portlets ####
#### Finished tests for group portlets ####

#### Running tests for group unit_tests ####
#### Finished tests for group unit_tests ####

#### Running tests for group zope_tests ####
#### Finished tests for group zope_tests ####

#### Running tests for Products.CMFPlacefulWorkflow ####
#### Finished tests for Products.CMFPlacefulWorkflow ####

#### Running tests for Products.CMFTestCase ####
#### Finished tests for Products.CMFTestCase ####

#### Running tests for Products.PasswordResetTool ####
#### Finished tests for Products.PasswordResetTool ####

#### Running tests for Products.ResourceRegistries ####
#### Finished tests for Products.ResourceRegistries ####

#### Running tests for Products.contentmigration ####
#### Finished tests for Products.contentmigration ####

#### Running tests for collective.z3cform.datetimewidget ####
#### Finished tests for collective.z3cform.datetimewidget ####

#### Running tests for five.customerize ####
#### Finished tests for five.customerize ####

#### Running tests for plone.app.blob ####
#### Finished tests for plone.app.blob ####

#### Running tests for plone.app.content ####
#### Finished tests for plone.app.content ####

#### Running tests for plone.app.imaging ####
#### Finished tests for plone.app.imaging ####

#### Running tests for plone.app.linkintegrity ####
#### Finished tests for plone.app.linkintegrity ####

#### Running tests for plone.app.viewletmanager ####
#### Finished tests for plone.app.viewletmanager ####

#### Running tests for plone.formwidget.autocomplete ####
#### Finished tests for plone.formwidget.autocomplete ####

#### Running tests for plone.formwidget.contenttree ####
#### Finished tests for plone.formwidget.contenttree ####

#### Running tests for plone.formwidget.querystring ####
#### Finished tests for plone.formwidget.querystring ####

#### Running tests for plone.resource ####
#### Finished tests for plone.resource ####

#### Running tests for plone.testing ####
#### Finished tests for plone.testing ####

Packages with test failures:

Failing tests in group Plone
Failing tests in group plone_app_testing

Total time elapsed: 2785.471 seconds

Grand total: 133 packages, 2 failures

Build step 'Execute shell' marked build as failure
Xvfb stopping
Archiving artifacts
Recording test results
Robot results publisher started...
-Parsing output xml:
Done!
-Copying log files to build dir:
Done!
-Assigning results to build:
Done!
-Checking thresholds:
Done!
Done publishing Robot results.
Recording fingerprints
Email was triggered for: Still Failing
Trigger Failure was overridden by another trigger and will not send an email.
Sending email for trigger: Still Failing


-------------------------------------------------------------------------------

-------------- next part --------------
A non-text attachment was scrubbed...
Name: CHANGES.log
Type: application/octet-stream
Size: 2326 bytes
Desc: not available
URL: <http://lists.plone.org/pipermail/plone-testbot/attachments/20140128/6965a86e/attachment-0002.obj>
-------------- next part --------------
A non-text attachment was scrubbed...
Name: build.log
Type: application/octet-stream
Size: 159816 bytes
Desc: not available
URL: <http://lists.plone.org/pipermail/plone-testbot/attachments/20140128/6965a86e/attachment-0003.obj>


More information about the Testbot mailing list