[Testbot] Plone 4.3 – Python 2.7 – Build # 706 – Regression! – 28 failure(s)

admin at jenkins.plone.org admin at jenkins.plone.org
Thu Feb 14 20:12:28 UTC 2013


https://jenkins.plone.org/job/plone-4.3-python-2.7/706/

Total: 5816
Pass: 5788
Fail:  28

FAILED TESTS
------------

28 tests failed.
REGRESSION:  plone.app.dexterity.tests.nextprevious.txt

Error Message:
Failed doctest test for nextprevious.txt

Stack Trace:
Failed doctest test for nextprevious.txt
  File "/home/jenkins/workspace/plone-4.3-python-2.7/src/plone.app.dexterity/plone/app/dexterity/tests/nextprevious.txt", line 0

----------------------------------------------------------------------
File "/home/jenkins/workspace/plone-4.3-python-2.7/src/plone.app.dexterity/plone/app/dexterity/tests/nextprevious.txt", line 9, in nextprevious.txt
Failed example:
    portal.portal_types._setObject('folder', fti)
Exception raised:
    Traceback (most recent call last):
      File "/usr/lib/python2.7/doctest.py", line 1289, in __run
        compileflags, 1) in test.globs
      File "<doctest nextprevious.txt[3]>", line 1, in <module>
        portal.portal_types._setObject('folder', fti)
      File "/home/jenkins/.buildout/eggs/Zope2-2.13.19-py2.7.egg/OFS/ObjectManager.py", line 325, in _setObject
        v = self._checkId(id)
      File "/home/jenkins/.buildout/eggs/Zope2-2.13.19-py2.7.egg/OFS/ObjectManager.py", line 116, in checkValidId
        'The id "%s" is invalid - it is already in use.' % id)
    BadRequest: The id "folder" is invalid - it is already in use.


  File "/usr/lib/python2.7/unittest/case.py", line 327, in run
    testMethod()
  File "/usr/lib/python2.7/doctest.py", line 2201, in runTest
    raise self.failureException(self.format_failure(new.getvalue()))


FAILED:  plone.app.testing.layers.rst

Error Message:
Failed doctest test for layers.rst

Stack Trace:
Failed doctest test for layers.rst
  File "/home/jenkins/workspace/plone-4.3-python-2.7/src/plone.app.testing/plone/app/testing/layers.rst", line 0

----------------------------------------------------------------------
File "/home/jenkins/workspace/plone-4.3-python-2.7/src/plone.app.testing/plone/app/testing/layers.rst", line 287, in layers.rst
Failed example:
    runner.setup_layer(options, layers.PLONE_ZSERVER, setupLayers)
Exception raised:
    Traceback (most recent call last):
      File "/usr/lib/python2.7/doctest.py", line 1289, in __run
        compileflags, 1) in test.globs
      File "<doctest layers.rst[72]>", line 1, in <module>
        runner.setup_layer(options, layers.PLONE_ZSERVER, setupLayers)
      File "/home/jenkins/.buildout/eggs/zope.testing-3.9.7-py2.7.egg/zope/testing/testrunner/runner.py", line 628, in setup_layer
        setup_layer(options, base, setup_layers)
      File "/home/jenkins/.buildout/eggs/zope.testing-3.9.7-py2.7.egg/zope/testing/testrunner/runner.py", line 633, in setup_layer
        layer.setUp()
      File "/home/jenkins/workspace/plone-4.3-python-2.7/src/plone.testing/src/plone/testing/z2.py", line 889, in setUp
        self.setUpServer()
      File "/home/jenkins/workspace/plone-4.3-python-2.7/src/plone.testing/src/plone/testing/z2.py", line 924, in setUpServer
        server = zhttp_server(ip=self.host, port=self.port, resolver=None, logger_object=zopeLog)
      File "/home/jenkins/.buildout/eggs/Zope2-2.13.19-py2.7.egg/ZServer/HTTPServer.py", line 449, in __init__
        http_server.__init__(self, ip, port, resolver, logger_object)
      File "/home/jenkins/.buildout/eggs/Zope2-2.13.19-py2.7.egg/ZServer/medusa/http_server.py", line 558, in __init__
        self.bind ((ip, port))
      File "/usr/lib/python2.7/asyncore.py", line 341, in bind
        return self.socket.bind(addr)
      File "/usr/lib/python2.7/socket.py", line 224, in meth
        return getattr(self._sock,name)(*args)
    error: [Errno 98] Address already in use


  File "/usr/lib/python2.7/unittest/case.py", line 327, in run
    testMethod()
  File "/usr/lib/python2.7/doctest.py", line 2201, in runTest
    raise self.failureException(self.format_failure(new.getvalue()))


FAILED:  src.plone.testing.z2.txt

Error Message:
Failed doctest test for z2.txt

Stack Trace:
Failed doctest test for z2.txt
  File "/home/jenkins/workspace/plone-4.3-python-2.7/src/plone.testing/src/plone/testing/z2.txt", line 0

----------------------------------------------------------------------
File "/home/jenkins/workspace/plone-4.3-python-2.7/src/plone.testing/src/plone/testing/z2.txt", line 491, in z2.txt
Failed example:
    runner.setup_layer(options, z2.ZSERVER, setupLayers)
Exception raised:
    Traceback (most recent call last):
      File "/usr/lib/python2.7/doctest.py", line 1289, in __run
        compileflags, 1) in test.globs
      File "<doctest z2.txt[114]>", line 1, in <module>
        runner.setup_layer(options, z2.ZSERVER, setupLayers)
      File "/home/jenkins/.buildout/eggs/zope.testing-3.9.7-py2.7.egg/zope/testing/testrunner/runner.py", line 628, in setup_layer
        setup_layer(options, base, setup_layers)
      File "/home/jenkins/.buildout/eggs/zope.testing-3.9.7-py2.7.egg/zope/testing/testrunner/runner.py", line 633, in setup_layer
        layer.setUp()
      File "/home/jenkins/workspace/plone-4.3-python-2.7/src/plone.testing/src/plone/testing/z2.py", line 889, in setUp
        self.setUpServer()
      File "/home/jenkins/workspace/plone-4.3-python-2.7/src/plone.testing/src/plone/testing/z2.py", line 924, in setUpServer
        server = zhttp_server(ip=self.host, port=self.port, resolver=None, logger_object=zopeLog)
      File "/home/jenkins/.buildout/eggs/Zope2-2.13.19-py2.7.egg/ZServer/HTTPServer.py", line 449, in __init__
        http_server.__init__(self, ip, port, resolver, logger_object)
      File "/home/jenkins/.buildout/eggs/Zope2-2.13.19-py2.7.egg/ZServer/medusa/http_server.py", line 558, in __init__
        self.bind ((ip, port))
      File "/usr/lib/python2.7/asyncore.py", line 341, in bind
        return self.socket.bind(addr)
      File "/usr/lib/python2.7/socket.py", line 224, in meth
        return getattr(self._sock,name)(*args)
    error: [Errno 98] Address already in use


  File "/usr/lib/python2.7/unittest/case.py", line 327, in run
    testMethod()
  File "/usr/lib/python2.7/doctest.py", line 2201, in runTest
    raise self.failureException(self.format_failure(new.getvalue()))


FAILED:  plone.app.dexterity.tests.test_constrains.DocumentIntegrationTest.test_allowedContentTypesExit1

Error Message:
The id "folder" is invalid - it is already in use.

Stack Trace:
The id "folder" is invalid - it is already in use.

  File "/home/jenkins/.buildout/eggs/unittest2-0.5.1-py2.7.egg/unittest2/case.py", line 333, in run
    self.setUp()
  File "/home/jenkins/workspace/plone-4.3-python-2.7/src/plone.app.dexterity/plone/app/dexterity/tests/test_constrains.py", line 46, in setUp
    self.fti = add_folder_type(self.portal)
  File "/home/jenkins/workspace/plone-4.3-python-2.7/src/plone.app.dexterity/plone/app/dexterity/tests/test_constrains.py", line 26, in add_folder_type
    portal.portal_types._setObject('folder', fti)
  File "/home/jenkins/.buildout/eggs/Zope2-2.13.19-py2.7.egg/OFS/ObjectManager.py", line 325, in _setObject
    v = self._checkId(id)
  File "/home/jenkins/.buildout/eggs/Zope2-2.13.19-py2.7.egg/OFS/ObjectManager.py", line 116, in checkValidId
    'The id "%s" is invalid - it is already in use.' % id)


FAILED:  plone.app.dexterity.tests.test_constrains.DocumentIntegrationTest.test_allowedContentTypesExit2

Error Message:
The id "folder" is invalid - it is already in use.

Stack Trace:
The id "folder" is invalid - it is already in use.

  File "/home/jenkins/.buildout/eggs/unittest2-0.5.1-py2.7.egg/unittest2/case.py", line 333, in run
    self.setUp()
  File "/home/jenkins/workspace/plone-4.3-python-2.7/src/plone.app.dexterity/plone/app/dexterity/tests/test_constrains.py", line 46, in setUp
    self.fti = add_folder_type(self.portal)
  File "/home/jenkins/workspace/plone-4.3-python-2.7/src/plone.app.dexterity/plone/app/dexterity/tests/test_constrains.py", line 26, in add_folder_type
    portal.portal_types._setObject('folder', fti)
  File "/home/jenkins/.buildout/eggs/Zope2-2.13.19-py2.7.egg/OFS/ObjectManager.py", line 325, in _setObject
    v = self._checkId(id)
  File "/home/jenkins/.buildout/eggs/Zope2-2.13.19-py2.7.egg/OFS/ObjectManager.py", line 116, in checkValidId
    'The id "%s" is invalid - it is already in use.' % id)


FAILED:  plone.app.dexterity.tests.test_constrains.DocumentIntegrationTest.test_allowedContentTypesExit3

Error Message:
The id "folder" is invalid - it is already in use.

Stack Trace:
The id "folder" is invalid - it is already in use.

  File "/home/jenkins/.buildout/eggs/unittest2-0.5.1-py2.7.egg/unittest2/case.py", line 333, in run
    self.setUp()
  File "/home/jenkins/workspace/plone-4.3-python-2.7/src/plone.app.dexterity/plone/app/dexterity/tests/test_constrains.py", line 46, in setUp
    self.fti = add_folder_type(self.portal)
  File "/home/jenkins/workspace/plone-4.3-python-2.7/src/plone.app.dexterity/plone/app/dexterity/tests/test_constrains.py", line 26, in add_folder_type
    portal.portal_types._setObject('folder', fti)
  File "/home/jenkins/.buildout/eggs/Zope2-2.13.19-py2.7.egg/OFS/ObjectManager.py", line 325, in _setObject
    v = self._checkId(id)
  File "/home/jenkins/.buildout/eggs/Zope2-2.13.19-py2.7.egg/OFS/ObjectManager.py", line 116, in checkValidId
    'The id "%s" is invalid - it is already in use.' % id)


FAILED:  plone.app.dexterity.tests.test_constrains.DocumentIntegrationTest.test_allowedContentTypesExit4

Error Message:
The id "folder" is invalid - it is already in use.

Stack Trace:
The id "folder" is invalid - it is already in use.

  File "/home/jenkins/.buildout/eggs/unittest2-0.5.1-py2.7.egg/unittest2/case.py", line 333, in run
    self.setUp()
  File "/home/jenkins/workspace/plone-4.3-python-2.7/src/plone.app.dexterity/plone/app/dexterity/tests/test_constrains.py", line 46, in setUp
    self.fti = add_folder_type(self.portal)
  File "/home/jenkins/workspace/plone-4.3-python-2.7/src/plone.app.dexterity/plone/app/dexterity/tests/test_constrains.py", line 26, in add_folder_type
    portal.portal_types._setObject('folder', fti)
  File "/home/jenkins/.buildout/eggs/Zope2-2.13.19-py2.7.egg/OFS/ObjectManager.py", line 325, in _setObject
    v = self._checkId(id)
  File "/home/jenkins/.buildout/eggs/Zope2-2.13.19-py2.7.egg/OFS/ObjectManager.py", line 116, in checkValidId
    'The id "%s" is invalid - it is already in use.' % id)


FAILED:  plone.app.dexterity.tests.test_constrains.DocumentIntegrationTest.test_behavior_added

Error Message:
The id "folder" is invalid - it is already in use.

Stack Trace:
The id "folder" is invalid - it is already in use.

  File "/home/jenkins/.buildout/eggs/unittest2-0.5.1-py2.7.egg/unittest2/case.py", line 333, in run
    self.setUp()
  File "/home/jenkins/workspace/plone-4.3-python-2.7/src/plone.app.dexterity/plone/app/dexterity/tests/test_constrains.py", line 46, in setUp
    self.fti = add_folder_type(self.portal)
  File "/home/jenkins/workspace/plone-4.3-python-2.7/src/plone.app.dexterity/plone/app/dexterity/tests/test_constrains.py", line 26, in add_folder_type
    portal.portal_types._setObject('folder', fti)
  File "/home/jenkins/.buildout/eggs/Zope2-2.13.19-py2.7.egg/OFS/ObjectManager.py", line 325, in _setObject
    v = self._checkId(id)
  File "/home/jenkins/.buildout/eggs/Zope2-2.13.19-py2.7.egg/OFS/ObjectManager.py", line 116, in checkValidId
    'The id "%s" is invalid - it is already in use.' % id)


FAILED:  plone.app.dexterity.tests.test_constrains.DocumentIntegrationTest.test_canSetConstrainTypesMode

Error Message:
The id "folder" is invalid - it is already in use.

Stack Trace:
The id "folder" is invalid - it is already in use.

  File "/home/jenkins/.buildout/eggs/unittest2-0.5.1-py2.7.egg/unittest2/case.py", line 333, in run
    self.setUp()
  File "/home/jenkins/workspace/plone-4.3-python-2.7/src/plone.app.dexterity/plone/app/dexterity/tests/test_constrains.py", line 46, in setUp
    self.fti = add_folder_type(self.portal)
  File "/home/jenkins/workspace/plone-4.3-python-2.7/src/plone.app.dexterity/plone/app/dexterity/tests/test_constrains.py", line 26, in add_folder_type
    portal.portal_types._setObject('folder', fti)
  File "/home/jenkins/.buildout/eggs/Zope2-2.13.19-py2.7.egg/OFS/ObjectManager.py", line 325, in _setObject
    v = self._checkId(id)
  File "/home/jenkins/.buildout/eggs/Zope2-2.13.19-py2.7.egg/OFS/ObjectManager.py", line 116, in checkValidId
    'The id "%s" is invalid - it is already in use.' % id)


FAILED:  plone.app.dexterity.tests.test_constrains.DocumentIntegrationTest.test_constrainTypesModeDefault

Error Message:
The id "folder" is invalid - it is already in use.

Stack Trace:
The id "folder" is invalid - it is already in use.

  File "/home/jenkins/.buildout/eggs/unittest2-0.5.1-py2.7.egg/unittest2/case.py", line 333, in run
    self.setUp()
  File "/home/jenkins/workspace/plone-4.3-python-2.7/src/plone.app.dexterity/plone/app/dexterity/tests/test_constrains.py", line 46, in setUp
    self.fti = add_folder_type(self.portal)
  File "/home/jenkins/workspace/plone-4.3-python-2.7/src/plone.app.dexterity/plone/app/dexterity/tests/test_constrains.py", line 26, in add_folder_type
    portal.portal_types._setObject('folder', fti)
  File "/home/jenkins/.buildout/eggs/Zope2-2.13.19-py2.7.egg/OFS/ObjectManager.py", line 325, in _setObject
    v = self._checkId(id)
  File "/home/jenkins/.buildout/eggs/Zope2-2.13.19-py2.7.egg/OFS/ObjectManager.py", line 116, in checkValidId
    'The id "%s" is invalid - it is already in use.' % id)


FAILED:  plone.app.dexterity.tests.test_constrains.DocumentIntegrationTest.test_constrainTypesModeInvalidSet

Error Message:
The id "folder" is invalid - it is already in use.

Stack Trace:
The id "folder" is invalid - it is already in use.

  File "/home/jenkins/.buildout/eggs/unittest2-0.5.1-py2.7.egg/unittest2/case.py", line 333, in run
    self.setUp()
  File "/home/jenkins/workspace/plone-4.3-python-2.7/src/plone.app.dexterity/plone/app/dexterity/tests/test_constrains.py", line 46, in setUp
    self.fti = add_folder_type(self.portal)
  File "/home/jenkins/workspace/plone-4.3-python-2.7/src/plone.app.dexterity/plone/app/dexterity/tests/test_constrains.py", line 26, in add_folder_type
    portal.portal_types._setObject('folder', fti)
  File "/home/jenkins/.buildout/eggs/Zope2-2.13.19-py2.7.egg/OFS/ObjectManager.py", line 325, in _setObject
    v = self._checkId(id)
  File "/home/jenkins/.buildout/eggs/Zope2-2.13.19-py2.7.egg/OFS/ObjectManager.py", line 116, in checkValidId
    'The id "%s" is invalid - it is already in use.' % id)


FAILED:  plone.app.dexterity.tests.test_constrains.DocumentIntegrationTest.test_constrainTypesModeValidSet

Error Message:
The id "folder" is invalid - it is already in use.

Stack Trace:
The id "folder" is invalid - it is already in use.

  File "/home/jenkins/.buildout/eggs/unittest2-0.5.1-py2.7.egg/unittest2/case.py", line 333, in run
    self.setUp()
  File "/home/jenkins/workspace/plone-4.3-python-2.7/src/plone.app.dexterity/plone/app/dexterity/tests/test_constrains.py", line 46, in setUp
    self.fti = add_folder_type(self.portal)
  File "/home/jenkins/workspace/plone-4.3-python-2.7/src/plone.app.dexterity/plone/app/dexterity/tests/test_constrains.py", line 26, in add_folder_type
    portal.portal_types._setObject('folder', fti)
  File "/home/jenkins/.buildout/eggs/Zope2-2.13.19-py2.7.egg/OFS/ObjectManager.py", line 325, in _setObject
    v = self._checkId(id)
  File "/home/jenkins/.buildout/eggs/Zope2-2.13.19-py2.7.egg/OFS/ObjectManager.py", line 116, in checkValidId
    'The id "%s" is invalid - it is already in use.' % id)


FAILED:  plone.app.dexterity.tests.test_constrains.DocumentIntegrationTest.test_defaultAddableTypesDefault

Error Message:
The id "folder" is invalid - it is already in use.

Stack Trace:
The id "folder" is invalid - it is already in use.

  File "/home/jenkins/.buildout/eggs/unittest2-0.5.1-py2.7.egg/unittest2/case.py", line 333, in run
    self.setUp()
  File "/home/jenkins/workspace/plone-4.3-python-2.7/src/plone.app.dexterity/plone/app/dexterity/tests/test_constrains.py", line 46, in setUp
    self.fti = add_folder_type(self.portal)
  File "/home/jenkins/workspace/plone-4.3-python-2.7/src/plone.app.dexterity/plone/app/dexterity/tests/test_constrains.py", line 26, in add_folder_type
    portal.portal_types._setObject('folder', fti)
  File "/home/jenkins/.buildout/eggs/Zope2-2.13.19-py2.7.egg/OFS/ObjectManager.py", line 325, in _setObject
    v = self._checkId(id)
  File "/home/jenkins/.buildout/eggs/Zope2-2.13.19-py2.7.egg/OFS/ObjectManager.py", line 116, in checkValidId
    'The id "%s" is invalid - it is already in use.' % id)


FAILED:  plone.app.dexterity.tests.test_constrains.DocumentIntegrationTest.test_formschemainvariants

Error Message:
The id "folder" is invalid - it is already in use.

Stack Trace:
The id "folder" is invalid - it is already in use.

  File "/home/jenkins/.buildout/eggs/unittest2-0.5.1-py2.7.egg/unittest2/case.py", line 333, in run
    self.setUp()
  File "/home/jenkins/workspace/plone-4.3-python-2.7/src/plone.app.dexterity/plone/app/dexterity/tests/test_constrains.py", line 46, in setUp
    self.fti = add_folder_type(self.portal)
  File "/home/jenkins/workspace/plone-4.3-python-2.7/src/plone.app.dexterity/plone/app/dexterity/tests/test_constrains.py", line 26, in add_folder_type
    portal.portal_types._setObject('folder', fti)
  File "/home/jenkins/.buildout/eggs/Zope2-2.13.19-py2.7.egg/OFS/ObjectManager.py", line 325, in _setObject
    v = self._checkId(id)
  File "/home/jenkins/.buildout/eggs/Zope2-2.13.19-py2.7.egg/OFS/ObjectManager.py", line 116, in checkValidId
    'The id "%s" is invalid - it is already in use.' % id)


FAILED:  plone.app.dexterity.tests.test_constrains.DocumentIntegrationTest.test_immediatelyAllowedTypesDefaultWhenAcquired

Error Message:
The id "folder" is invalid - it is already in use.

Stack Trace:
The id "folder" is invalid - it is already in use.

  File "/home/jenkins/.buildout/eggs/unittest2-0.5.1-py2.7.egg/unittest2/case.py", line 333, in run
    self.setUp()
  File "/home/jenkins/workspace/plone-4.3-python-2.7/src/plone.app.dexterity/plone/app/dexterity/tests/test_constrains.py", line 46, in setUp
    self.fti = add_folder_type(self.portal)
  File "/home/jenkins/workspace/plone-4.3-python-2.7/src/plone.app.dexterity/plone/app/dexterity/tests/test_constrains.py", line 26, in add_folder_type
    portal.portal_types._setObject('folder', fti)
  File "/home/jenkins/.buildout/eggs/Zope2-2.13.19-py2.7.egg/OFS/ObjectManager.py", line 325, in _setObject
    v = self._checkId(id)
  File "/home/jenkins/.buildout/eggs/Zope2-2.13.19-py2.7.egg/OFS/ObjectManager.py", line 116, in checkValidId
    'The id "%s" is invalid - it is already in use.' % id)


FAILED:  plone.app.dexterity.tests.test_constrains.DocumentIntegrationTest.test_immediatelyAllowedTypesDefaultWhenDisabled

Error Message:
The id "folder" is invalid - it is already in use.

Stack Trace:
The id "folder" is invalid - it is already in use.

  File "/home/jenkins/.buildout/eggs/unittest2-0.5.1-py2.7.egg/unittest2/case.py", line 333, in run
    self.setUp()
  File "/home/jenkins/workspace/plone-4.3-python-2.7/src/plone.app.dexterity/plone/app/dexterity/tests/test_constrains.py", line 46, in setUp
    self.fti = add_folder_type(self.portal)
  File "/home/jenkins/workspace/plone-4.3-python-2.7/src/plone.app.dexterity/plone/app/dexterity/tests/test_constrains.py", line 26, in add_folder_type
    portal.portal_types._setObject('folder', fti)
  File "/home/jenkins/.buildout/eggs/Zope2-2.13.19-py2.7.egg/OFS/ObjectManager.py", line 325, in _setObject
    v = self._checkId(id)
  File "/home/jenkins/.buildout/eggs/Zope2-2.13.19-py2.7.egg/OFS/ObjectManager.py", line 116, in checkValidId
    'The id "%s" is invalid - it is already in use.' % id)


FAILED:  plone.app.dexterity.tests.test_constrains.DocumentIntegrationTest.test_immediatelyAllowedTypesDefaultWhenEnabled

Error Message:
The id "folder" is invalid - it is already in use.

Stack Trace:
The id "folder" is invalid - it is already in use.

  File "/home/jenkins/.buildout/eggs/unittest2-0.5.1-py2.7.egg/unittest2/case.py", line 333, in run
    self.setUp()
  File "/home/jenkins/workspace/plone-4.3-python-2.7/src/plone.app.dexterity/plone/app/dexterity/tests/test_constrains.py", line 46, in setUp
    self.fti = add_folder_type(self.portal)
  File "/home/jenkins/workspace/plone-4.3-python-2.7/src/plone.app.dexterity/plone/app/dexterity/tests/test_constrains.py", line 26, in add_folder_type
    portal.portal_types._setObject('folder', fti)
  File "/home/jenkins/.buildout/eggs/Zope2-2.13.19-py2.7.egg/OFS/ObjectManager.py", line 325, in _setObject
    v = self._checkId(id)
  File "/home/jenkins/.buildout/eggs/Zope2-2.13.19-py2.7.egg/OFS/ObjectManager.py", line 116, in checkValidId
    'The id "%s" is invalid - it is already in use.' % id)


FAILED:  plone.app.dexterity.tests.test_constrains.DocumentIntegrationTest.test_immediatelyAllowedTypesInvalidSet

Error Message:
The id "folder" is invalid - it is already in use.

Stack Trace:
The id "folder" is invalid - it is already in use.

  File "/home/jenkins/.buildout/eggs/unittest2-0.5.1-py2.7.egg/unittest2/case.py", line 333, in run
    self.setUp()
  File "/home/jenkins/workspace/plone-4.3-python-2.7/src/plone.app.dexterity/plone/app/dexterity/tests/test_constrains.py", line 46, in setUp
    self.fti = add_folder_type(self.portal)
  File "/home/jenkins/workspace/plone-4.3-python-2.7/src/plone.app.dexterity/plone/app/dexterity/tests/test_constrains.py", line 26, in add_folder_type
    portal.portal_types._setObject('folder', fti)
  File "/home/jenkins/.buildout/eggs/Zope2-2.13.19-py2.7.egg/OFS/ObjectManager.py", line 325, in _setObject
    v = self._checkId(id)
  File "/home/jenkins/.buildout/eggs/Zope2-2.13.19-py2.7.egg/OFS/ObjectManager.py", line 116, in checkValidId
    'The id "%s" is invalid - it is already in use.' % id)


FAILED:  plone.app.dexterity.tests.test_constrains.DocumentIntegrationTest.test_immediatelyAllowedTypesInvalidValuesGetFiltered

Error Message:
The id "folder" is invalid - it is already in use.

Stack Trace:
The id "folder" is invalid - it is already in use.

  File "/home/jenkins/.buildout/eggs/unittest2-0.5.1-py2.7.egg/unittest2/case.py", line 333, in run
    self.setUp()
  File "/home/jenkins/workspace/plone-4.3-python-2.7/src/plone.app.dexterity/plone/app/dexterity/tests/test_constrains.py", line 46, in setUp
    self.fti = add_folder_type(self.portal)
  File "/home/jenkins/workspace/plone-4.3-python-2.7/src/plone.app.dexterity/plone/app/dexterity/tests/test_constrains.py", line 26, in add_folder_type
    portal.portal_types._setObject('folder', fti)
  File "/home/jenkins/.buildout/eggs/Zope2-2.13.19-py2.7.egg/OFS/ObjectManager.py", line 325, in _setObject
    v = self._checkId(id)
  File "/home/jenkins/.buildout/eggs/Zope2-2.13.19-py2.7.egg/OFS/ObjectManager.py", line 116, in checkValidId
    'The id "%s" is invalid - it is already in use.' % id)


FAILED:  plone.app.dexterity.tests.test_constrains.DocumentIntegrationTest.test_locallyAllowedTypesDefaultWhenAcquired

Error Message:
The id "folder" is invalid - it is already in use.

Stack Trace:
The id "folder" is invalid - it is already in use.

  File "/home/jenkins/.buildout/eggs/unittest2-0.5.1-py2.7.egg/unittest2/case.py", line 333, in run
    self.setUp()
  File "/home/jenkins/workspace/plone-4.3-python-2.7/src/plone.app.dexterity/plone/app/dexterity/tests/test_constrains.py", line 46, in setUp
    self.fti = add_folder_type(self.portal)
  File "/home/jenkins/workspace/plone-4.3-python-2.7/src/plone.app.dexterity/plone/app/dexterity/tests/test_constrains.py", line 26, in add_folder_type
    portal.portal_types._setObject('folder', fti)
  File "/home/jenkins/.buildout/eggs/Zope2-2.13.19-py2.7.egg/OFS/ObjectManager.py", line 325, in _setObject
    v = self._checkId(id)
  File "/home/jenkins/.buildout/eggs/Zope2-2.13.19-py2.7.egg/OFS/ObjectManager.py", line 116, in checkValidId
    'The id "%s" is invalid - it is already in use.' % id)


FAILED:  plone.app.dexterity.tests.test_constrains.DocumentIntegrationTest.test_locallyAllowedTypesDefaultWhenDisabled

Error Message:
The id "folder" is invalid - it is already in use.

Stack Trace:
The id "folder" is invalid - it is already in use.

  File "/home/jenkins/.buildout/eggs/unittest2-0.5.1-py2.7.egg/unittest2/case.py", line 333, in run
    self.setUp()
  File "/home/jenkins/workspace/plone-4.3-python-2.7/src/plone.app.dexterity/plone/app/dexterity/tests/test_constrains.py", line 46, in setUp
    self.fti = add_folder_type(self.portal)
  File "/home/jenkins/workspace/plone-4.3-python-2.7/src/plone.app.dexterity/plone/app/dexterity/tests/test_constrains.py", line 26, in add_folder_type
    portal.portal_types._setObject('folder', fti)
  File "/home/jenkins/.buildout/eggs/Zope2-2.13.19-py2.7.egg/OFS/ObjectManager.py", line 325, in _setObject
    v = self._checkId(id)
  File "/home/jenkins/.buildout/eggs/Zope2-2.13.19-py2.7.egg/OFS/ObjectManager.py", line 116, in checkValidId
    'The id "%s" is invalid - it is already in use.' % id)


FAILED:  plone.app.dexterity.tests.test_constrains.DocumentIntegrationTest.test_locallyAllowedTypesDefaultWhenEnabled

Error Message:
The id "folder" is invalid - it is already in use.

Stack Trace:
The id "folder" is invalid - it is already in use.

  File "/home/jenkins/.buildout/eggs/unittest2-0.5.1-py2.7.egg/unittest2/case.py", line 333, in run
    self.setUp()
  File "/home/jenkins/workspace/plone-4.3-python-2.7/src/plone.app.dexterity/plone/app/dexterity/tests/test_constrains.py", line 46, in setUp
    self.fti = add_folder_type(self.portal)
  File "/home/jenkins/workspace/plone-4.3-python-2.7/src/plone.app.dexterity/plone/app/dexterity/tests/test_constrains.py", line 26, in add_folder_type
    portal.portal_types._setObject('folder', fti)
  File "/home/jenkins/.buildout/eggs/Zope2-2.13.19-py2.7.egg/OFS/ObjectManager.py", line 325, in _setObject
    v = self._checkId(id)
  File "/home/jenkins/.buildout/eggs/Zope2-2.13.19-py2.7.egg/OFS/ObjectManager.py", line 116, in checkValidId
    'The id "%s" is invalid - it is already in use.' % id)


FAILED:  plone.app.dexterity.tests.test_constrains.DocumentIntegrationTest.test_locallyAllowedTypesInvalidSet

Error Message:
The id "folder" is invalid - it is already in use.

Stack Trace:
The id "folder" is invalid - it is already in use.

  File "/home/jenkins/.buildout/eggs/unittest2-0.5.1-py2.7.egg/unittest2/case.py", line 333, in run
    self.setUp()
  File "/home/jenkins/workspace/plone-4.3-python-2.7/src/plone.app.dexterity/plone/app/dexterity/tests/test_constrains.py", line 46, in setUp
    self.fti = add_folder_type(self.portal)
  File "/home/jenkins/workspace/plone-4.3-python-2.7/src/plone.app.dexterity/plone/app/dexterity/tests/test_constrains.py", line 26, in add_folder_type
    portal.portal_types._setObject('folder', fti)
  File "/home/jenkins/.buildout/eggs/Zope2-2.13.19-py2.7.egg/OFS/ObjectManager.py", line 325, in _setObject
    v = self._checkId(id)
  File "/home/jenkins/.buildout/eggs/Zope2-2.13.19-py2.7.egg/OFS/ObjectManager.py", line 116, in checkValidId
    'The id "%s" is invalid - it is already in use.' % id)


FAILED:  plone.app.dexterity.tests.test_constrains.DocumentIntegrationTest.test_locallyAllowedTypesInvalidValuesGetFiltered

Error Message:
The id "folder" is invalid - it is already in use.

Stack Trace:
The id "folder" is invalid - it is already in use.

  File "/home/jenkins/.buildout/eggs/unittest2-0.5.1-py2.7.egg/unittest2/case.py", line 333, in run
    self.setUp()
  File "/home/jenkins/workspace/plone-4.3-python-2.7/src/plone.app.dexterity/plone/app/dexterity/tests/test_constrains.py", line 46, in setUp
    self.fti = add_folder_type(self.portal)
  File "/home/jenkins/workspace/plone-4.3-python-2.7/src/plone.app.dexterity/plone/app/dexterity/tests/test_constrains.py", line 26, in add_folder_type
    portal.portal_types._setObject('folder', fti)
  File "/home/jenkins/.buildout/eggs/Zope2-2.13.19-py2.7.egg/OFS/ObjectManager.py", line 325, in _setObject
    v = self._checkId(id)
  File "/home/jenkins/.buildout/eggs/Zope2-2.13.19-py2.7.egg/OFS/ObjectManager.py", line 116, in checkValidId
    'The id "%s" is invalid - it is already in use.' % id)


FAILED:  plone.app.dexterity.tests.test_constrains.FolderConstrainViewFunctionalText.test_folder_view

Error Message:
The id "folder" is invalid - it is already in use.

Stack Trace:
The id "folder" is invalid - it is already in use.

  File "/home/jenkins/.buildout/eggs/unittest2-0.5.1-py2.7.egg/unittest2/case.py", line 333, in run
    self.setUp()
  File "/home/jenkins/workspace/plone-4.3-python-2.7/src/plone.app.dexterity/plone/app/dexterity/tests/test_constrains.py", line 322, in setUp
    self.fti = add_folder_type(self.portal)
  File "/home/jenkins/workspace/plone-4.3-python-2.7/src/plone.app.dexterity/plone/app/dexterity/tests/test_constrains.py", line 26, in add_folder_type
    portal.portal_types._setObject('folder', fti)
  File "/home/jenkins/.buildout/eggs/Zope2-2.13.19-py2.7.egg/OFS/ObjectManager.py", line 325, in _setObject
    v = self._checkId(id)
  File "/home/jenkins/.buildout/eggs/Zope2-2.13.19-py2.7.egg/OFS/ObjectManager.py", line 116, in checkValidId
    'The id "%s" is invalid - it is already in use.' % id)


FAILED:  plone.app.dexterity.tests.test_constrains.FolderConstrainViewFunctionalText.test_form_bad_save

Error Message:
The id "folder" is invalid - it is already in use.

Stack Trace:
The id "folder" is invalid - it is already in use.

  File "/home/jenkins/.buildout/eggs/unittest2-0.5.1-py2.7.egg/unittest2/case.py", line 333, in run
    self.setUp()
  File "/home/jenkins/workspace/plone-4.3-python-2.7/src/plone.app.dexterity/plone/app/dexterity/tests/test_constrains.py", line 322, in setUp
    self.fti = add_folder_type(self.portal)
  File "/home/jenkins/workspace/plone-4.3-python-2.7/src/plone.app.dexterity/plone/app/dexterity/tests/test_constrains.py", line 26, in add_folder_type
    portal.portal_types._setObject('folder', fti)
  File "/home/jenkins/.buildout/eggs/Zope2-2.13.19-py2.7.egg/OFS/ObjectManager.py", line 325, in _setObject
    v = self._checkId(id)
  File "/home/jenkins/.buildout/eggs/Zope2-2.13.19-py2.7.egg/OFS/ObjectManager.py", line 116, in checkValidId
    'The id "%s" is invalid - it is already in use.' % id)


FAILED:  plone.app.dexterity.tests.test_constrains.FolderConstrainViewFunctionalText.test_form_save_restrictions

Error Message:
The id "folder" is invalid - it is already in use.

Stack Trace:
The id "folder" is invalid - it is already in use.

  File "/home/jenkins/.buildout/eggs/unittest2-0.5.1-py2.7.egg/unittest2/case.py", line 333, in run
    self.setUp()
  File "/home/jenkins/workspace/plone-4.3-python-2.7/src/plone.app.dexterity/plone/app/dexterity/tests/test_constrains.py", line 322, in setUp
    self.fti = add_folder_type(self.portal)
  File "/home/jenkins/workspace/plone-4.3-python-2.7/src/plone.app.dexterity/plone/app/dexterity/tests/test_constrains.py", line 26, in add_folder_type
    portal.portal_types._setObject('folder', fti)
  File "/home/jenkins/.buildout/eggs/Zope2-2.13.19-py2.7.egg/OFS/ObjectManager.py", line 325, in _setObject
    v = self._checkId(id)
  File "/home/jenkins/.buildout/eggs/Zope2-2.13.19-py2.7.egg/OFS/ObjectManager.py", line 116, in checkValidId
    'The id "%s" is invalid - it is already in use.' % id)


FAILED:  Products.CMFPlone.tests.testUnicodeSplitter.TestCaseNormalizer.xml.<init>

Error Message:


Stack Trace:
Test report file /home/jenkins/workspace/plone-4.3-python-2.7/parts/jenkins-test/testreports/Products.CMFPlone.tests.testUnicodeSplitter.TestCaseNormalizer.xml was length 0



CHANGES
-------




More information about the Testbot mailing list