[Testbot] Plone 4.3 – Python 2.7 – Build # 703 – Regression! – 2 failure(s)

admin at jenkins.plone.org admin at jenkins.plone.org
Sun Feb 10 15:18:44 UTC 2013


https://jenkins.plone.org/job/plone-4.3-python-2.7/703/

Total: 4117
Pass: 4115
Fail:  2

FAILED TESTS
------------

2 tests failed.
FAILED:  plone.app.versioningbehavior.tests.doctest_behavior.txt

Error Message:
Failed doctest test for doctest_behavior.txt

Stack Trace:
Failed doctest test for doctest_behavior.txt
  File "/home/jenkins/workspace/plone-4.3-python-2.7/src/plone.app.versioningbehavior/plone/app/versioningbehavior/tests/doctest_behavior.txt", line 0

----------------------------------------------------------------------
File "/home/jenkins/workspace/plone-4.3-python-2.7/src/plone.app.versioningbehavior/plone/app/versioningbehavior/tests/doctest_behavior.txt", line 51, in doctest_behavior.txt
Failed example:
    browser.getControl(name='form.widgets.title').value = 'Blubb'
Exception raised:
    Traceback (most recent call last):
      File "/usr/lib/python2.7/doctest.py", line 1289, in __run
        compileflags, 1) in test.globs
      File "<doctest doctest_behavior.txt[21]>", line 1, in <module>
        browser.getControl(name='form.widgets.title').value = 'Blubb'
      File "/home/jenkins/.buildout/eggs/zope.testbrowser-3.11.1-py2.7.egg/zope/testbrowser/browser.py", line 371, in getControl
        control, form = disambiguate(intermediate, msg, index)
      File "/home/jenkins/.buildout/eggs/zope.testbrowser-3.11.1-py2.7.egg/zope/testbrowser/browser.py", line 48, in disambiguate
        raise LookupError(msg)
    LookupError: name 'form.widgets.title'
----------------------------------------------------------------------
File "/home/jenkins/workspace/plone-4.3-python-2.7/src/plone.app.versioningbehavior/plone/app/versioningbehavior/tests/doctest_behavior.txt", line 75, in doctest_behavior.txt
Failed example:
    browser.getControl(name='form.widgets.title').value = 'Blubb2'
Exception raised:
    Traceback (most recent call last):
      File "/usr/lib/python2.7/doctest.py", line 1289, in __run
        compileflags, 1) in test.globs
      File "<doctest doctest_behavior.txt[30]>", line 1, in <module>
        browser.getControl(name='form.widgets.title').value = 'Blubb2'
      File "/home/jenkins/.buildout/eggs/zope.testbrowser-3.11.1-py2.7.egg/zope/testbrowser/browser.py", line 371, in getControl
        control, form = disambiguate(intermediate, msg, index)
      File "/home/jenkins/.buildout/eggs/zope.testbrowser-3.11.1-py2.7.egg/zope/testbrowser/browser.py", line 48, in disambiguate
        raise LookupError(msg)
    LookupError: name 'form.widgets.title'
----------------------------------------------------------------------
File "/home/jenkins/workspace/plone-4.3-python-2.7/src/plone.app.versioningbehavior/plone/app/versioningbehavior/tests/doctest_behavior.txt", line 102, in doctest_behavior.txt
Failed example:
    browser.getControl(name='form.widgets.title').value = 'Init test'
Exception raised:
    Traceback (most recent call last):
      File "/usr/lib/python2.7/doctest.py", line 1289, in __run
        compileflags, 1) in test.globs
      File "<doctest doctest_behavior.txt[42]>", line 1, in <module>
        browser.getControl(name='form.widgets.title').value = 'Init test'
      File "/home/jenkins/.buildout/eggs/zope.testbrowser-3.11.1-py2.7.egg/zope/testbrowser/browser.py", line 371, in getControl
        control, form = disambiguate(intermediate, msg, index)
      File "/home/jenkins/.buildout/eggs/zope.testbrowser-3.11.1-py2.7.egg/zope/testbrowser/browser.py", line 48, in disambiguate
        raise LookupError(msg)
    LookupError: name 'form.widgets.title'
----------------------------------------------------------------------
File "/home/jenkins/workspace/plone-4.3-python-2.7/src/plone.app.versioningbehavior/plone/app/versioningbehavior/tests/doctest_behavior.txt", line 129, in doctest_behavior.txt
Failed example:
    browser.getControl(name='paths:list').displayValue = ['Blubb2']
Exception raised:
    Traceback (most recent call last):
      File "/usr/lib/python2.7/doctest.py", line 1289, in __run
        compileflags, 1) in test.globs
      File "<doctest doctest_behavior.txt[53]>", line 1, in <module>
        browser.getControl(name='paths:list').displayValue = ['Blubb2']
      File "/home/jenkins/.buildout/eggs/zope.testbrowser-3.11.1-py2.7.egg/zope/testbrowser/browser.py", line 97, in __setattr__
        object.__setattr__(self, name, value)
      File "/home/jenkins/.buildout/eggs/zope.testbrowser-3.11.1-py2.7.egg/zope/testbrowser/browser.py", line 572, in fset
        self.mech_control.set_value_by_label(value)
      File "/home/jenkins/.buildout/eggs/mechanize-0.2.5-py2.7.egg/mechanize/_form.py", line 2092, in set_value_by_label
        raise ItemNotFoundError(nn)
    ItemNotFoundError: Blubb2
----------------------------------------------------------------------
File "/home/jenkins/workspace/plone-4.3-python-2.7/src/plone.app.versioningbehavior/plone/app/versioningbehavior/tests/doctest_behavior.txt", line 131, in doctest_behavior.txt
Failed example:
    browser.getControl(name='folder_paste:method').click()
Exception raised:
    Traceback (most recent call last):
      File "/usr/lib/python2.7/doctest.py", line 1289, in __run
        compileflags, 1) in test.globs
      File "<doctest doctest_behavior.txt[55]>", line 1, in <module>
        browser.getControl(name='folder_paste:method').click()
      File "/home/jenkins/.buildout/eggs/zope.testbrowser-3.11.1-py2.7.egg/zope/testbrowser/browser.py", line 371, in getControl
        control, form = disambiguate(intermediate, msg, index)
      File "/home/jenkins/.buildout/eggs/zope.testbrowser-3.11.1-py2.7.egg/zope/testbrowser/browser.py", line 48, in disambiguate
        raise LookupError(msg)
    LookupError: name 'folder_paste:method'
----------------------------------------------------------------------
File "/home/jenkins/workspace/plone-4.3-python-2.7/src/plone.app.versioningbehavior/plone/app/versioningbehavior/tests/doctest_behavior.txt", line 132, in doctest_behavior.txt
Failed example:
    'copy_of_testingtype' in self.portal.objectIds()
Differences (ndiff with -expected +actual):
    - True
    + False
----------------------------------------------------------------------
File "/home/jenkins/workspace/plone-4.3-python-2.7/src/plone.app.versioningbehavior/plone/app/versioningbehavior/tests/doctest_behavior.txt", line 138, in doctest_behavior.txt
Failed example:
    browser.open('http://nohost/plone/copy_of_testingtype/edit')
Exception raised:
    Traceback (most recent call last):
      File "/usr/lib/python2.7/doctest.py", line 1289, in __run
        compileflags, 1) in test.globs
      File "<doctest doctest_behavior.txt[57]>", line 1, in <module>
        browser.open('http://nohost/plone/copy_of_testingtype/edit')
      File "/home/jenkins/.buildout/eggs/zope.testbrowser-3.11.1-py2.7.egg/zope/testbrowser/browser.py", line 240, in open
        self.mech_browser.open(url, data)
      File "/home/jenkins/.buildout/eggs/mechanize-0.2.5-py2.7.egg/mechanize/_mechanize.py", line 203, in open
        return self._mech_open(url, data, timeout=timeout)
      File "/home/jenkins/.buildout/eggs/mechanize-0.2.5-py2.7.egg/mechanize/_mechanize.py", line 230, in _mech_open
        response = UserAgentBase.open(self, request, data)
      File "/home/jenkins/.buildout/eggs/mechanize-0.2.5-py2.7.egg/mechanize/_opener.py", line 193, in open
        response = urlopen(self, req, data)
      File "/home/jenkins/.buildout/eggs/mechanize-0.2.5-py2.7.egg/mechanize/_urllib2_fork.py", line 344, in _open
        '_open', req)
      File "/home/jenkins/.buildout/eggs/mechanize-0.2.5-py2.7.egg/mechanize/_urllib2_fork.py", line 332, in _call_chain
        result = func(*args)
      File "/home/jenkins/.buildout/eggs/Zope2-2.13.19-py2.7.egg/Testing/testbrowser.py", line 83, in http_open
        return self.do_open(PublisherConnection, req)
      File "/usr/lib/python2.7/urllib2.py", line 1174, in do_open
        h.request(req.get_method(), req.get_selector(), req.data, headers)
      File "/home/jenkins/.buildout/eggs/zope.testbrowser-3.11.1-py2.7.egg/zope/testbrowser/testing.py", line 76, in request
        self.response = self.caller(request_string, handle_errors)
      File "/home/jenkins/.buildout/eggs/Zope2-2.13.19-py2.7.egg/Testing/ZopeTestCase/functional.py", line 38, in wrapped_func
        return func(*args, **kw)
      File "/home/jenkins/.buildout/eggs/Zope2-2.13.19-py2.7.egg/Testing/ZopeTestCase/zopedoctest/functional.py", line 186, in http
        debug=not handle_errors,
      File "/home/jenkins/.buildout/eggs/Zope2-2.13.19-py2.7.egg/ZPublisher/Publish.py", line 443, in publish_module
        environ, debug, request, response)
      File "/home/jenkins/.buildout/eggs/Zope2-2.13.19-py2.7.egg/ZPublisher/Publish.py", line 237, in publish_module_standard
        response = publish(request, module_name, after_list, debug=debug)
      File "/home/jenkins/.buildout/eggs/Zope2-2.13.19-py2.7.egg/ZPublisher/Publish.py", line 115, in publish
        object=request.traverse(path, validated_hook=validated_hook)
      File "/home/jenkins/.buildout/eggs/Zope2-2.13.19-py2.7.egg/ZPublisher/BaseRequest.py", line 518, in traverse
        return response.notFoundError(URL)
      File "/home/jenkins/.buildout/eggs/Zope2-2.13.19-py2.7.egg/ZPublisher/HTTPResponse.py", line 718, in notFoundError
        "<p><b>Resource:</b> %s</p>" % escape(entry))
    NotFound:   <h2>Site Error</h2>
      <p>An error was encountered while publishing this resource.
      </p>
      <p><strong>Resource not found</strong></p>

      Sorry, the requested resource does not exist.<p>Check the URL and try again.</p><p><b>Resource:</b> http://nohost/plone/copy_of_testingtype</p>
      <hr noshade="noshade"/>

      <p>Troubleshooting Suggestions</p>

      <ul>
      <li>The URL may be incorrect.</li>
      <li>The parameters passed to this resource may be incorrect.</li>
      <li>A resource that this resource relies on may be
          encountering an error.</li>
      </ul>

      <p>For more detailed information about the error, please
      refer to the error log.
      </p>

      <p>If the error persists please contact the site maintainer.
      Thank you for your patience.
      </p>
----------------------------------------------------------------------
File "/home/jenkins/workspace/plone-4.3-python-2.7/src/plone.app.versioningbehavior/plone/app/versioningbehavior/tests/doctest_behavior.txt", line 139, in doctest_behavior.txt
Failed example:
    browser.getControl(name='form.widgets.title').value = 'Dup'
Exception raised:
    Traceback (most recent call last):
      File "/usr/lib/python2.7/doctest.py", line 1289, in __run
        compileflags, 1) in test.globs
      File "<doctest doctest_behavior.txt[58]>", line 1, in <module>
        browser.getControl(name='form.widgets.title').value = 'Dup'
      File "/home/jenkins/.buildout/eggs/zope.testbrowser-3.11.1-py2.7.egg/zope/testbrowser/browser.py", line 370, in getControl
        label, name, self.mech_browser.forms(), include_subcontrols=True)
      File "/home/jenkins/.buildout/eggs/mechanize-0.2.5-py2.7.egg/mechanize/_mechanize.py", line 418, in forms
        if not self.viewing_html():
      File "/home/jenkins/.buildout/eggs/mechanize-0.2.5-py2.7.egg/mechanize/_mechanize.py", line 443, in viewing_html
        raise BrowserStateError("not viewing any document")
    BrowserStateError: not viewing any document
----------------------------------------------------------------------
File "/home/jenkins/workspace/plone-4.3-python-2.7/src/plone.app.versioningbehavior/plone/app/versioningbehavior/tests/doctest_behavior.txt", line 140, in doctest_behavior.txt
Failed example:
    field = browser.getControl(name='form.widgets.IVersionable.changeNote')
Exception raised:
    Traceback (most recent call last):
      File "/usr/lib/python2.7/doctest.py", line 1289, in __run
        compileflags, 1) in test.globs
      File "<doctest doctest_behavior.txt[59]>", line 1, in <module>
        field = browser.getControl(name='form.widgets.IVersionable.changeNote')
      File "/home/jenkins/.buildout/eggs/zope.testbrowser-3.11.1-py2.7.egg/zope/testbrowser/browser.py", line 370, in getControl
        label, name, self.mech_browser.forms(), include_subcontrols=True)
      File "/home/jenkins/.buildout/eggs/mechanize-0.2.5-py2.7.egg/mechanize/_mechanize.py", line 418, in forms
        if not self.viewing_html():
      File "/home/jenkins/.buildout/eggs/mechanize-0.2.5-py2.7.egg/mechanize/_mechanize.py", line 443, in viewing_html
        raise BrowserStateError("not viewing any document")
    BrowserStateError: not viewing any document
----------------------------------------------------------------------
File "/home/jenkins/workspace/plone-4.3-python-2.7/src/plone.app.versioningbehavior/plone/app/versioningbehavior/tests/doctest_behavior.txt", line 141, in doctest_behavior.txt
Failed example:
    field.value = 'Edited the duplicate'
Exception raised:
    Traceback (most recent call last):
      File "/usr/lib/python2.7/doctest.py", line 1289, in __run
        compileflags, 1) in test.globs
      File "<doctest doctest_behavior.txt[60]>", line 1, in <module>
        field.value = 'Edited the duplicate'
      File "/home/jenkins/.buildout/eggs/zope.testbrowser-3.11.1-py2.7.egg/zope/testbrowser/browser.py", line 97, in __setattr__
        object.__setattr__(self, name, value)
      File "/home/jenkins/.buildout/eggs/zope.testbrowser-3.11.1-py2.7.egg/zope/testbrowser/browser.py", line 527, in fset
        raise zope.testbrowser.interfaces.ExpiredError
    ExpiredError
----------------------------------------------------------------------
File "/home/jenkins/workspace/plone-4.3-python-2.7/src/plone.app.versioningbehavior/plone/app/versioningbehavior/tests/doctest_behavior.txt", line 142, in doctest_behavior.txt
Failed example:
    browser.getControl(name='form.buttons.save').click()
Exception raised:
    Traceback (most recent call last):
      File "/usr/lib/python2.7/doctest.py", line 1289, in __run
        compileflags, 1) in test.globs
      File "<doctest doctest_behavior.txt[61]>", line 1, in <module>
        browser.getControl(name='form.buttons.save').click()
      File "/home/jenkins/.buildout/eggs/zope.testbrowser-3.11.1-py2.7.egg/zope/testbrowser/browser.py", line 370, in getControl
        label, name, self.mech_browser.forms(), include_subcontrols=True)
      File "/home/jenkins/.buildout/eggs/mechanize-0.2.5-py2.7.egg/mechanize/_mechanize.py", line 418, in forms
        if not self.viewing_html():
      File "/home/jenkins/.buildout/eggs/mechanize-0.2.5-py2.7.egg/mechanize/_mechanize.py", line 443, in viewing_html
        raise BrowserStateError("not viewing any document")
    BrowserStateError: not viewing any document
----------------------------------------------------------------------
File "/home/jenkins/workspace/plone-4.3-python-2.7/src/plone.app.versioningbehavior/plone/app/versioningbehavior/tests/doctest_behavior.txt", line 143, in doctest_behavior.txt
Failed example:
    browser.url
Exception raised:
    Traceback (most recent call last):
      File "/usr/lib/python2.7/doctest.py", line 1289, in __run
        compileflags, 1) in test.globs
      File "<doctest doctest_behavior.txt[62]>", line 1, in <module>
        browser.url
      File "/home/jenkins/.buildout/eggs/zope.testbrowser-3.11.1-py2.7.egg/zope/testbrowser/browser.py", line 177, in url
        return self.mech_browser.geturl()
      File "/home/jenkins/.buildout/eggs/mechanize-0.2.5-py2.7.egg/mechanize/_mechanize.py", line 334, in geturl
        raise BrowserStateError("not viewing any document")
    BrowserStateError: not viewing any document
----------------------------------------------------------------------
File "/home/jenkins/workspace/plone-4.3-python-2.7/src/plone.app.versioningbehavior/plone/app/versioningbehavior/tests/doctest_behavior.txt", line 166, in doctest_behavior.txt
Failed example:
    browser.getControl(name='form.widgets.title').value = 'MyFolder'
Exception raised:
    Traceback (most recent call last):
      File "/usr/lib/python2.7/doctest.py", line 1289, in __run
        compileflags, 1) in test.globs
      File "<doctest doctest_behavior.txt[67]>", line 1, in <module>
        browser.getControl(name='form.widgets.title').value = 'MyFolder'
      File "/home/jenkins/.buildout/eggs/zope.testbrowser-3.11.1-py2.7.egg/zope/testbrowser/browser.py", line 371, in getControl
        control, form = disambiguate(intermediate, msg, index)
      File "/home/jenkins/.buildout/eggs/zope.testbrowser-3.11.1-py2.7.egg/zope/testbrowser/browser.py", line 48, in disambiguate
        raise LookupError(msg)
    LookupError: name 'form.widgets.title'
----------------------------------------------------------------------
File "/home/jenkins/workspace/plone-4.3-python-2.7/src/plone.app.versioningbehavior/plone/app/versioningbehavior/tests/doctest_behavior.txt", line 167, in doctest_behavior.txt
Failed example:
    browser.getControl(name='form.widgets.description').value = 'MyFolder'
Exception raised:
    Traceback (most recent call last):
      File "/usr/lib/python2.7/doctest.py", line 1289, in __run
        compileflags, 1) in test.globs
      File "<doctest doctest_behavior.txt[68]>", line 1, in <module>
        browser.getControl(name='form.widgets.description').value = 'MyFolder'
      File "/home/jenkins/.buildout/eggs/zope.testbrowser-3.11.1-py2.7.egg/zope/testbrowser/browser.py", line 371, in getControl
        control, form = disambiguate(intermediate, msg, index)
      File "/home/jenkins/.buildout/eggs/zope.testbrowser-3.11.1-py2.7.egg/zope/testbrowser/browser.py", line 48, in disambiguate
        raise LookupError(msg)
    LookupError: name 'form.widgets.description'
----------------------------------------------------------------------
File "/home/jenkins/workspace/plone-4.3-python-2.7/src/plone.app.versioningbehavior/plone/app/versioningbehavior/tests/doctest_behavior.txt", line 176, in doctest_behavior.txt
Failed example:
    browser.getControl(name='form.widgets.title').value = 'My versioned object'
Exception raised:
    Traceback (most recent call last):
      File "/usr/lib/python2.7/doctest.py", line 1289, in __run
        compileflags, 1) in test.globs
      File "<doctest doctest_behavior.txt[72]>", line 1, in <module>
        browser.getControl(name='form.widgets.title').value = 'My versioned object'
      File "/home/jenkins/.buildout/eggs/zope.testbrowser-3.11.1-py2.7.egg/zope/testbrowser/browser.py", line 371, in getControl
        control, form = disambiguate(intermediate, msg, index)
      File "/home/jenkins/.buildout/eggs/zope.testbrowser-3.11.1-py2.7.egg/zope/testbrowser/browser.py", line 48, in disambiguate
        raise LookupError(msg)
    LookupError: name 'form.widgets.title'
----------------------------------------------------------------------
File "/home/jenkins/workspace/plone-4.3-python-2.7/src/plone.app.versioningbehavior/plone/app/versioningbehavior/tests/doctest_behavior.txt", line 177, in doctest_behavior.txt
Failed example:
    browser.getControl(name='form.widgets.description').value = 'The Description'
Exception raised:
    Traceback (most recent call last):
      File "/usr/lib/python2.7/doctest.py", line 1289, in __run
        compileflags, 1) in test.globs
      File "<doctest doctest_behavior.txt[73]>", line 1, in <module>
        browser.getControl(name='form.widgets.description').value = 'The Description'
      File "/home/jenkins/.buildout/eggs/zope.testbrowser-3.11.1-py2.7.egg/zope/testbrowser/browser.py", line 371, in getControl
        control, form = disambiguate(intermediate, msg, index)
      File "/home/jenkins/.buildout/eggs/zope.testbrowser-3.11.1-py2.7.egg/zope/testbrowser/browser.py", line 48, in disambiguate
        raise LookupError(msg)
    LookupError: name 'form.widgets.description'
----------------------------------------------------------------------
File "/home/jenkins/workspace/plone-4.3-python-2.7/src/plone.app.versioningbehavior/plone/app/versioningbehavior/tests/doctest_behavior.txt", line 228, in doctest_behavior.txt
Failed example:
    browser.getControl(name='form.widgets.title').value = 'Versioned container one'
Exception raised:
    Traceback (most recent call last):
      File "/usr/lib/python2.7/doctest.py", line 1289, in __run
        compileflags, 1) in test.globs
      File "<doctest doctest_behavior.txt[94]>", line 1, in <module>
        browser.getControl(name='form.widgets.title').value = 'Versioned container one'
      File "/home/jenkins/.buildout/eggs/zope.testbrowser-3.11.1-py2.7.egg/zope/testbrowser/browser.py", line 371, in getControl
        control, form = disambiguate(intermediate, msg, index)
      File "/home/jenkins/.buildout/eggs/zope.testbrowser-3.11.1-py2.7.egg/zope/testbrowser/browser.py", line 48, in disambiguate
        raise LookupError(msg)
    LookupError: name 'form.widgets.title'
----------------------------------------------------------------------
File "/home/jenkins/workspace/plone-4.3-python-2.7/src/plone.app.versioningbehavior/plone/app/versioningbehavior/tests/doctest_behavior.txt", line 258, in doctest_behavior.txt
Failed example:
    browser.getControl(name='form.widgets.title').value = 'Versioned container two'
Exception raised:
    Traceback (most recent call last):
      File "/usr/lib/python2.7/doctest.py", line 1289, in __run
        compileflags, 1) in test.globs
      File "<doctest doctest_behavior.txt[108]>", line 1, in <module>
        browser.getControl(name='form.widgets.title').value = 'Versioned container two'
      File "/home/jenkins/.buildout/eggs/zope.testbrowser-3.11.1-py2.7.egg/zope/testbrowser/browser.py", line 371, in getControl
        control, form = disambiguate(intermediate, msg, index)
      File "/home/jenkins/.buildout/eggs/zope.testbrowser-3.11.1-py2.7.egg/zope/testbrowser/browser.py", line 48, in disambiguate
        raise LookupError(msg)
    LookupError: name 'form.widgets.title'


  File "/usr/lib/python2.7/unittest/case.py", line 327, in run
    testMethod()
  File "/usr/lib/python2.7/doctest.py", line 2201, in runTest
    raise self.failureException(self.format_failure(new.getvalue()))


FAILED:  Products.CMFPlone.tests.testUnicodeSplitter.TestCaseNormalizer.xml.<init>

Error Message:


Stack Trace:
Test report file /home/jenkins/workspace/plone-4.3-python-2.7/parts/jenkins-test/testreports/Products.CMFPlone.tests.testUnicodeSplitter.TestCaseNormalizer.xml was length 0



CHANGES
-------




More information about the Testbot mailing list