[Testbot] Plone 4.2 – Python 2.7 – Build # 619 – Regression! – 8 failure(s)

admin at jenkins.plone.org admin at jenkins.plone.org
Sat Feb 9 18:24:47 UTC 2013


https://jenkins.plone.org/job/plone-4.2-python-2.7/619/

Total: 7925
Pass: 7917
Fail:  8

FAILED TESTS
------------

8 tests failed.
REGRESSION:  plone.app.layout.globals.tests.test_context.TestContextStateView.test_view_url

Error Message:
[Errno 2] No such file or directory: '/tmp/tmpB5aKtz.demoblobs/tmp/tmp4_WEjq'

Stack Trace:
[Errno 2] No such file or directory: '/tmp/tmpB5aKtz.demoblobs/tmp/tmp4_WEjq'

  File "/usr/lib/python2.7/unittest/case.py", line 327, in run
    testMethod()
  File "/home/jenkins/.buildout/eggs/plone.app.layout-2.2.8-py2.7.egg/plone/app/layout/globals/tests/test_context.py", line 54, in test_view_url
    self.folder.invokeFactory('File', 'file1')
  File "/home/jenkins/.buildout/eggs/Products.ATContentTypes-2.1.11-py2.7.egg/Products/ATContentTypes/lib/constraintypes.py", line 284, in invokeFactory
    return pt.constructContent(*args, **kw)
  File "/home/jenkins/.buildout/eggs/Products.CMFCore-2.2.7-py2.7.egg/Products/CMFCore/TypesTool.py", line 833, in constructContent
    ob = info.constructInstance(container, id, *args, **kw)
  File "/home/jenkins/.buildout/eggs/Products.CMFCore-2.2.7-py2.7.egg/Products/CMFCore/TypesTool.py", line 311, in constructInstance
    return self._constructInstance(container, id, *args, **kw)
  File "/home/jenkins/.buildout/eggs/Products.CMFCore-2.2.7-py2.7.egg/Products/CMFCore/TypesTool.py", line 552, in _constructInstance
    newid = m(id, *args, **kw)
  File "/home/jenkins/.buildout/eggs/plone.app.blob-1.5.6-py2.7.egg/plone/app/blob/content.py", line 65, in addATBlobFile
    return addATBlob(container, id, subtype='File', **kwargs)
  File "/home/jenkins/.buildout/eggs/plone.app.blob-1.5.6-py2.7.egg/plone/app/blob/content.py", line 59, in addATBlob
    obj.initializeArchetype(**kwargs)
  File "/home/jenkins/.buildout/eggs/Products.ATContentTypes-2.1.11-py2.7.egg/Products/ATContentTypes/content/base.py", line 122, in initializeArchetype
    self.setDefaults()
  File "/home/jenkins/.buildout/eggs/Products.Archetypes-1.8.6-py2.7.egg/Products/Archetypes/BaseObject.py", line 439, in setDefaults
    self.Schema().setDefaults(self)
  File "/home/jenkins/.buildout/eggs/Products.Archetypes-1.8.6-py2.7.egg/Products/Archetypes/Schema/__init__.py", line 498, in setDefaults
    mapply(mutator, *args, **kw)
  File "/home/jenkins/.buildout/eggs/Products.Archetypes-1.8.6-py2.7.egg/Products/Archetypes/utils.py", line 123, in mapply
    return method(*call_args, **kw)
  File "/home/jenkins/.buildout/eggs/archetypes.schemaextender-2.1.2-py2.7.egg/archetypes/schemaextender/field.py", line 38, in mutator
    self.set(instance, value, **kw)
  File "/home/jenkins/.buildout/eggs/plone.app.blob-1.5.6-py2.7.egg/plone/app/blob/subtypes/file.py", line 15, in set
    super(ExtensionBlobField, self).set(instance, value, **kwargs)
  File "/home/jenkins/.buildout/eggs/plone.app.blob-1.5.6-py2.7.egg/plone/app/blob/field.py", line 248, in set
    savepoint(optimistic=True)
  File "/home/jenkins/.buildout/eggs/transaction-1.1.1-py2.7.egg/transaction/_manager.py", line 101, in savepoint
    return self.get().savepoint(optimistic)
  File "/home/jenkins/.buildout/eggs/transaction-1.1.1-py2.7.egg/transaction/_transaction.py", line 260, in savepoint
    self._saveAndRaiseCommitishError() # reraises!
  File "/home/jenkins/.buildout/eggs/transaction-1.1.1-py2.7.egg/transaction/_transaction.py", line 257, in savepoint
    savepoint = Savepoint(self, optimistic, *self._resources)
  File "/home/jenkins/.buildout/eggs/transaction-1.1.1-py2.7.egg/transaction/_transaction.py", line 690, in __init__
    savepoint = savepoint()
  File "/home/jenkins/.buildout/eggs/ZODB3-3.10.5-py2.7-linux-x86_64.egg/ZODB/Connection.py", line 1123, in savepoint
    self._commit(None)
  File "/home/jenkins/.buildout/eggs/ZODB3-3.10.5-py2.7-linux-x86_64.egg/ZODB/Connection.py", line 623, in _commit
    self._store_objects(ObjectWriter(obj), transaction)
  File "/home/jenkins/.buildout/eggs/ZODB3-3.10.5-py2.7-linux-x86_64.egg/ZODB/Connection.py", line 669, in _store_objects
    blobfilename = obj._uncommitted()
  File "/home/jenkins/.buildout/eggs/ZODB3-3.10.5-py2.7-linux-x86_64.egg/ZODB/blob.py", line 286, in _uncommitted
    filename = self._create_uncommitted_file()
  File "/home/jenkins/.buildout/eggs/ZODB3-3.10.5-py2.7-linux-x86_64.egg/ZODB/blob.py", line 271, in _create_uncommitted_file
    filename = utils.mktemp(dir=tempdir)
  File "/home/jenkins/.buildout/eggs/ZODB3-3.10.5-py2.7-linux-x86_64.egg/ZODB/utils.py", line 224, in mktemp
    handle, filename = mkstemp(dir=dir)
  File "/usr/lib/python2.7/tempfile.py", line 300, in mkstemp
    return _mkstemp_inner(dir, prefix, suffix, flags)
  File "/usr/lib/python2.7/tempfile.py", line 235, in _mkstemp_inner
    fd = _os.open(file, flags, 0600)


REGRESSION:  plone.app.workflow.tests.test_remap.TestRemapWorkflow.test_remap_from_no_workflow

Error Message:
[Errno 2] No such file or directory: '/tmp/tmpB5aKtz.demoblobs/tmp/tmpWhTdRs'

Stack Trace:
[Errno 2] No such file or directory: '/tmp/tmpB5aKtz.demoblobs/tmp/tmpWhTdRs'

  File "/usr/lib/python2.7/unittest/case.py", line 318, in run
    self.setUp()
  File "/home/jenkins/.buildout/eggs/Zope2-2.13.19-py2.7.egg/Testing/ZopeTestCase/PortalTestCase.py", line 60, in setUp
    self.afterSetUp()
  File "/home/jenkins/.buildout/eggs/plone.app.workflow-2.0.10-py2.7.egg/plone/app/workflow/tests/test_remap.py", line 27, in afterSetUp
    self.portal.invokeFactory('Image', 'i1')
  File "/home/jenkins/.buildout/eggs/Products.CMFCore-2.2.7-py2.7.egg/Products/CMFCore/PortalFolder.py", line 292, in invokeFactory
    return pt.constructContent(type_name, self, id, RESPONSE, *args, **kw)
  File "/home/jenkins/.buildout/eggs/Products.CMFCore-2.2.7-py2.7.egg/Products/CMFCore/TypesTool.py", line 833, in constructContent
    ob = info.constructInstance(container, id, *args, **kw)
  File "/home/jenkins/.buildout/eggs/Products.CMFCore-2.2.7-py2.7.egg/Products/CMFCore/TypesTool.py", line 311, in constructInstance
    return self._constructInstance(container, id, *args, **kw)
  File "/home/jenkins/.buildout/eggs/Products.CMFCore-2.2.7-py2.7.egg/Products/CMFCore/TypesTool.py", line 552, in _constructInstance
    newid = m(id, *args, **kw)
  File "/home/jenkins/.buildout/eggs/plone.app.blob-1.5.6-py2.7.egg/plone/app/blob/content.py", line 68, in addATBlobImage
    return addATBlob(container, id, subtype='Image', **kwargs)
  File "/home/jenkins/.buildout/eggs/plone.app.blob-1.5.6-py2.7.egg/plone/app/blob/content.py", line 59, in addATBlob
    obj.initializeArchetype(**kwargs)
  File "/home/jenkins/.buildout/eggs/Products.ATContentTypes-2.1.11-py2.7.egg/Products/ATContentTypes/content/base.py", line 122, in initializeArchetype
    self.setDefaults()
  File "/home/jenkins/.buildout/eggs/Products.Archetypes-1.8.6-py2.7.egg/Products/Archetypes/BaseObject.py", line 439, in setDefaults
    self.Schema().setDefaults(self)
  File "/home/jenkins/.buildout/eggs/Products.Archetypes-1.8.6-py2.7.egg/Products/Archetypes/Schema/__init__.py", line 498, in setDefaults
    mapply(mutator, *args, **kw)
  File "/home/jenkins/.buildout/eggs/Products.Archetypes-1.8.6-py2.7.egg/Products/Archetypes/utils.py", line 123, in mapply
    return method(*call_args, **kw)
  File "/home/jenkins/.buildout/eggs/archetypes.schemaextender-2.1.2-py2.7.egg/archetypes/schemaextender/field.py", line 38, in mutator
    self.set(instance, value, **kw)
  File "/home/jenkins/.buildout/eggs/plone.app.blob-1.5.6-py2.7.egg/plone/app/blob/subtypes/image.py", line 21, in set
    super(ExtensionBlobField, self).set(instance, value, **kwargs)
  File "/home/jenkins/.buildout/eggs/plone.app.blob-1.5.6-py2.7.egg/plone/app/blob/field.py", line 248, in set
    savepoint(optimistic=True)
  File "/home/jenkins/.buildout/eggs/transaction-1.1.1-py2.7.egg/transaction/_manager.py", line 101, in savepoint
    return self.get().savepoint(optimistic)
  File "/home/jenkins/.buildout/eggs/transaction-1.1.1-py2.7.egg/transaction/_transaction.py", line 260, in savepoint
    self._saveAndRaiseCommitishError() # reraises!
  File "/home/jenkins/.buildout/eggs/transaction-1.1.1-py2.7.egg/transaction/_transaction.py", line 257, in savepoint
    savepoint = Savepoint(self, optimistic, *self._resources)
  File "/home/jenkins/.buildout/eggs/transaction-1.1.1-py2.7.egg/transaction/_transaction.py", line 690, in __init__
    savepoint = savepoint()
  File "/home/jenkins/.buildout/eggs/ZODB3-3.10.5-py2.7-linux-x86_64.egg/ZODB/Connection.py", line 1123, in savepoint
    self._commit(None)
  File "/home/jenkins/.buildout/eggs/ZODB3-3.10.5-py2.7-linux-x86_64.egg/ZODB/Connection.py", line 623, in _commit
    self._store_objects(ObjectWriter(obj), transaction)
  File "/home/jenkins/.buildout/eggs/ZODB3-3.10.5-py2.7-linux-x86_64.egg/ZODB/Connection.py", line 669, in _store_objects
    blobfilename = obj._uncommitted()
  File "/home/jenkins/.buildout/eggs/ZODB3-3.10.5-py2.7-linux-x86_64.egg/ZODB/blob.py", line 286, in _uncommitted
    filename = self._create_uncommitted_file()
  File "/home/jenkins/.buildout/eggs/ZODB3-3.10.5-py2.7-linux-x86_64.egg/ZODB/blob.py", line 271, in _create_uncommitted_file
    filename = utils.mktemp(dir=tempdir)
  File "/home/jenkins/.buildout/eggs/ZODB3-3.10.5-py2.7-linux-x86_64.egg/ZODB/utils.py", line 224, in mktemp
    handle, filename = mkstemp(dir=dir)
  File "/usr/lib/python2.7/tempfile.py", line 300, in mkstemp
    return _mkstemp_inner(dir, prefix, suffix, flags)
  File "/usr/lib/python2.7/tempfile.py", line 235, in _mkstemp_inner
    fd = _os.open(file, flags, 0600)


REGRESSION:  plone.app.workflow.tests.test_remap.TestRemapWorkflow.test_remap_multiple_no_state_map

Error Message:
[Errno 2] No such file or directory: '/tmp/tmpB5aKtz.demoblobs/tmp/tmpGnNH5T'

Stack Trace:
[Errno 2] No such file or directory: '/tmp/tmpB5aKtz.demoblobs/tmp/tmpGnNH5T'

  File "/usr/lib/python2.7/unittest/case.py", line 318, in run
    self.setUp()
  File "/home/jenkins/.buildout/eggs/Zope2-2.13.19-py2.7.egg/Testing/ZopeTestCase/PortalTestCase.py", line 60, in setUp
    self.afterSetUp()
  File "/home/jenkins/.buildout/eggs/plone.app.workflow-2.0.10-py2.7.egg/plone/app/workflow/tests/test_remap.py", line 27, in afterSetUp
    self.portal.invokeFactory('Image', 'i1')
  File "/home/jenkins/.buildout/eggs/Products.CMFCore-2.2.7-py2.7.egg/Products/CMFCore/PortalFolder.py", line 292, in invokeFactory
    return pt.constructContent(type_name, self, id, RESPONSE, *args, **kw)
  File "/home/jenkins/.buildout/eggs/Products.CMFCore-2.2.7-py2.7.egg/Products/CMFCore/TypesTool.py", line 833, in constructContent
    ob = info.constructInstance(container, id, *args, **kw)
  File "/home/jenkins/.buildout/eggs/Products.CMFCore-2.2.7-py2.7.egg/Products/CMFCore/TypesTool.py", line 311, in constructInstance
    return self._constructInstance(container, id, *args, **kw)
  File "/home/jenkins/.buildout/eggs/Products.CMFCore-2.2.7-py2.7.egg/Products/CMFCore/TypesTool.py", line 552, in _constructInstance
    newid = m(id, *args, **kw)
  File "/home/jenkins/.buildout/eggs/plone.app.blob-1.5.6-py2.7.egg/plone/app/blob/content.py", line 68, in addATBlobImage
    return addATBlob(container, id, subtype='Image', **kwargs)
  File "/home/jenkins/.buildout/eggs/plone.app.blob-1.5.6-py2.7.egg/plone/app/blob/content.py", line 59, in addATBlob
    obj.initializeArchetype(**kwargs)
  File "/home/jenkins/.buildout/eggs/Products.ATContentTypes-2.1.11-py2.7.egg/Products/ATContentTypes/content/base.py", line 122, in initializeArchetype
    self.setDefaults()
  File "/home/jenkins/.buildout/eggs/Products.Archetypes-1.8.6-py2.7.egg/Products/Archetypes/BaseObject.py", line 439, in setDefaults
    self.Schema().setDefaults(self)
  File "/home/jenkins/.buildout/eggs/Products.Archetypes-1.8.6-py2.7.egg/Products/Archetypes/Schema/__init__.py", line 498, in setDefaults
    mapply(mutator, *args, **kw)
  File "/home/jenkins/.buildout/eggs/Products.Archetypes-1.8.6-py2.7.egg/Products/Archetypes/utils.py", line 123, in mapply
    return method(*call_args, **kw)
  File "/home/jenkins/.buildout/eggs/archetypes.schemaextender-2.1.2-py2.7.egg/archetypes/schemaextender/field.py", line 38, in mutator
    self.set(instance, value, **kw)
  File "/home/jenkins/.buildout/eggs/plone.app.blob-1.5.6-py2.7.egg/plone/app/blob/subtypes/image.py", line 21, in set
    super(ExtensionBlobField, self).set(instance, value, **kwargs)
  File "/home/jenkins/.buildout/eggs/plone.app.blob-1.5.6-py2.7.egg/plone/app/blob/field.py", line 248, in set
    savepoint(optimistic=True)
  File "/home/jenkins/.buildout/eggs/transaction-1.1.1-py2.7.egg/transaction/_manager.py", line 101, in savepoint
    return self.get().savepoint(optimistic)
  File "/home/jenkins/.buildout/eggs/transaction-1.1.1-py2.7.egg/transaction/_transaction.py", line 260, in savepoint
    self._saveAndRaiseCommitishError() # reraises!
  File "/home/jenkins/.buildout/eggs/transaction-1.1.1-py2.7.egg/transaction/_transaction.py", line 257, in savepoint
    savepoint = Savepoint(self, optimistic, *self._resources)
  File "/home/jenkins/.buildout/eggs/transaction-1.1.1-py2.7.egg/transaction/_transaction.py", line 690, in __init__
    savepoint = savepoint()
  File "/home/jenkins/.buildout/eggs/ZODB3-3.10.5-py2.7-linux-x86_64.egg/ZODB/Connection.py", line 1123, in savepoint
    self._commit(None)
  File "/home/jenkins/.buildout/eggs/ZODB3-3.10.5-py2.7-linux-x86_64.egg/ZODB/Connection.py", line 623, in _commit
    self._store_objects(ObjectWriter(obj), transaction)
  File "/home/jenkins/.buildout/eggs/ZODB3-3.10.5-py2.7-linux-x86_64.egg/ZODB/Connection.py", line 669, in _store_objects
    blobfilename = obj._uncommitted()
  File "/home/jenkins/.buildout/eggs/ZODB3-3.10.5-py2.7-linux-x86_64.egg/ZODB/blob.py", line 286, in _uncommitted
    filename = self._create_uncommitted_file()
  File "/home/jenkins/.buildout/eggs/ZODB3-3.10.5-py2.7-linux-x86_64.egg/ZODB/blob.py", line 271, in _create_uncommitted_file
    filename = utils.mktemp(dir=tempdir)
  File "/home/jenkins/.buildout/eggs/ZODB3-3.10.5-py2.7-linux-x86_64.egg/ZODB/utils.py", line 224, in mktemp
    handle, filename = mkstemp(dir=dir)
  File "/usr/lib/python2.7/tempfile.py", line 300, in mkstemp
    return _mkstemp_inner(dir, prefix, suffix, flags)
  File "/usr/lib/python2.7/tempfile.py", line 235, in _mkstemp_inner
    fd = _os.open(file, flags, 0600)


REGRESSION:  plone.app.workflow.tests.test_remap.TestRemapWorkflow.test_remap_to_default

Error Message:
[Errno 2] No such file or directory: '/tmp/tmpB5aKtz.demoblobs/tmp/tmpXNeCAU'

Stack Trace:
[Errno 2] No such file or directory: '/tmp/tmpB5aKtz.demoblobs/tmp/tmpXNeCAU'

  File "/usr/lib/python2.7/unittest/case.py", line 318, in run
    self.setUp()
  File "/home/jenkins/.buildout/eggs/Zope2-2.13.19-py2.7.egg/Testing/ZopeTestCase/PortalTestCase.py", line 60, in setUp
    self.afterSetUp()
  File "/home/jenkins/.buildout/eggs/plone.app.workflow-2.0.10-py2.7.egg/plone/app/workflow/tests/test_remap.py", line 27, in afterSetUp
    self.portal.invokeFactory('Image', 'i1')
  File "/home/jenkins/.buildout/eggs/Products.CMFCore-2.2.7-py2.7.egg/Products/CMFCore/PortalFolder.py", line 292, in invokeFactory
    return pt.constructContent(type_name, self, id, RESPONSE, *args, **kw)
  File "/home/jenkins/.buildout/eggs/Products.CMFCore-2.2.7-py2.7.egg/Products/CMFCore/TypesTool.py", line 833, in constructContent
    ob = info.constructInstance(container, id, *args, **kw)
  File "/home/jenkins/.buildout/eggs/Products.CMFCore-2.2.7-py2.7.egg/Products/CMFCore/TypesTool.py", line 311, in constructInstance
    return self._constructInstance(container, id, *args, **kw)
  File "/home/jenkins/.buildout/eggs/Products.CMFCore-2.2.7-py2.7.egg/Products/CMFCore/TypesTool.py", line 552, in _constructInstance
    newid = m(id, *args, **kw)
  File "/home/jenkins/.buildout/eggs/plone.app.blob-1.5.6-py2.7.egg/plone/app/blob/content.py", line 68, in addATBlobImage
    return addATBlob(container, id, subtype='Image', **kwargs)
  File "/home/jenkins/.buildout/eggs/plone.app.blob-1.5.6-py2.7.egg/plone/app/blob/content.py", line 59, in addATBlob
    obj.initializeArchetype(**kwargs)
  File "/home/jenkins/.buildout/eggs/Products.ATContentTypes-2.1.11-py2.7.egg/Products/ATContentTypes/content/base.py", line 122, in initializeArchetype
    self.setDefaults()
  File "/home/jenkins/.buildout/eggs/Products.Archetypes-1.8.6-py2.7.egg/Products/Archetypes/BaseObject.py", line 439, in setDefaults
    self.Schema().setDefaults(self)
  File "/home/jenkins/.buildout/eggs/Products.Archetypes-1.8.6-py2.7.egg/Products/Archetypes/Schema/__init__.py", line 498, in setDefaults
    mapply(mutator, *args, **kw)
  File "/home/jenkins/.buildout/eggs/Products.Archetypes-1.8.6-py2.7.egg/Products/Archetypes/utils.py", line 123, in mapply
    return method(*call_args, **kw)
  File "/home/jenkins/.buildout/eggs/archetypes.schemaextender-2.1.2-py2.7.egg/archetypes/schemaextender/field.py", line 38, in mutator
    self.set(instance, value, **kw)
  File "/home/jenkins/.buildout/eggs/plone.app.blob-1.5.6-py2.7.egg/plone/app/blob/subtypes/image.py", line 21, in set
    super(ExtensionBlobField, self).set(instance, value, **kwargs)
  File "/home/jenkins/.buildout/eggs/plone.app.blob-1.5.6-py2.7.egg/plone/app/blob/field.py", line 248, in set
    savepoint(optimistic=True)
  File "/home/jenkins/.buildout/eggs/transaction-1.1.1-py2.7.egg/transaction/_manager.py", line 101, in savepoint
    return self.get().savepoint(optimistic)
  File "/home/jenkins/.buildout/eggs/transaction-1.1.1-py2.7.egg/transaction/_transaction.py", line 260, in savepoint
    self._saveAndRaiseCommitishError() # reraises!
  File "/home/jenkins/.buildout/eggs/transaction-1.1.1-py2.7.egg/transaction/_transaction.py", line 257, in savepoint
    savepoint = Savepoint(self, optimistic, *self._resources)
  File "/home/jenkins/.buildout/eggs/transaction-1.1.1-py2.7.egg/transaction/_transaction.py", line 690, in __init__
    savepoint = savepoint()
  File "/home/jenkins/.buildout/eggs/ZODB3-3.10.5-py2.7-linux-x86_64.egg/ZODB/Connection.py", line 1123, in savepoint
    self._commit(None)
  File "/home/jenkins/.buildout/eggs/ZODB3-3.10.5-py2.7-linux-x86_64.egg/ZODB/Connection.py", line 623, in _commit
    self._store_objects(ObjectWriter(obj), transaction)
  File "/home/jenkins/.buildout/eggs/ZODB3-3.10.5-py2.7-linux-x86_64.egg/ZODB/Connection.py", line 669, in _store_objects
    blobfilename = obj._uncommitted()
  File "/home/jenkins/.buildout/eggs/ZODB3-3.10.5-py2.7-linux-x86_64.egg/ZODB/blob.py", line 286, in _uncommitted
    filename = self._create_uncommitted_file()
  File "/home/jenkins/.buildout/eggs/ZODB3-3.10.5-py2.7-linux-x86_64.egg/ZODB/blob.py", line 271, in _create_uncommitted_file
    filename = utils.mktemp(dir=tempdir)
  File "/home/jenkins/.buildout/eggs/ZODB3-3.10.5-py2.7-linux-x86_64.egg/ZODB/utils.py", line 224, in mktemp
    handle, filename = mkstemp(dir=dir)
  File "/usr/lib/python2.7/tempfile.py", line 300, in mkstemp
    return _mkstemp_inner(dir, prefix, suffix, flags)
  File "/usr/lib/python2.7/tempfile.py", line 235, in _mkstemp_inner
    fd = _os.open(file, flags, 0600)


REGRESSION:  plone.app.workflow.tests.test_remap.TestRemapWorkflow.test_remap_to_no_workflow

Error Message:
[Errno 2] No such file or directory: '/tmp/tmpB5aKtz.demoblobs/tmp/tmpdd0hhO'

Stack Trace:
[Errno 2] No such file or directory: '/tmp/tmpB5aKtz.demoblobs/tmp/tmpdd0hhO'

  File "/usr/lib/python2.7/unittest/case.py", line 318, in run
    self.setUp()
  File "/home/jenkins/.buildout/eggs/Zope2-2.13.19-py2.7.egg/Testing/ZopeTestCase/PortalTestCase.py", line 60, in setUp
    self.afterSetUp()
  File "/home/jenkins/.buildout/eggs/plone.app.workflow-2.0.10-py2.7.egg/plone/app/workflow/tests/test_remap.py", line 27, in afterSetUp
    self.portal.invokeFactory('Image', 'i1')
  File "/home/jenkins/.buildout/eggs/Products.CMFCore-2.2.7-py2.7.egg/Products/CMFCore/PortalFolder.py", line 292, in invokeFactory
    return pt.constructContent(type_name, self, id, RESPONSE, *args, **kw)
  File "/home/jenkins/.buildout/eggs/Products.CMFCore-2.2.7-py2.7.egg/Products/CMFCore/TypesTool.py", line 833, in constructContent
    ob = info.constructInstance(container, id, *args, **kw)
  File "/home/jenkins/.buildout/eggs/Products.CMFCore-2.2.7-py2.7.egg/Products/CMFCore/TypesTool.py", line 311, in constructInstance
    return self._constructInstance(container, id, *args, **kw)
  File "/home/jenkins/.buildout/eggs/Products.CMFCore-2.2.7-py2.7.egg/Products/CMFCore/TypesTool.py", line 552, in _constructInstance
    newid = m(id, *args, **kw)
  File "/home/jenkins/.buildout/eggs/plone.app.blob-1.5.6-py2.7.egg/plone/app/blob/content.py", line 68, in addATBlobImage
    return addATBlob(container, id, subtype='Image', **kwargs)
  File "/home/jenkins/.buildout/eggs/plone.app.blob-1.5.6-py2.7.egg/plone/app/blob/content.py", line 59, in addATBlob
    obj.initializeArchetype(**kwargs)
  File "/home/jenkins/.buildout/eggs/Products.ATContentTypes-2.1.11-py2.7.egg/Products/ATContentTypes/content/base.py", line 122, in initializeArchetype
    self.setDefaults()
  File "/home/jenkins/.buildout/eggs/Products.Archetypes-1.8.6-py2.7.egg/Products/Archetypes/BaseObject.py", line 439, in setDefaults
    self.Schema().setDefaults(self)
  File "/home/jenkins/.buildout/eggs/Products.Archetypes-1.8.6-py2.7.egg/Products/Archetypes/Schema/__init__.py", line 498, in setDefaults
    mapply(mutator, *args, **kw)
  File "/home/jenkins/.buildout/eggs/Products.Archetypes-1.8.6-py2.7.egg/Products/Archetypes/utils.py", line 123, in mapply
    return method(*call_args, **kw)
  File "/home/jenkins/.buildout/eggs/archetypes.schemaextender-2.1.2-py2.7.egg/archetypes/schemaextender/field.py", line 38, in mutator
    self.set(instance, value, **kw)
  File "/home/jenkins/.buildout/eggs/plone.app.blob-1.5.6-py2.7.egg/plone/app/blob/subtypes/image.py", line 21, in set
    super(ExtensionBlobField, self).set(instance, value, **kwargs)
  File "/home/jenkins/.buildout/eggs/plone.app.blob-1.5.6-py2.7.egg/plone/app/blob/field.py", line 248, in set
    savepoint(optimistic=True)
  File "/home/jenkins/.buildout/eggs/transaction-1.1.1-py2.7.egg/transaction/_manager.py", line 101, in savepoint
    return self.get().savepoint(optimistic)
  File "/home/jenkins/.buildout/eggs/transaction-1.1.1-py2.7.egg/transaction/_transaction.py", line 260, in savepoint
    self._saveAndRaiseCommitishError() # reraises!
  File "/home/jenkins/.buildout/eggs/transaction-1.1.1-py2.7.egg/transaction/_transaction.py", line 257, in savepoint
    savepoint = Savepoint(self, optimistic, *self._resources)
  File "/home/jenkins/.buildout/eggs/transaction-1.1.1-py2.7.egg/transaction/_transaction.py", line 690, in __init__
    savepoint = savepoint()
  File "/home/jenkins/.buildout/eggs/ZODB3-3.10.5-py2.7-linux-x86_64.egg/ZODB/Connection.py", line 1123, in savepoint
    self._commit(None)
  File "/home/jenkins/.buildout/eggs/ZODB3-3.10.5-py2.7-linux-x86_64.egg/ZODB/Connection.py", line 623, in _commit
    self._store_objects(ObjectWriter(obj), transaction)
  File "/home/jenkins/.buildout/eggs/ZODB3-3.10.5-py2.7-linux-x86_64.egg/ZODB/Connection.py", line 669, in _store_objects
    blobfilename = obj._uncommitted()
  File "/home/jenkins/.buildout/eggs/ZODB3-3.10.5-py2.7-linux-x86_64.egg/ZODB/blob.py", line 286, in _uncommitted
    filename = self._create_uncommitted_file()
  File "/home/jenkins/.buildout/eggs/ZODB3-3.10.5-py2.7-linux-x86_64.egg/ZODB/blob.py", line 271, in _create_uncommitted_file
    filename = utils.mktemp(dir=tempdir)
  File "/home/jenkins/.buildout/eggs/ZODB3-3.10.5-py2.7-linux-x86_64.egg/ZODB/utils.py", line 224, in mktemp
    handle, filename = mkstemp(dir=dir)
  File "/usr/lib/python2.7/tempfile.py", line 300, in mkstemp
    return _mkstemp_inner(dir, prefix, suffix, flags)
  File "/usr/lib/python2.7/tempfile.py", line 235, in _mkstemp_inner
    fd = _os.open(file, flags, 0600)


REGRESSION:  plone.app.workflow.tests.test_remap.TestRemapWorkflow.test_remap_with_partial_state_map

Error Message:
[Errno 2] No such file or directory: '/tmp/tmpB5aKtz.demoblobs/tmp/tmpSuoq_i'

Stack Trace:
[Errno 2] No such file or directory: '/tmp/tmpB5aKtz.demoblobs/tmp/tmpSuoq_i'

  File "/usr/lib/python2.7/unittest/case.py", line 318, in run
    self.setUp()
  File "/home/jenkins/.buildout/eggs/Zope2-2.13.19-py2.7.egg/Testing/ZopeTestCase/PortalTestCase.py", line 60, in setUp
    self.afterSetUp()
  File "/home/jenkins/.buildout/eggs/plone.app.workflow-2.0.10-py2.7.egg/plone/app/workflow/tests/test_remap.py", line 27, in afterSetUp
    self.portal.invokeFactory('Image', 'i1')
  File "/home/jenkins/.buildout/eggs/Products.CMFCore-2.2.7-py2.7.egg/Products/CMFCore/PortalFolder.py", line 292, in invokeFactory
    return pt.constructContent(type_name, self, id, RESPONSE, *args, **kw)
  File "/home/jenkins/.buildout/eggs/Products.CMFCore-2.2.7-py2.7.egg/Products/CMFCore/TypesTool.py", line 833, in constructContent
    ob = info.constructInstance(container, id, *args, **kw)
  File "/home/jenkins/.buildout/eggs/Products.CMFCore-2.2.7-py2.7.egg/Products/CMFCore/TypesTool.py", line 311, in constructInstance
    return self._constructInstance(container, id, *args, **kw)
  File "/home/jenkins/.buildout/eggs/Products.CMFCore-2.2.7-py2.7.egg/Products/CMFCore/TypesTool.py", line 552, in _constructInstance
    newid = m(id, *args, **kw)
  File "/home/jenkins/.buildout/eggs/plone.app.blob-1.5.6-py2.7.egg/plone/app/blob/content.py", line 68, in addATBlobImage
    return addATBlob(container, id, subtype='Image', **kwargs)
  File "/home/jenkins/.buildout/eggs/plone.app.blob-1.5.6-py2.7.egg/plone/app/blob/content.py", line 59, in addATBlob
    obj.initializeArchetype(**kwargs)
  File "/home/jenkins/.buildout/eggs/Products.ATContentTypes-2.1.11-py2.7.egg/Products/ATContentTypes/content/base.py", line 122, in initializeArchetype
    self.setDefaults()
  File "/home/jenkins/.buildout/eggs/Products.Archetypes-1.8.6-py2.7.egg/Products/Archetypes/BaseObject.py", line 439, in setDefaults
    self.Schema().setDefaults(self)
  File "/home/jenkins/.buildout/eggs/Products.Archetypes-1.8.6-py2.7.egg/Products/Archetypes/Schema/__init__.py", line 498, in setDefaults
    mapply(mutator, *args, **kw)
  File "/home/jenkins/.buildout/eggs/Products.Archetypes-1.8.6-py2.7.egg/Products/Archetypes/utils.py", line 123, in mapply
    return method(*call_args, **kw)
  File "/home/jenkins/.buildout/eggs/archetypes.schemaextender-2.1.2-py2.7.egg/archetypes/schemaextender/field.py", line 38, in mutator
    self.set(instance, value, **kw)
  File "/home/jenkins/.buildout/eggs/plone.app.blob-1.5.6-py2.7.egg/plone/app/blob/subtypes/image.py", line 21, in set
    super(ExtensionBlobField, self).set(instance, value, **kwargs)
  File "/home/jenkins/.buildout/eggs/plone.app.blob-1.5.6-py2.7.egg/plone/app/blob/field.py", line 248, in set
    savepoint(optimistic=True)
  File "/home/jenkins/.buildout/eggs/transaction-1.1.1-py2.7.egg/transaction/_manager.py", line 101, in savepoint
    return self.get().savepoint(optimistic)
  File "/home/jenkins/.buildout/eggs/transaction-1.1.1-py2.7.egg/transaction/_transaction.py", line 260, in savepoint
    self._saveAndRaiseCommitishError() # reraises!
  File "/home/jenkins/.buildout/eggs/transaction-1.1.1-py2.7.egg/transaction/_transaction.py", line 257, in savepoint
    savepoint = Savepoint(self, optimistic, *self._resources)
  File "/home/jenkins/.buildout/eggs/transaction-1.1.1-py2.7.egg/transaction/_transaction.py", line 690, in __init__
    savepoint = savepoint()
  File "/home/jenkins/.buildout/eggs/ZODB3-3.10.5-py2.7-linux-x86_64.egg/ZODB/Connection.py", line 1123, in savepoint
    self._commit(None)
  File "/home/jenkins/.buildout/eggs/ZODB3-3.10.5-py2.7-linux-x86_64.egg/ZODB/Connection.py", line 623, in _commit
    self._store_objects(ObjectWriter(obj), transaction)
  File "/home/jenkins/.buildout/eggs/ZODB3-3.10.5-py2.7-linux-x86_64.egg/ZODB/Connection.py", line 669, in _store_objects
    blobfilename = obj._uncommitted()
  File "/home/jenkins/.buildout/eggs/ZODB3-3.10.5-py2.7-linux-x86_64.egg/ZODB/blob.py", line 286, in _uncommitted
    filename = self._create_uncommitted_file()
  File "/home/jenkins/.buildout/eggs/ZODB3-3.10.5-py2.7-linux-x86_64.egg/ZODB/blob.py", line 271, in _create_uncommitted_file
    filename = utils.mktemp(dir=tempdir)
  File "/home/jenkins/.buildout/eggs/ZODB3-3.10.5-py2.7-linux-x86_64.egg/ZODB/utils.py", line 224, in mktemp
    handle, filename = mkstemp(dir=dir)
  File "/usr/lib/python2.7/tempfile.py", line 300, in mkstemp
    return _mkstemp_inner(dir, prefix, suffix, flags)
  File "/usr/lib/python2.7/tempfile.py", line 235, in _mkstemp_inner
    fd = _os.open(file, flags, 0600)


FAILED:  plone.app.testing.layers.rst

Error Message:
Failed doctest test for layers.rst

Stack Trace:
Failed doctest test for layers.rst
  File "/home/jenkins/.buildout/eggs/plone.app.testing-4.2.1-py2.7.egg/plone/app/testing/layers.rst", line 0

----------------------------------------------------------------------
File "/home/jenkins/.buildout/eggs/plone.app.testing-4.2.1-py2.7.egg/plone/app/testing/layers.rst", line 287, in layers.rst
Failed example:
    runner.setup_layer(options, layers.PLONE_ZSERVER, setupLayers)
Exception raised:
    Traceback (most recent call last):
      File "/usr/lib/python2.7/doctest.py", line 1289, in __run
        compileflags, 1) in test.globs
      File "<doctest layers.rst[72]>", line 1, in <module>
        runner.setup_layer(options, layers.PLONE_ZSERVER, setupLayers)
      File "/home/jenkins/.buildout/eggs/zope.testing-3.9.7-py2.7.egg/zope/testing/testrunner/runner.py", line 628, in setup_layer
        setup_layer(options, base, setup_layers)
      File "/home/jenkins/.buildout/eggs/zope.testing-3.9.7-py2.7.egg/zope/testing/testrunner/runner.py", line 633, in setup_layer
        layer.setUp()
      File "/home/jenkins/.buildout/eggs/plone.testing-4.0.7-py2.7.egg/plone/testing/z2.py", line 881, in setUp
        self.setUpServer()
      File "/home/jenkins/.buildout/eggs/plone.testing-4.0.7-py2.7.egg/plone/testing/z2.py", line 916, in setUpServer
        server = zhttp_server(ip=self.host, port=self.port, resolver=None, logger_object=zopeLog)
      File "/home/jenkins/.buildout/eggs/Zope2-2.13.19-py2.7.egg/ZServer/HTTPServer.py", line 449, in __init__
        http_server.__init__(self, ip, port, resolver, logger_object)
      File "/home/jenkins/.buildout/eggs/Zope2-2.13.19-py2.7.egg/ZServer/medusa/http_server.py", line 558, in __init__
        self.bind ((ip, port))
      File "/usr/lib/python2.7/asyncore.py", line 341, in bind
        return self.socket.bind(addr)
      File "/usr/lib/python2.7/socket.py", line 224, in meth
        return getattr(self._sock,name)(*args)
    error: [Errno 98] Address already in use


  File "/usr/lib/python2.7/unittest/case.py", line 327, in run
    testMethod()
  File "/usr/lib/python2.7/doctest.py", line 2201, in runTest
    raise self.failureException(self.format_failure(new.getvalue()))


FAILED:  plone.testing.z2.txt

Error Message:
Failed doctest test for z2.txt

Stack Trace:
Failed doctest test for z2.txt
  File "/home/jenkins/.buildout/eggs/plone.testing-4.0.7-py2.7.egg/plone/testing/z2.txt", line 0

----------------------------------------------------------------------
File "/home/jenkins/.buildout/eggs/plone.testing-4.0.7-py2.7.egg/plone/testing/z2.txt", line 491, in z2.txt
Failed example:
    runner.setup_layer(options, z2.ZSERVER, setupLayers)
Exception raised:
    Traceback (most recent call last):
      File "/usr/lib/python2.7/doctest.py", line 1289, in __run
        compileflags, 1) in test.globs
      File "<doctest z2.txt[114]>", line 1, in <module>
        runner.setup_layer(options, z2.ZSERVER, setupLayers)
      File "/home/jenkins/.buildout/eggs/zope.testing-3.9.7-py2.7.egg/zope/testing/testrunner/runner.py", line 628, in setup_layer
        setup_layer(options, base, setup_layers)
      File "/home/jenkins/.buildout/eggs/zope.testing-3.9.7-py2.7.egg/zope/testing/testrunner/runner.py", line 633, in setup_layer
        layer.setUp()
      File "/home/jenkins/.buildout/eggs/plone.testing-4.0.7-py2.7.egg/plone/testing/z2.py", line 881, in setUp
        self.setUpServer()
      File "/home/jenkins/.buildout/eggs/plone.testing-4.0.7-py2.7.egg/plone/testing/z2.py", line 916, in setUpServer
        server = zhttp_server(ip=self.host, port=self.port, resolver=None, logger_object=zopeLog)
      File "/home/jenkins/.buildout/eggs/Zope2-2.13.19-py2.7.egg/ZServer/HTTPServer.py", line 449, in __init__
        http_server.__init__(self, ip, port, resolver, logger_object)
      File "/home/jenkins/.buildout/eggs/Zope2-2.13.19-py2.7.egg/ZServer/medusa/http_server.py", line 558, in __init__
        self.bind ((ip, port))
      File "/usr/lib/python2.7/asyncore.py", line 341, in bind
        return self.socket.bind(addr)
      File "/usr/lib/python2.7/socket.py", line 224, in meth
        return getattr(self._sock,name)(*args)
    error: [Errno 98] Address already in use


  File "/usr/lib/python2.7/unittest/case.py", line 327, in run
    testMethod()
  File "/usr/lib/python2.7/doctest.py", line 2201, in runTest
    raise self.failureException(self.format_failure(new.getvalue()))




CHANGES
-------




More information about the Testbot mailing list