[Testbot] Plone 4.3 – Python 2.7 – Build # 659 – Regression! – 2 failure(s)

admin at jenkins.plone.org admin at jenkins.plone.org
Fri Feb 8 17:04:05 UTC 2013


Total: 5776
Pass: 5774
Fail:  2


2 tests failed.
FAILED:  Products.CMFPlone.tests.testUnicodeSplitter.TestCaseNormalizer.xml.<init>

Error Message:

Stack Trace:
Test report file /home/jenkins/workspace/plone-4.3-python-2.7/parts/jenkins-test/testreports/Products.CMFPlone.tests.testUnicodeSplitter.TestCaseNormalizer.xml was length 0

FAILED:  robotsuite.RobotTestCase.Log_in

Error Message:
Setup of the parent suite failed:

Stack Trace:
Setup of the parent suite failed:
WebDriverException: Message: 'The browser appears to have exited before we could connect. The output was: Error: no display specified\n' 

  File "/home/jenkins/.buildout/eggs/unittest2-0.5.1-py2.7.egg/unittest2/case.py", line 340, in run
  File "/home/jenkins/.buildout/eggs/robotsuite-0.9.0-py2.7.egg/robotsuite/__init__.py", line 309, in runTest
    assert last_status == 'PASS', last_message


More information about the Testbot mailing list