[Testbot] Plone 4.3 – Python 2.6 – Build # 629 – Regression! – 5 failure(s)

admin at jenkins.plone.org admin at jenkins.plone.org
Fri Feb 8 06:39:20 UTC 2013


https://jenkins.plone.org/job/plone-4.3-python-2.6/629/

Total: 7632
Pass: 7627
Fail:  5

FAILED TESTS
------------

5 tests failed.
REGRESSION:  Products.CMFPlone.tests.testUnicodeSplitter.TestCaseNormalizer.testNormalizeLatin1

Error Message:
['\xc4ffin'] != ['\xe4ffin']

Stack Trace:
['\xc4ffin'] != ['\xe4ffin']

  File "/opt/python2.6/lib/python2.6/unittest.py", line 279, in run
    testMethod()
  File "/home/jenkins/workspace/plone-4.3-python-2.6/src/Products.CMFPlone/Products/CMFPlone/tests/testUnicodeSplitter.py", line 127, in testNormalizeLatin1
    self.assertEqual(self.process(input), output)
  File "/opt/python2.6/lib/python2.6/unittest.py", line 350, in failUnlessEqual
    (msg or '%r != %r' % (first, second))


REGRESSION:  Products.CMFPlone.tests.testUnicodeSplitter.TestQuery.testMixedModeQuery

Error Message:
0 != 1

Stack Trace:
0 != 1

  File "/opt/python2.6/lib/python2.6/unittest.py", line 279, in run
    testMethod()
  File "/home/jenkins/workspace/plone-4.3-python-2.6/src/Products.CMFPlone/Products/CMFPlone/tests/testUnicodeSplitter.py", line 212, in testMixedModeQuery
    self.assertEqual(len(brains), 1)
  File "/opt/python2.6/lib/python2.6/unittest.py", line 350, in failUnlessEqual
    (msg or '%r != %r' % (first, second))


REGRESSION:  Products.CMFPlone.tests.testUnicodeSplitter.TestSplitter.testProcessLatin1

Error Message:
['ffin', 'foo'] != ['\xc4ffin', 'foo']

Stack Trace:
['ffin', 'foo'] != ['\xc4ffin', 'foo']

  File "/opt/python2.6/lib/python2.6/unittest.py", line 279, in run
    testMethod()
  File "/home/jenkins/workspace/plone-4.3-python-2.6/src/Products.CMFPlone/Products/CMFPlone/tests/testUnicodeSplitter.py", line 94, in testProcessLatin1
    self.assertEqual(self.process(input), output)
  File "/opt/python2.6/lib/python2.6/unittest.py", line 350, in failUnlessEqual
    (msg or '%r != %r' % (first, second))


FAILED:  plone.app.contentrules.tests.test_ui.Startup

Error Message:
No module named robotsuite

Stack Trace:
No module named robotsuite

  File "/home/jenkins/workspace/plone-4.3-python-2.6/src/plone.app.contentrules/plone/app/contentrules/tests/test_ui.py", line 6, in <module>
    import robotsuite


FAILED:  plone.app.collection.tests.test_acceptance.Startup

Error Message:
No module named robotsuite

Stack Trace:
No module named robotsuite

  File "/home/jenkins/workspace/plone-4.3-python-2.6/src/plone.app.collection/plone/app/collection/tests/test_acceptance.py", line 8, in <module>
    import robotsuite




CHANGES
-------




More information about the Testbot mailing list