[Testbot] Plone 4.3 – Python 2.6 – Build # 619 – Improvement! – 5 failure(s)

admin at jenkins.plone.org admin at jenkins.plone.org
Wed Feb 6 14:58:03 UTC 2013


https://jenkins.plone.org/job/plone-4.3-python-2.6/619/

Total: 7629
Pass: 7624
Fail:  5

FAILED TESTS
------------

5 tests failed.
FAILED:  plone.openid.tests.testExtraction.TestOpenIdExtraction.testFormRedirectPriorities

Error Message:
Redirect not raised

Stack Trace:
Redirect not raised

  File "/opt/python2.6/lib/python2.6/unittest.py", line 279, in run
    testMethod()
  File "/home/jenkins/.buildout/eggs/plone.openid-2.0.1-py2.6.egg/plone/openid/tests/testExtraction.py", line 114, in testFormRedirectPriorities
    plugin.extractCredentials, plugin.REQUEST)
  File "/opt/python2.6/lib/python2.6/unittest.py", line 342, in failUnlessRaises
    raise self.failureException, "%s not raised" % excName


FAILED:  plone.openid.tests.testExtraction.TestOpenIdExtraction.testLeadingWhiteSpacesInIdentityExtraction

Error Message:
Redirect not raised

Stack Trace:
Redirect not raised

  File "/opt/python2.6/lib/python2.6/unittest.py", line 279, in run
    testMethod()
  File "/home/jenkins/.buildout/eggs/plone.openid-2.0.1-py2.6.egg/plone/openid/tests/testExtraction.py", line 59, in testLeadingWhiteSpacesInIdentityExtraction
    plugin.REQUEST)
  File "/opt/python2.6/lib/python2.6/unittest.py", line 342, in failUnlessRaises
    raise self.failureException, "%s not raised" % excName


FAILED:  plone.openid.tests.testExtraction.TestOpenIdExtraction.testRedirect

Error Message:
Redirect not raised

Stack Trace:
Redirect not raised

  File "/opt/python2.6/lib/python2.6/unittest.py", line 279, in run
    testMethod()
  File "/home/jenkins/.buildout/eggs/plone.openid-2.0.1-py2.6.egg/plone/openid/tests/testExtraction.py", line 82, in testRedirect
    plugin.REQUEST)
  File "/opt/python2.6/lib/python2.6/unittest.py", line 342, in failUnlessRaises
    raise self.failureException, "%s not raised" % excName


FAILED:  plone.openid.tests.testExtraction.TestOpenIdExtraction.testTrailingWhiteSpacesInIdentityExtraction

Error Message:
Redirect not raised

Stack Trace:
Redirect not raised

  File "/opt/python2.6/lib/python2.6/unittest.py", line 279, in run
    testMethod()
  File "/home/jenkins/.buildout/eggs/plone.openid-2.0.1-py2.6.egg/plone/openid/tests/testExtraction.py", line 71, in testTrailingWhiteSpacesInIdentityExtraction
    plugin.REQUEST)
  File "/opt/python2.6/lib/python2.6/unittest.py", line 342, in failUnlessRaises
    raise self.failureException, "%s not raised" % excName


FAILED:  plone.app.collection.tests.test_acceptance.Startup

Error Message:
No module named robotsuite

Stack Trace:
No module named robotsuite

  File "/home/jenkins/workspace/plone-4.3-python-2.6/src/plone.app.collection/plone/app/collection/tests/test_acceptance.py", line 8, in <module>
    import robotsuite




CHANGES
-------




More information about the Testbot mailing list