[Testbot] Plone 4.3 – Python 2.7 – Build # 640 – Improvement! – 2 failure(s)

admin at jenkins.plone.org admin at jenkins.plone.org
Tue Feb 5 21:16:08 UTC 2013


https://jenkins.plone.org/job/plone-4.3-python-2.7/640/

Total: 7629
Pass: 7627
Fail:  2

FAILED TESTS
------------

2 tests failed.
REGRESSION:  plone.app.testing.layers.rst

Error Message:
Failed doctest test for layers.rst

Stack Trace:
Failed doctest test for layers.rst
  File "/home/jenkins/workspace/plone-4.3-python-2.7/src/plone.app.testing/plone/app/testing/layers.rst", line 0

----------------------------------------------------------------------
File "/home/jenkins/workspace/plone-4.3-python-2.7/src/plone.app.testing/plone/app/testing/layers.rst", line 394, in layers.rst
Failed example:
    runner.setup_layer(options, layers.PLONE_FTP_SERVER, setupLayers)
Exception raised:
    Traceback (most recent call last):
      File "/usr/lib/python2.7/doctest.py", line 1289, in __run
        compileflags, 1) in test.globs
      File "<doctest layers.rst[109]>", line 1, in <module>
        runner.setup_layer(options, layers.PLONE_FTP_SERVER, setupLayers)
      File "/home/jenkins/.buildout/eggs/zope.testing-3.9.7-py2.7.egg/zope/testing/testrunner/runner.py", line 628, in setup_layer
        setup_layer(options, base, setup_layers)
      File "/home/jenkins/.buildout/eggs/zope.testing-3.9.7-py2.7.egg/zope/testing/testrunner/runner.py", line 633, in setup_layer
        layer.setUp()
      File "/home/jenkins/workspace/plone-4.3-python-2.7/src/plone.testing/src/plone/testing/z2.py", line 887, in setUp
        self.setUpServer()
      File "/home/jenkins/workspace/plone-4.3-python-2.7/src/plone.testing/src/plone/testing/z2.py", line 990, in setUpServer
        self.ftpServer = FTPServer('Zope2', ip=self.host, port=self.port, logger_object=zopeLog)
      File "/home/jenkins/.buildout/eggs/Zope2-2.13.19-py2.7.egg/ZServer/FTPServer.py", line 637, in __init__
        ftp_server.__init__(self, None, *args, **kw)
      File "/home/jenkins/.buildout/eggs/Zope2-2.13.19-py2.7.egg/ZServer/medusa/ftp_server.py", line 727, in __init__
        self.bind ((self.ip, self.port))
      File "/usr/lib/python2.7/asyncore.py", line 341, in bind
        return self.socket.bind(addr)
      File "/usr/lib/python2.7/socket.py", line 224, in meth
        return getattr(self._sock,name)(*args)
    error: [Errno 98] Address already in use


  File "/usr/lib/python2.7/unittest/case.py", line 327, in run
    testMethod()
  File "/usr/lib/python2.7/doctest.py", line 2201, in runTest
    raise self.failureException(self.format_failure(new.getvalue()))


FAILED:  plone.app.collection.tests.test_acceptance.Startup

Error Message:
No module named robotsuite

Stack Trace:
No module named robotsuite

  File "/home/jenkins/workspace/plone-4.3-python-2.7/src/plone.app.collection/plone/app/collection/tests/test_acceptance.py", line 8, in <module>
    import robotsuite




CHANGES
-------




More information about the Testbot mailing list