[Testbot] Plone 4.3 – Python 2.6 – Build # 612 – Regression! – 3 failure(s)

admin at jenkins.plone.org admin at jenkins.plone.org
Tue Feb 5 05:46:01 UTC 2013


https://jenkins.plone.org/job/plone-4.3-python-2.6/612/

Total: 7629
Pass: 7626
Fail:  3

FAILED TESTS
------------

3 tests failed.
REGRESSION:  plone.app.testing.layers.rst

Error Message:
Failed doctest test for layers.rst

Stack Trace:
Failed doctest test for layers.rst
  File "/home/jenkins/workspace/plone-4.3-python-2.6/src/plone.app.testing/plone/app/testing/layers.rst", line 0

----------------------------------------------------------------------
File "/home/jenkins/workspace/plone-4.3-python-2.6/src/plone.app.testing/plone/app/testing/layers.rst", line 405, in layers.rst
Failed example:
    host
Expected:
    'localhost'
Got:
    'nohost'


  File "/opt/python2.6/lib/python2.6/unittest.py", line 279, in run
    testMethod()
  File "/opt/python2.6/lib/python2.6/doctest.py", line 2163, in runTest
    raise self.failureException(self.format_failure(new.getvalue()))


REGRESSION:  src.plone.testing.z2.txt

Error Message:
Failed doctest test for z2.txt

Stack Trace:
Failed doctest test for z2.txt
  File "/home/jenkins/workspace/plone-4.3-python-2.6/src/plone.testing/src/plone/testing/z2.txt", line 0

----------------------------------------------------------------------
File "/home/jenkins/workspace/plone-4.3-python-2.6/src/plone.testing/src/plone/testing/z2.txt", line 604, in z2.txt
Failed example:
    runner.setup_layer(options, z2.FTP_SERVER, setupLayers)
Exception raised:
    Traceback (most recent call last):
      File "/opt/python2.6/lib/python2.6/doctest.py", line 1253, in __run
        compileflags, 1) in test.globs
      File "<doctest z2.txt[146]>", line 1, in <module>
        runner.setup_layer(options, z2.FTP_SERVER, setupLayers)
      File "/home/jenkins/.buildout/eggs/zope.testing-3.9.7-py2.6.egg/zope/testing/testrunner/runner.py", line 628, in setup_layer
        setup_layer(options, base, setup_layers)
      File "/home/jenkins/.buildout/eggs/zope.testing-3.9.7-py2.6.egg/zope/testing/testrunner/runner.py", line 633, in setup_layer
        layer.setUp()
      File "/home/jenkins/workspace/plone-4.3-python-2.6/src/plone.testing/src/plone/testing/z2.py", line 887, in setUp
        self.setUpServer()
      File "/home/jenkins/workspace/plone-4.3-python-2.6/src/plone.testing/src/plone/testing/z2.py", line 990, in setUpServer
        self.ftpServer = FTPServer('Zope2', ip=self.host, port=self.port, logger_object=zopeLog)
      File "/home/jenkins/.buildout/eggs/Zope2-2.13.19-py2.6.egg/ZServer/FTPServer.py", line 637, in __init__
        ftp_server.__init__(self, None, *args, **kw)
      File "/home/jenkins/.buildout/eggs/Zope2-2.13.19-py2.6.egg/ZServer/medusa/ftp_server.py", line 727, in __init__
        self.bind ((self.ip, self.port))
      File "/opt/python2.6/lib/python2.6/asyncore.py", line 333, in bind
        return self.socket.bind(addr)
      File "<string>", line 1, in bind
    error: [Errno 98] Address already in use


  File "/opt/python2.6/lib/python2.6/unittest.py", line 279, in run
    testMethod()
  File "/opt/python2.6/lib/python2.6/doctest.py", line 2163, in runTest
    raise self.failureException(self.format_failure(new.getvalue()))


FAILED:  plone.app.collection.tests.test_acceptance.Startup

Error Message:
No module named robotsuite

Stack Trace:
No module named robotsuite

  File "/home/jenkins/workspace/plone-4.3-python-2.6/src/plone.app.collection/plone/app/collection/tests/test_acceptance.py", line 8, in <module>
    import robotsuite




CHANGES
-------




More information about the Testbot mailing list