[Testbot] FAILED (108 packages, 2 failures) : Plone-4.1 Zope-2.13 Python-2.6.6

Plone Tests plone-tests at epy.co.at
Wed May 18 06:58:43 UTC 2011


Plone Tests : FAILED (108 packages, 2 failures)
Plone-4.1 Zope-2.13 Python-2.6.6

Running ./bin/alltests -q --no-color --no-progress
/home/stefan/autotest/temp/python26-zope213-cmf22-plone41/bin/test:262: DeprecationWarning: zope.testing.testrunner is deprecated in favour of zope.testrunner.
  import zope.testing.testrunner
/home/stefan/autotest/temp/python26-zope213-cmf22-plone41/eggs/zope.testing-3.9.6-py2.6.egg/zope/testing/testrunner/formatter.py:28: DeprecationWarning: zope.testing.exceptions is deprecated in favour of zope.testrunner.exceptions
  from zope.testing.exceptions import DocTestFailureException
Running Products.CMFTestCase.layer.CMFSite tests:
  Set up Testing.ZopeTestCase.layer.ZopeLite in 0.922 seconds.
  Set up Products.CMFTestCase.layer.ZCML in 3.603 seconds.
  Set up Products.CMFTestCase.layer.CMFSite/home/stefan/autotest/temp/python26-zope213-cmf22-plone41/src/Products.GenericSetup/Products/GenericSetup/utils.py:122: DeprecationWarning: UserFolder is deprecated. User folders are no longer part of AccessControl, please depend on Zope2 and import from OFS.userfolder or use the new minimal user folder classes from AccessControl.userfolder.
  obj = getattr( obj, part )
 in 1.471 seconds.
  Ran 31 tests with 0 failures and 0 errors in 0.523 seconds.
Running Products.PloneTestCase.layer.PloneSite tests:
  Tear down Products.CMFTestCase.layer.CMFSite in 0.033 seconds.
  Tear down Products.CMFTestCase.layer.ZCML in 0.004 seconds.
  Set up Products.PloneTestCase.layer.ZCML in 2.341 seconds.
  Set up Products.PloneTestCase.layer.PloneSite in 4.379 seconds.
/home/stefan/autotest/temp/python26-zope213-cmf22-plone41/src/Products.ZCatalog/src/Products/ZCatalog/ZCatalog.py:604: DeprecationWarning: Your query None produced no query restriction. Currently the entire catalog content is returned. In Zope 2.14 this will result in an empty LazyCat to be returned.
  return self._catalog.searchResults(REQUEST, used, **kw)
  Ran 613 tests with 0 failures and 0 errors in 1 minutes 20.696 seconds.
Tearing down left over layers:
  Tear down Products.PloneTestCase.layer.PloneSite in 0.183 seconds.
  Tear down Products.PloneTestCase.layer.ZCML in 0.010 seconds.
  Tear down Testing.ZopeTestCase.layer.ZopeLite in 0.000 seconds.
Total: 644 tests, 0 failures, 0 errors in 1 minutes 34.715 seconds.
/home/stefan/autotest/temp/python26-zope213-cmf22-plone41/bin/test:262: DeprecationWarning: zope.testing.testrunner is deprecated in favour of zope.testrunner.
  import zope.testing.testrunner
/home/stefan/autotest/temp/python26-zope213-cmf22-plone41/eggs/zope.testing-3.9.6-py2.6.egg/zope/testing/testrunner/formatter.py:28: DeprecationWarning: zope.testing.exceptions is deprecated in favour of zope.testrunner.exceptions
  from zope.testing.exceptions import DocTestFailureException
/home/stefan/autotest/temp/python26-zope213-cmf22-plone41/eggs/Products.i18ntestcase-1.2-py2.6.egg/Products/i18ntestcase/PotTestCase.py:13: DeprecationWarning: The popen2 module is deprecated.  Use the subprocess module.
  from popen2 import popen4
/home/stefan/autotest/temp/python26-zope213-cmf22-plone41/eggs/Products.kupu-1.5.0-py2.6.egg/Products/kupu/plone/tests/TestContent.py:4: DeprecationWarning: Products.ATReferenceBrowserWidget.ATReferenceBrowserWidget has moved to archetypes.referencebrowserwidget.widget. Import of Products.ATReferenceBrowserWidget.ATReferenceBrowserWidget will become unsupported in Plone 5.0
  from Products.ATReferenceBrowserWidget.ATReferenceBrowserWidget import ReferenceBrowserWidget
Running Testing.ZopeTestCase.layer.ZopeLite tests:
  Set up Testing.ZopeTestCase.layer.ZopeLite in 0.000 seconds.
  Ran 3 tests with 0 failures and 0 errors in 0.010 seconds.
Running Products.PloneTestCase.layer.PloneSite tests:
  Set up Products.PloneTestCase.layer.ZCML in 2.458 seconds.
  Set up Products.PloneTestCase.layer.PloneSite/home/stefan/autotest/temp/python26-zope213-cmf22-plone41/eggs/Products.kupu-1.5.0-py2.6.egg/Products/kupu/plone/util.py:29: DeprecationWarning: minimalpath() is deprecated and will be removed in CMF 2.3.
  kupu_plone_skin_dir = minimalpath(os.path.join(kupu_package_dir, relpath))
/home/stefan/autotest/temp/python26-zope213-cmf22-plone41/eggs/Products.kupu-1.5.0-py2.6.egg/Products/kupu/plone/util.py:30: DeprecationWarning: createDirectoryView() called with deprecated reg_key format. Support for old key formats will be removed in CMF 2.3. Please use the new key format <product>:<subdir> instead.
  createDirectoryView(skinstool, kupu_plone_skin_dir, name)
<string>:207: DeprecationWarning: changeSkin should be called with 'REQUEST' as second argument. The BBB code will be removed in CMF 2.3.
/home/stefan/autotest/temp/python26-zope213-cmf22-plone41/eggs/Products.kupu-1.5.0-py2.6.egg/Products/kupu/plone/tests/kuputestcase.py:26: DeprecationWarning: load_config is deprecated. Please import from Zope2.App.zcml
  zcml.load_config('configure.zcml', Products.kupu.plone)
 in 5.888 seconds.
/home/stefan/autotest/temp/python26-zope213-cmf22-plone41/eggs/Products.CMFPlacefulWorkflow-1.5.4-py2.6.egg/Products/CMFPlacefulWorkflow/tests/policy_form.txt:1: DeprecationWarning: Browser is deprecated. Please import from Testing.testbrowser
  ;-*-Doctest-*-
/home/stefan/autotest/temp/python26-zope213-cmf22-plone41/eggs/Products.kupu-1.5.0-py2.6.egg/Products/kupu/plone/plonedrawers.py:224: DeprecationWarning: getIcon() is deprecated and provides only limited backwards compatibility. It will be removed in CMF 2.4. Please use getIconExprObject() instead.
  return "%s/%s" % (self.base, type.getIcon())
  Ran 390 tests with 0 failures and 0 errors in 22.699 seconds.
Running Products.CMFPlacefulWorkflow.tests.test_exportimport.ExportImportLayer tests:
  Set up Products.CMFPlacefulWorkflow.tests.test_exportimport.ExportImportLayer in 0.003 seconds.
  Ran 1 tests with 0 failures and 0 errors in 1.001 seconds.
Running zope.testing.testrunner.layer.UnitTests tests:
  Tear down Products.CMFPlacefulWorkflow.tests.test_exportimport.ExportImportLayer in 0.000 seconds.
  Tear down Products.PloneTestCase.layer.PloneSite in 0.194 seconds.
  Tear down Products.PloneTestCase.layer.ZCML in 0.008 seconds.
  Tear down Testing.ZopeTestCase.layer.ZopeLite in 0.000 seconds.
  Set up zope.testing.testrunner.layer.UnitTests in 0.000 seconds.
Generated checkid_setup request to http://www.myopenid.com/server with assocication {HMAC-SHA1}{4dd363c1}{Ihossg==}
Generated checkid_setup request to http://www.myopenid.com/server with assocication {HMAC-SHA1}{4dd363c2}{CBDnKQ==}
  Ran 19 tests with 0 failures and 0 errors in 1.558 seconds.
Tearing down left over layers:
  Tear down zope.testing.testrunner.layer.UnitTests in 0.000 seconds.
Total: 413 tests, 0 failures, 0 errors in 34.838 seconds.
/home/stefan/autotest/temp/python26-zope213-cmf22-plone41/bin/test:262: DeprecationWarning: zope.testing.testrunner is deprecated in favour of zope.testrunner.
  import zope.testing.testrunner
/home/stefan/autotest/temp/python26-zope213-cmf22-plone41/eggs/zope.testing-3.9.6-py2.6.egg/zope/testing/testrunner/formatter.py:28: DeprecationWarning: zope.testing.exceptions is deprecated in favour of zope.testrunner.exceptions
  from zope.testing.exceptions import DocTestFailureException
Running Testing.ZopeTestCase.layer.ZopeLite tests:
  Set up Testing.ZopeTestCase.layer.ZopeLite in 0.740 seconds.
/home/stefan/autotest/temp/python26-zope213-cmf22-plone41/bin/test:1: DeprecationWarning: load_config is deprecated. Please import from Zope2.App.zcml
  #!/usr/local/python2.6/bin/python
  Ran 9 tests with 0 failures and 0 errors in 0.094 seconds.
Running Products.Archetypes.tests.layer.ZCML tests:
  Set up Products.CMFCore.testing.FunctionalZCMLLayer in 0.181 seconds.
  Set up Products.Archetypes.tests.layer.ZCML in 0.286 seconds.
  Ran 59 tests with 0 failures and 0 errors in 3.792 seconds.
Running Products.Archetypes.tests.layer.ArchetypesSite tests:
  Set up Products.Archetypes.tests.layer.ArchetypesSite/home/stefan/autotest/temp/python26-zope213-cmf22-plone41/src/Products.GenericSetup/Products/GenericSetup/utils.py:122: DeprecationWarning: UserFolder is deprecated. User folders are no longer part of AccessControl, please depend on Zope2 and import from OFS.userfolder or use the new minimal user folder classes from AccessControl.userfolder.
  obj = getattr( obj, part )
 in 1.456 seconds.
/home/stefan/autotest/temp/python26-zope213-cmf22-plone41/src/Products.ZCatalog/src/Products/ZCatalog/ZCatalog.py:604: DeprecationWarning: Your query None produced no query restriction. Currently the entire catalog content is returned. In Zope 2.14 this will result in an empty LazyCat to be returned.
  return self._catalog.searchResults(REQUEST, used, **kw)
  Ran 462 tests with 0 failures and 0 errors in 36.348 seconds.
Running Products.PloneTestCase.layer.PloneSite tests:
  Tear down Products.Archetypes.tests.layer.ArchetypesSite in 0.040 seconds.
  Tear down Products.Archetypes.tests.layer.ZCML in 0.005 seconds.
  Tear down Products.CMFCore.testing.FunctionalZCMLLayer in 0.001 seconds.
  Set up Products.PloneTestCase.layer.ZCML in 3.185 seconds.
  Set up Products.PloneTestCase.layer.PloneSite in 4.460 seconds.
  Ran 10 tests with 0 failures and 0 errors in 1.655 seconds.
Running plone.app.kss.tests.kss_and_plone_layer.KSSAndPloneLayer tests:
  Set up plone.app.kss.tests.kss_and_plone_layer.KSSAndPloneLayer in 0.005 seconds.
  Ran 19 tests with 0 failures and 0 errors in 1.863 seconds.
Running zope.testing.testrunner.layer.UnitTests tests:
  Tear down plone.app.kss.tests.kss_and_plone_layer.KSSAndPloneLayer in 0.000 seconds.
  Tear down Products.PloneTestCase.layer.PloneSite in 0.179 seconds.
  Tear down Products.PloneTestCase.layer.ZCML in 0.005 seconds.
  Tear down Testing.ZopeTestCase.layer.ZopeLite in 0.000 seconds.
  Set up zope.testing.testrunner.layer.UnitTests in 0.000 seconds.
  Ran 25 tests with 0 failures and 0 errors in 0.129 seconds.
Tearing down left over layers:
  Tear down zope.testing.testrunner.layer.UnitTests in 0.000 seconds.
Total: 584 tests, 0 failures, 0 errors in 55.878 seconds.
/home/stefan/autotest/temp/python26-zope213-cmf22-plone41/bin/test:262: DeprecationWarning: zope.testing.testrunner is deprecated in favour of zope.testrunner.
  import zope.testing.testrunner
/home/stefan/autotest/temp/python26-zope213-cmf22-plone41/eggs/zope.testing-3.9.6-py2.6.egg/zope/testing/testrunner/formatter.py:28: DeprecationWarning: zope.testing.exceptions is deprecated in favour of zope.testrunner.exceptions
  from zope.testing.exceptions import DocTestFailureException
Running Testing.ZopeTestCase.layer.ZopeLite tests:
  Set up Testing.ZopeTestCase.layer.ZopeLite in 0.081 seconds.
  Ran 229 tests with 0 failures and 0 errors in 1.127 seconds.
Running Products.CMFCalendar.testing.FunctionalLayer tests:
  Set up Products.CMFCore.testing.FunctionalZCMLLayer in 0.162 seconds.
  Set up Products.CMFCalendar.testing.FunctionalLayer/home/stefan/autotest/temp/python26-zope213-cmf22-plone41/src/Products.GenericSetup/Products/GenericSetup/utils.py:122: DeprecationWarning: UserFolder is deprecated. User folders are no longer part of AccessControl, please depend on Zope2 and import from OFS.userfolder or use the new minimal user folder classes from AccessControl.userfolder.
  obj = getattr( obj, part )
 in 0.409 seconds.
  Ran 20 tests with 0 failures and 0 errors in 1.396 seconds.
Running Products.CMFCore.testing.EventZCMLLayer tests:
  Tear down Products.CMFCalendar.testing.FunctionalLayer in 0.017 seconds.
  Tear down Products.CMFCore.testing.FunctionalZCMLLayer in 0.001 seconds.
  Set up Products.CMFCore.testing.EventZCMLLayer in 0.001 seconds.
  Ran 8 tests with 0 failures and 0 errors in 0.201 seconds.
Running Products.CMFCore.testing.ExportImportZCMLLayer tests:
  Tear down Products.CMFCore.testing.EventZCMLLayer in 0.000 seconds.
  Set up Products.CMFCore.testing.ExportImportZCMLLayer in 0.001 seconds.
  Ran 10 tests with 0 failures and 0 errors in 0.627 seconds.
Running Products.CMFCore.testing.TraversingEventZCMLLayer tests:
  Tear down Products.CMFCore.testing.ExportImportZCMLLayer in 0.000 seconds.
  Set up Products.CMFCore.testing.TraversingEventZCMLLayer in 0.001 seconds.
  Ran 5 tests with 0 failures and 0 errors in 0.164 seconds.
Running Products.CMFDefault.testing.FunctionalLayer tests:
  Tear down Products.CMFCore.testing.TraversingEventZCMLLayer in 0.000 seconds.
  Set up Products.CMFCore.testing.FunctionalZCMLLayer in 0.146 seconds.
  Set up Products.CMFDefault.testing.FunctionalLayer in 0.296 seconds.
  Ran 32 tests with 0 failures and 0 errors in 4.091 seconds.
Running Products.CMFUid.testing.UidEventZCMLLayer tests:
  Tear down Products.CMFDefault.testing.FunctionalLayer in 0.015 seconds.
  Tear down Products.CMFCore.testing.FunctionalZCMLLayer in 0.002 seconds.
  Set up Products.CMFUid.testing.UidEventZCMLLayer in 0.001 seconds.
  Ran 12 tests with 0 failures and 0 errors in 0.308 seconds.
Running Products.DCWorkflow.testing.ExportImportZCMLLayer tests:
  Tear down Products.CMFUid.testing.UidEventZCMLLayer in 0.000 seconds.
  Set up Products.DCWorkflow.testing.ExportImportZCMLLayer in 0.135 seconds.
  Ran 38 tests with 0 failures and 0 errors in 0.715 seconds.
Running Products.GenericSetup.testing.ExportImportZCMLLayer tests:
  Tear down Products.DCWorkflow.testing.ExportImportZCMLLayer in 0.001 seconds.
  Set up Products.GenericSetup.testing.ExportImportZCMLLayer in 0.046 seconds.
  Ran 193 tests with 0 failures and 0 errors in 0.641 seconds.
Running zope.testing.testrunner.layer.UnitTests tests:
  Tear down Products.GenericSetup.testing.ExportImportZCMLLayer in 0.000 seconds.
  Tear down Testing.ZopeTestCase.layer.ZopeLite in 0.000 seconds.
  Set up zope.testing.testrunner.layer.UnitTests in 0.000 seconds.
  Ran 261 tests with 0 failures and 0 errors in 0.271 seconds.
Tearing down left over layers:
  Tear down zope.testing.testrunner.layer.UnitTests in 0.000 seconds.
Total: 808 tests, 0 failures, 0 errors in 12.140 seconds.
/home/stefan/autotest/temp/python26-zope213-cmf22-plone41/bin/test:262: DeprecationWarning: zope.testing.testrunner is deprecated in favour of zope.testrunner.
  import zope.testing.testrunner
/home/stefan/autotest/temp/python26-zope213-cmf22-plone41/eggs/zope.testing-3.9.6-py2.6.egg/zope/testing/testrunner/formatter.py:28: DeprecationWarning: zope.testing.exceptions is deprecated in favour of zope.testrunner.exceptions
  from zope.testing.exceptions import DocTestFailureException
Running Testing.ZopeTestCase.layer.ZopeLite tests:
  Set up Testing.ZopeTestCase.layer.ZopeLite in 0.822 seconds.
  Ran 27 tests with 0 failures and 0 errors in 0.055 seconds.
Running Products.PloneTestCase.layer.PloneSite tests:
  Set up Products.PloneTestCase.layer.ZCML in 3.237 seconds.
  Set up Products.PloneTestCase.layer.PloneSite in 5.616 seconds.
  Ran 135 tests with 0 failures and 0 errors in 22.499 seconds.
Running Products.CMFDiffTool.tests.BaseTestCase.CMFDiffToolLayer tests:
  Set up Products.CMFDiffTool.tests.BaseTestCase.CMFDiffToolLayer/home/stefan/autotest/temp/python26-zope213-cmf22-plone41/eggs/Products.CMFDiffTool-2.0-py2.6.egg/Products/CMFDiffTool/tests/BaseTestCase.py:39: DeprecationWarning: load_config is deprecated. Please import from Zope2.App.zcml
  zcml.load_config('configure.zcml', schemaextender)
 in 0.013 seconds.
  Ran 2 tests with 0 failures and 0 errors in 0.295 seconds.
Running Products.CMFTestCase.layer.CMFSite tests:
  Tear down Products.CMFDiffTool.tests.BaseTestCase.CMFDiffToolLayer in 0.204 seconds.
  Tear down Products.PloneTestCase.layer.PloneSite in 0.006 seconds.
  Tear down Products.PloneTestCase.layer.ZCML in 0.004 seconds.
  Set up Products.CMFTestCase.layer.ZCML in 2.471 seconds.
  Set up Products.CMFTestCase.layer.CMFSite/home/stefan/autotest/temp/python26-zope213-cmf22-plone41/src/Products.GenericSetup/Products/GenericSetup/utils.py:122: DeprecationWarning: UserFolder is deprecated. User folders are no longer part of AccessControl, please depend on Zope2 and import from OFS.userfolder or use the new minimal user folder classes from AccessControl.userfolder.
  obj = getattr( obj, part )
 in 1.304 seconds.
  Ran 20 tests with 0 failures and 0 errors in 0.413 seconds.
Running plone.app.blob.tests.layer.BlobReplacementLayer tests:
  Tear down Products.CMFTestCase.layer.CMFSite in 0.033 seconds.
  Tear down Products.CMFTestCase.layer.ZCML in 0.003 seconds.
  Set up Products.PloneTestCase.layer.ZCML in 2.519 seconds.
  Set up Products.PloneTestCase.layer.PloneSite in 4.448 seconds.
  Set up plone.app.blob.tests.layer.BlobLayer in 0.094 seconds.
  Set up plone.app.blob.tests.layer.BlobReplacementLayer in 0.205 seconds.
  Ran 6 tests with 0 failures and 0 errors in 2.035 seconds.
Running zope.testing.testrunner.layer.UnitTests tests:
  Tear down plone.app.blob.tests.layer.BlobReplacementLayer in 0.000 seconds.
  Tear down plone.app.blob.tests.layer.BlobLayer in 0.000 seconds.
  Tear down Products.PloneTestCase.layer.PloneSite in 0.200 seconds.
  Tear down Products.PloneTestCase.layer.ZCML in 0.004 seconds.
  Tear down Testing.ZopeTestCase.layer.ZopeLite in 0.000 seconds.
  Set up zope.testing.testrunner.layer.UnitTests in 0.000 seconds.
  Ran 1 tests with 0 failures and 0 errors in 0.006 seconds.
Tearing down left over layers:
  Tear down zope.testing.testrunner.layer.UnitTests in 0.000 seconds.
Total: 191 tests, 0 failures, 0 errors in 47.860 seconds.
/home/stefan/autotest/temp/python26-zope213-cmf22-plone41/bin/test:262: DeprecationWarning: zope.testing.testrunner is deprecated in favour of zope.testrunner.
  import zope.testing.testrunner
/home/stefan/autotest/temp/python26-zope213-cmf22-plone41/eggs/zope.testing-3.9.6-py2.6.egg/zope/testing/testrunner/formatter.py:28: DeprecationWarning: zope.testing.exceptions is deprecated in favour of zope.testrunner.exceptions
  from zope.testing.exceptions import DocTestFailureException
/home/stefan/autotest/temp/python26-zope213-cmf22-plone41/src/Products.CMFPlone/Products/CMFPlone/tests/testSSOLogin.py:1: DeprecationWarning: Browser is deprecated. Please import from Testing.testbrowser
  from Products.Five.testbrowser import Browser
/home/stefan/autotest/temp/python26-zope213-cmf22-plone41/eggs/plone.app.content-2.0.6-py2.6.egg/plone/app/content/browser/tests/test_doctests.py:1: DeprecationWarning: zope.testing.doctest is deprecated in favour of the Python standard library doctest module
  from zope.testing import doctest
/home/stefan/autotest/temp/python26-zope213-cmf22-plone41/eggs/plone.app.i18n-2.0-py2.6.egg/plone/app/i18n/locales/browser/tests.py:7: DeprecationWarning: zope.testing.doctestunit is deprecated in favour of the Python standard library doctest module
  from zope.testing.doctestunit import DocTestSuite
/home/stefan/autotest/temp/python26-zope213-cmf22-plone41/eggs/plone.testing-4.0-py2.6.egg/plone/testing/z2.py:19: DeprecationWarning: Zope2VocabularyRegistry is deprecated. Please import from Zope2.App.schema
  from Products.Five.schema import Zope2VocabularyRegistry
Running Testing.ZopeTestCase.layer.ZopeLite tests:
  Set up Testing.ZopeTestCase.layer.ZopeLite in 0.458 seconds.
  Ran 120 tests with 0 failures and 0 errors in 0.727 seconds.
Running Products.CMFTestCase.layer.CMFSite tests:
  Set up Products.CMFTestCase.layer.ZCML in 3.122 seconds.
  Set up Products.CMFTestCase.layer.CMFSite/home/stefan/autotest/temp/python26-zope213-cmf22-plone41/src/Products.GenericSetup/Products/GenericSetup/utils.py:122: DeprecationWarning: UserFolder is deprecated. User folders are no longer part of AccessControl, please depend on Zope2 and import from OFS.userfolder or use the new minimal user folder classes from AccessControl.userfolder.
  obj = getattr( obj, part )
 in 0.234 seconds.
  Ran 31 tests with 0 failures and 0 errors in 3.185 seconds.
Running Products.PloneTestCase.layer.ZCML tests:
  Tear down Products.CMFTestCase.layer.CMFSite in 0.018 seconds.
  Tear down Products.CMFTestCase.layer.ZCML in 0.003 seconds.
  Set up Products.PloneTestCase.layer.ZCML in 2.355 seconds.
  Ran 12 tests with 0 failures and 0 errors in 0.016 seconds.
Running Products.PloneTestCase.layer.PloneSite tests:
  Set up Products.PloneTestCase.layer.PloneSite in 11.366 seconds.
/home/stefan/autotest/temp/python26-zope213-cmf22-plone41/eggs/Products.PortalTransforms-2.0.6-py2.6.egg/Products/PortalTransforms/libtransforms/commandtransform.py:103: DeprecationWarning: os.popen4 is deprecated.  Use the subprocess module.
  cin, couterr = os.popen4(command, 'b')
  Ran 1500 tests with 0 failures and 0 errors in 4 minutes 22.423 seconds.
Running plone.app.contentrules.tests.test_configuration.TestContentrulesGSLayer tests:
  Set up plone.app.contentrules.tests.test_configuration.TestContentrulesGSLayer in 0.003 seconds.
  Ran 6 tests with 0 failures and 0 errors in 2.675 seconds.
Running plone.app.customerize.tests.layer.PloneCustomerize tests:
  Tear down plone.app.contentrules.tests.test_configuration.TestContentrulesGSLayer in 0.000 seconds.
  Set up plone.app.customerize.tests.layer.PloneCustomerize in 0.011 seconds.
  Ran 2 tests with 0 failures and 0 errors in 3.044 seconds.
Running plone.app.kss.tests.kss_and_plone_layer.KSSAndPloneLayer tests:
  Tear down plone.app.customerize.tests.layer.PloneCustomerize in 0.000 seconds.
  Set up plone.app.kss.tests.kss_and_plone_layer.KSSAndPloneLayer in 0.005 seconds.
  Ran 15 tests with 0 failures and 0 errors in 1.256 seconds.
Running plone.app.testing.layers.Plone:Functional tests:
  Tear down plone.app.kss.tests.kss_and_plone_layer.KSSAndPloneLayer in 0.000 seconds.
  Tear down Products.PloneTestCase.layer.PloneSite in 0.598 seconds.
  Tear down Products.PloneTestCase.layer.ZCML in 0.016 seconds.
  Tear down Testing.ZopeTestCase.layer.ZopeLite in 0.000 seconds.
  Set up plone.testing.zca.LayerCleanup in 0.001 seconds.
  Set up plone.testing.z2.Startup/home/stefan/autotest/temp/python26-zope213-cmf22-plone41/eggs/zope.configuration-3.7.4-py2.6.egg/zope/configuration/config.py:193: DeprecationWarning: FiveSecurityPolicy is deprecated. Please import from AccessControl.security
  obj = getattr(mod, oname)
 in 0.123 seconds.
  Set up plone.app.testing.layers.PloneFixture in 5.217 seconds.
  Set up plone.app.testing.layers.Plone:Functional in 0.000 seconds.
  Ran 1 tests with 0 failures and 0 errors in 2.689 seconds.
Running plone.app.upgrade.tests.base.FunctionalUpgradeLayer tests:
  Tear down plone.app.testing.layers.Plone:Functional in 0.000 seconds.
  Tear down plone.app.testing.layers.PloneFixture in 0.102 seconds.
  Tear down plone.testing.z2.Startup in 0.008 seconds.
  Tear down plone.testing.zca.LayerCleanup in 0.007 seconds.
  Set up Testing.ZopeTestCase.layer.ZopeLite in 0.013 seconds.
  Set up Products.PloneTestCase.layer.ZCML in 2.386 seconds.
  Set up Products.PloneTestCase.layer.PloneSite in 11.104 seconds.
  Set up plone.app.upgrade.tests.base.FunctionalUpgradeLayer in 0.000 seconds.


Error in test testDCMIStorageUpdated (plone.app.upgrade.v25.tests.TestFunctionalMigrations)
Traceback (most recent call last):
  File "/usr/local/python2.6/lib/python2.6/unittest.py", line 289, in run
    self.tearDown()
  File "/home/stefan/autotest/temp/python26-zope213-cmf22-plone41/eggs/Zope2-2.13.7-py2.6.egg/Testing/ZopeTestCase/base.py", line 101, in tearDown
    self.beforeTearDown()
  File "/home/stefan/autotest/temp/python26-zope213-cmf22-plone41/src/plone.app.upgrade/plone/app/upgrade/tests/base.py", line 149, in beforeTearDown
    self.app._delObject(self.site_id)
  File "/home/stefan/autotest/temp/python26-zope213-cmf22-plone41/eggs/Zope2-2.13.7-py2.6.egg/OFS/ObjectManager.py", line 388, in _delObject
    notify(ObjectWillBeRemovedEvent(ob, self, id))
  File "/home/stefan/autotest/temp/python26-zope213-cmf22-plone41/eggs/zope.event-3.5.0_1-py2.6.egg/zope/event/__init__.py", line 23, in notify
    subscriber(event)
  File "/home/stefan/autotest/temp/python26-zope213-cmf22-plone41/eggs/zope.component-3.9.5-py2.6.egg/zope/component/event.py", line 24, in dispatch
    zope.component.subscribers(event, None)
  File "/home/stefan/autotest/temp/python26-zope213-cmf22-plone41/eggs/zope.component-3.9.5-py2.6.egg/zope/component/_api.py", line 136, in subscribers
    return sitemanager.subscribers(objects, interface)
  File "/home/stefan/autotest/temp/python26-zope213-cmf22-plone41/eggs/zope.component-3.9.5-py2.6.egg/zope/component/registry.py", line 321, in subscribers
    return self.adapters.subscribers(objects, provided)
  File "/home/stefan/autotest/temp/python26-zope213-cmf22-plone41/eggs/zope.interface-3.6.1-py2.6-linux-x86_64.egg/zope/interface/adapter.py", line 585, in subscribers
    subscription(*objects)
  File "/home/stefan/autotest/temp/python26-zope213-cmf22-plone41/eggs/zope.component-3.9.5-py2.6.egg/zope/component/event.py", line 32, in objectEventNotify
    zope.component.subscribers((event.object, event), None)
  File "/home/stefan/autotest/temp/python26-zope213-cmf22-plone41/eggs/zope.component-3.9.5-py2.6.egg/zope/component/_api.py", line 136, in subscribers
    return sitemanager.subscribers(objects, interface)
  File "/home/stefan/autotest/temp/python26-zope213-cmf22-plone41/eggs/zope.component-3.9.5-py2.6.egg/zope/component/registry.py", line 321, in subscribers
    return self.adapters.subscribers(objects, provided)
  File "/home/stefan/autotest/temp/python26-zope213-cmf22-plone41/eggs/zope.interface-3.6.1-py2.6-linux-x86_64.egg/zope/interface/adapter.py", line 585, in subscribers
    subscription(*objects)
  File "/home/stefan/autotest/temp/python26-zope213-cmf22-plone41/eggs/Zope2-2.13.7-py2.6.egg/OFS/subscribers.py", line 101, in dispatchObjectWillBeMovedEvent
    dispatchToSublocations(ob, event)
  File "/home/stefan/autotest/temp/python26-zope213-cmf22-plone41/eggs/zope.container-3.11.2-py2.6-linux-x86_64.egg/zope/container/contained.py", line 153, in dispatchToSublocations
    for ignored in zope.component.subscribers((sub, event), None):
  File "/home/stefan/autotest/temp/python26-zope213-cmf22-plone41/eggs/zope.component-3.9.5-py2.6.egg/zope/component/_api.py", line 136, in subscribers
    return sitemanager.subscribers(objects, interface)
  File "/home/stefan/autotest/temp/python26-zope213-cmf22-plone41/eggs/zope.component-3.9.5-py2.6.egg/zope/component/registry.py", line 321, in subscribers
    return self.adapters.subscribers(objects, provided)
  File "/home/stefan/autotest/temp/python26-zope213-cmf22-plone41/eggs/zope.interface-3.6.1-py2.6-linux-x86_64.egg/zope/interface/adapter.py", line 585, in subscribers
    subscription(*objects)
  File "/home/stefan/autotest/temp/python26-zope213-cmf22-plone41/eggs/Products.CMFCore-2.2.4-py2.6.egg/Products/CMFCore/CMFCatalogAware.py", line 274, in handleContentishEvent
    ob.unindexObject()
  File "/home/stefan/autotest/temp/python26-zope213-cmf22-plone41/eggs/Products.Archetypes-1.7.5-py2.6.egg/Products/Archetypes/CatalogMultiplex.py", line 48, in unindexObject
    c.uncatalog_object(url)
  File "/home/stefan/autotest/temp/python26-zope213-cmf22-plone41/src/Products.CMFPlone/Products/CMFPlone/CatalogTool.py", line 395, in uncatalog_object
    return BaseTool.uncatalog_object(self, *args, **kwargs)
  File "/home/stefan/autotest/temp/python26-zope213-cmf22-plone41/src/Products.ZCatalog/src/Products/ZCatalog/ZCatalog.py", line 508, in uncatalog_object
    self._catalog.uncatalogObject(uid)
  File "/home/stefan/autotest/temp/python26-zope213-cmf22-plone41/src/Products.ZCatalog/src/Products/ZCatalog/Catalog.py", line 370, in uncatalogObject
    x.unindex_object(rid)
  File "/home/stefan/autotest/temp/python26-zope213-cmf22-plone41/src/Products.ZCatalog/src/Products/PluginIndexes/BooleanIndex/BooleanIndex.py", line 189, in unindex_object
    self.removeForwardIndexEntry(unindexRecord, documentId)
  File "/home/stefan/autotest/temp/python26-zope213-cmf22-plone41/src/Products.ZCatalog/src/Products/PluginIndexes/BooleanIndex/BooleanIndex.py", line 137, in removeForwardIndexEntry
    index_length = self._index_length.value
AttributeError: 'NoneType' object has no attribute 'value'



Error in test testUpgrade (plone.app.upgrade.v25.tests.TestFunctionalMigrations)
Traceback (most recent call last):
  File "/usr/local/python2.6/lib/python2.6/unittest.py", line 289, in run
    self.tearDown()
  File "/home/stefan/autotest/temp/python26-zope213-cmf22-plone41/eggs/Zope2-2.13.7-py2.6.egg/Testing/ZopeTestCase/base.py", line 104, in tearDown
    self._clear()
  File "/home/stefan/autotest/temp/python26-zope213-cmf22-plone41/eggs/Products.PloneTestCase-0.9.13-py2.6.egg/Products/PloneTestCase/PloneTestCase.py", line 87, in _clear
    PortalTestCase._clear(self, call_close_hook)
  File "/home/stefan/autotest/temp/python26-zope213-cmf22-plone41/eggs/Zope2-2.13.7-py2.6.egg/Testing/ZopeTestCase/base.py", line 121, in _clear
    self._close()
  File "/home/stefan/autotest/temp/python26-zope213-cmf22-plone41/eggs/Zope2-2.13.7-py2.6.egg/Testing/ZopeTestCase/sandbox.py", line 43, in _close
    connections.closeAll()
  File "/home/stefan/autotest/temp/python26-zope213-cmf22-plone41/eggs/Zope2-2.13.7-py2.6.egg/Testing/ZopeTestCase/connections.py", line 46, in closeAll
    self._do_close(conn)
  File "/home/stefan/autotest/temp/python26-zope213-cmf22-plone41/eggs/Zope2-2.13.7-py2.6.egg/Testing/ZopeTestCase/connections.py", line 53, in _do_close
    conn.REQUEST.close()
  File "/home/stefan/autotest/temp/python26-zope213-cmf22-plone41/eggs/Zope2-2.13.7-py2.6.egg/ZPublisher/BaseRequest.py", line 218, in close
    notify(EndRequestEvent(None, self))
  File "/home/stefan/autotest/temp/python26-zope213-cmf22-plone41/eggs/zope.event-3.5.0_1-py2.6.egg/zope/event/__init__.py", line 23, in notify
    subscriber(event)
  File "/home/stefan/autotest/temp/python26-zope213-cmf22-plone41/eggs/zope.component-3.9.5-py2.6.egg/zope/component/event.py", line 24, in dispatch
    zope.component.subscribers(event, None)
  File "/home/stefan/autotest/temp/python26-zope213-cmf22-plone41/eggs/zope.component-3.9.5-py2.6.egg/zope/component/_api.py", line 136, in subscribers
    return sitemanager.subscribers(objects, interface)
  File "/home/stefan/autotest/temp/python26-zope213-cmf22-plone41/eggs/zope.component-3.9.5-py2.6.egg/zope/component/registry.py", line 321, in subscribers
    return self.adapters.subscribers(objects, provided)
  File "/home/stefan/autotest/temp/python26-zope213-cmf22-plone41/eggs/Products.CMFCore-2.2.4-py2.6.egg/Products/CMFCore/Skinnable.py", line 74, in __getattr__
    subob = getattr(ob, name, _MARKER)
  File "/home/stefan/autotest/temp/python26-zope213-cmf22-plone41/eggs/ZODB3-3.10.2-py2.6-linux-x86_64.egg/ZODB/Connection.py", line 856, in setstate
    self._setstate(obj)
  File "/home/stefan/autotest/temp/python26-zope213-cmf22-plone41/eggs/ZODB3-3.10.2-py2.6-linux-x86_64.egg/ZODB/Connection.py", line 897, in _setstate
    p, serial = self._storage.load(obj._p_oid, '')
  File "/home/stefan/autotest/temp/python26-zope213-cmf22-plone41/eggs/ZODB3-3.10.2-py2.6-linux-x86_64.egg/ZODB/DemoStorage.py", line 159, in load
    return self.base.load(oid, version)
  File "/home/stefan/autotest/temp/python26-zope213-cmf22-plone41/eggs/ZODB3-3.10.2-py2.6-linux-x86_64.egg/ZODB/DemoStorage.py", line 159, in load
    return self.base.load(oid, version)
  File "/home/stefan/autotest/temp/python26-zope213-cmf22-plone41/eggs/ZODB3-3.10.2-py2.6-linux-x86_64.egg/ZODB/utils.py", line 253, in __call__
    return func(*args, **kw)
  File "/home/stefan/autotest/temp/python26-zope213-cmf22-plone41/eggs/ZODB3-3.10.2-py2.6-linux-x86_64.egg/ZODB/MappingStorage.py", line 146, in load
    raise ZODB.POSException.POSKeyError(oid)
POSKeyError: 0x2cb2e962d66b1c14



Error in test testBaseUpgrade (plone.app.upgrade.v30.tests.TestFunctionalMigrations)
Traceback (most recent call last):
  File "/usr/local/python2.6/lib/python2.6/unittest.py", line 270, in run
    self.setUp()
  File "/home/stefan/autotest/temp/python26-zope213-cmf22-plone41/eggs/Zope2-2.13.7-py2.6.egg/Testing/ZopeTestCase/PortalTestCase.py", line 62, in setUp
    self._clear()
  File "/home/stefan/autotest/temp/python26-zope213-cmf22-plone41/eggs/Products.PloneTestCase-0.9.13-py2.6.egg/Products/PloneTestCase/PloneTestCase.py", line 86, in _clear
    self._resetRAMCache()
  File "/home/stefan/autotest/temp/python26-zope213-cmf22-plone41/eggs/Products.PloneTestCase-0.9.13-py2.6.egg/Products/PloneTestCase/PloneTestCase.py", line 97, in _resetRAMCache
    cache = queryUtility(IRAMCache)
  File "/home/stefan/autotest/temp/python26-zope213-cmf22-plone41/eggs/zope.component-3.9.5-py2.6.egg/zope/component/_api.py", line 172, in queryUtility
    return getSiteManager(context).queryUtility(interface, name, default)
  File "/home/stefan/autotest/temp/python26-zope213-cmf22-plone41/eggs/zope.component-3.9.5-py2.6.egg/zope/component/registry.py", line 163, in queryUtility
    return self.utilities.lookup((), provided, name, default)
  File "/home/stefan/autotest/temp/python26-zope213-cmf22-plone41/eggs/Products.CMFCore-2.2.4-py2.6.egg/Products/CMFCore/Skinnable.py", line 74, in __getattr__
    subob = getattr(ob, name, _MARKER)
  File "/home/stefan/autotest/temp/python26-zope213-cmf22-plone41/eggs/ZODB3-3.10.2-py2.6-linux-x86_64.egg/ZODB/Connection.py", line 856, in setstate
    self._setstate(obj)
  File "/home/stefan/autotest/temp/python26-zope213-cmf22-plone41/eggs/ZODB3-3.10.2-py2.6-linux-x86_64.egg/ZODB/Connection.py", line 897, in _setstate
    p, serial = self._storage.load(obj._p_oid, '')
  File "/home/stefan/autotest/temp/python26-zope213-cmf22-plone41/eggs/ZODB3-3.10.2-py2.6-linux-x86_64.egg/ZODB/DemoStorage.py", line 159, in load
    return self.base.load(oid, version)
  File "/home/stefan/autotest/temp/python26-zope213-cmf22-plone41/eggs/ZODB3-3.10.2-py2.6-linux-x86_64.egg/ZODB/DemoStorage.py", line 159, in load
    return self.base.load(oid, version)
  File "/home/stefan/autotest/temp/python26-zope213-cmf22-plone41/eggs/ZODB3-3.10.2-py2.6-linux-x86_64.egg/ZODB/utils.py", line 253, in __call__
    return func(*args, **kw)
  File "/home/stefan/autotest/temp/python26-zope213-cmf22-plone41/eggs/ZODB3-3.10.2-py2.6-linux-x86_64.egg/ZODB/MappingStorage.py", line 146, in load
    raise ZODB.POSException.POSKeyError(oid)
POSKeyError: 0x2cb2e962d66b1c14



Error in test testFullUpgrade (plone.app.upgrade.v30.tests.TestFunctionalMigrations)
Traceback (most recent call last):
  File "/usr/local/python2.6/lib/python2.6/unittest.py", line 270, in run
    self.setUp()
  File "/home/stefan/autotest/temp/python26-zope213-cmf22-plone41/eggs/Zope2-2.13.7-py2.6.egg/Testing/ZopeTestCase/PortalTestCase.py", line 62, in setUp
    self._clear()
  File "/home/stefan/autotest/temp/python26-zope213-cmf22-plone41/eggs/Products.PloneTestCase-0.9.13-py2.6.egg/Products/PloneTestCase/PloneTestCase.py", line 86, in _clear
    self._resetRAMCache()
  File "/home/stefan/autotest/temp/python26-zope213-cmf22-plone41/eggs/Products.PloneTestCase-0.9.13-py2.6.egg/Products/PloneTestCase/PloneTestCase.py", line 97, in _resetRAMCache
    cache = queryUtility(IRAMCache)
  File "/home/stefan/autotest/temp/python26-zope213-cmf22-plone41/eggs/zope.component-3.9.5-py2.6.egg/zope/component/_api.py", line 172, in queryUtility
    return getSiteManager(context).queryUtility(interface, name, default)
  File "/home/stefan/autotest/temp/python26-zope213-cmf22-plone41/eggs/zope.component-3.9.5-py2.6.egg/zope/component/registry.py", line 163, in queryUtility
    return self.utilities.lookup((), provided, name, default)
  File "/home/stefan/autotest/temp/python26-zope213-cmf22-plone41/eggs/Products.CMFCore-2.2.4-py2.6.egg/Products/CMFCore/Skinnable.py", line 74, in __getattr__
    subob = getattr(ob, name, _MARKER)
  File "/home/stefan/autotest/temp/python26-zope213-cmf22-plone41/eggs/ZODB3-3.10.2-py2.6-linux-x86_64.egg/ZODB/Connection.py", line 856, in setstate
    self._setstate(obj)
  File "/home/stefan/autotest/temp/python26-zope213-cmf22-plone41/eggs/ZODB3-3.10.2-py2.6-linux-x86_64.egg/ZODB/Connection.py", line 897, in _setstate
    p, serial = self._storage.load(obj._p_oid, '')
  File "/home/stefan/autotest/temp/python26-zope213-cmf22-plone41/eggs/ZODB3-3.10.2-py2.6-linux-x86_64.egg/ZODB/DemoStorage.py", line 159, in load
    return self.base.load(oid, version)
  File "/home/stefan/autotest/temp/python26-zope213-cmf22-plone41/eggs/ZODB3-3.10.2-py2.6-linux-x86_64.egg/ZODB/DemoStorage.py", line 159, in load
    return self.base.load(oid, version)
  File "/home/stefan/autotest/temp/python26-zope213-cmf22-plone41/eggs/ZODB3-3.10.2-py2.6-linux-x86_64.egg/ZODB/utils.py", line 253, in __call__
    return func(*args, **kw)
  File "/home/stefan/autotest/temp/python26-zope213-cmf22-plone41/eggs/ZODB3-3.10.2-py2.6-linux-x86_64.egg/ZODB/MappingStorage.py", line 146, in load
    raise ZODB.POSException.POSKeyError(oid)
POSKeyError: 0x2cb2e962d66b1c14



Error in test testBaseUpgrade (plone.app.upgrade.v31.tests.TestFunctionalMigrations)
Traceback (most recent call last):
  File "/usr/local/python2.6/lib/python2.6/unittest.py", line 270, in run
    self.setUp()
  File "/home/stefan/autotest/temp/python26-zope213-cmf22-plone41/eggs/Zope2-2.13.7-py2.6.egg/Testing/ZopeTestCase/PortalTestCase.py", line 62, in setUp
    self._clear()
  File "/home/stefan/autotest/temp/python26-zope213-cmf22-plone41/eggs/Products.PloneTestCase-0.9.13-py2.6.egg/Products/PloneTestCase/PloneTestCase.py", line 86, in _clear
    self._resetRAMCache()
  File "/home/stefan/autotest/temp/python26-zope213-cmf22-plone41/eggs/Products.PloneTestCase-0.9.13-py2.6.egg/Products/PloneTestCase/PloneTestCase.py", line 97, in _resetRAMCache
    cache = queryUtility(IRAMCache)
  File "/home/stefan/autotest/temp/python26-zope213-cmf22-plone41/eggs/zope.component-3.9.5-py2.6.egg/zope/component/_api.py", line 172, in queryUtility
    return getSiteManager(context).queryUtility(interface, name, default)
  File "/home/stefan/autotest/temp/python26-zope213-cmf22-plone41/eggs/zope.component-3.9.5-py2.6.egg/zope/component/registry.py", line 163, in queryUtility
    return self.utilities.lookup((), provided, name, default)
  File "/home/stefan/autotest/temp/python26-zope213-cmf22-plone41/eggs/Products.CMFCore-2.2.4-py2.6.egg/Products/CMFCore/Skinnable.py", line 74, in __getattr__
    subob = getattr(ob, name, _MARKER)
  File "/home/stefan/autotest/temp/python26-zope213-cmf22-plone41/eggs/ZODB3-3.10.2-py2.6-linux-x86_64.egg/ZODB/Connection.py", line 856, in setstate
    self._setstate(obj)
  File "/home/stefan/autotest/temp/python26-zope213-cmf22-plone41/eggs/ZODB3-3.10.2-py2.6-linux-x86_64.egg/ZODB/Connection.py", line 897, in _setstate
    p, serial = self._storage.load(obj._p_oid, '')
  File "/home/stefan/autotest/temp/python26-zope213-cmf22-plone41/eggs/ZODB3-3.10.2-py2.6-linux-x86_64.egg/ZODB/DemoStorage.py", line 159, in load
    return self.base.load(oid, version)
  File "/home/stefan/autotest/temp/python26-zope213-cmf22-plone41/eggs/ZODB3-3.10.2-py2.6-linux-x86_64.egg/ZODB/DemoStorage.py", line 159, in load
    return self.base.load(oid, version)
  File "/home/stefan/autotest/temp/python26-zope213-cmf22-plone41/eggs/ZODB3-3.10.2-py2.6-linux-x86_64.egg/ZODB/utils.py", line 253, in __call__
    return func(*args, **kw)
  File "/home/stefan/autotest/temp/python26-zope213-cmf22-plone41/eggs/ZODB3-3.10.2-py2.6-linux-x86_64.egg/ZODB/MappingStorage.py", line 146, in load
    raise ZODB.POSException.POSKeyError(oid)
POSKeyError: 0x2cb2e962d66b1c14



Error in test testFullUpgrade (plone.app.upgrade.v31.tests.TestFunctionalMigrations)
Traceback (most recent call last):
  File "/usr/local/python2.6/lib/python2.6/unittest.py", line 270, in run
    self.setUp()
  File "/home/stefan/autotest/temp/python26-zope213-cmf22-plone41/eggs/Zope2-2.13.7-py2.6.egg/Testing/ZopeTestCase/PortalTestCase.py", line 62, in setUp
    self._clear()
  File "/home/stefan/autotest/temp/python26-zope213-cmf22-plone41/eggs/Products.PloneTestCase-0.9.13-py2.6.egg/Products/PloneTestCase/PloneTestCase.py", line 86, in _clear
    self._resetRAMCache()
  File "/home/stefan/autotest/temp/python26-zope213-cmf22-plone41/eggs/Products.PloneTestCase-0.9.13-py2.6.egg/Products/PloneTestCase/PloneTestCase.py", line 97, in _resetRAMCache
    cache = queryUtility(IRAMCache)
  File "/home/stefan/autotest/temp/python26-zope213-cmf22-plone41/eggs/zope.component-3.9.5-py2.6.egg/zope/component/_api.py", line 172, in queryUtility
    return getSiteManager(context).queryUtility(interface, name, default)
  File "/home/stefan/autotest/temp/python26-zope213-cmf22-plone41/eggs/zope.component-3.9.5-py2.6.egg/zope/component/registry.py", line 163, in queryUtility
    return self.utilities.lookup((), provided, name, default)
  File "/home/stefan/autotest/temp/python26-zope213-cmf22-plone41/eggs/Products.CMFCore-2.2.4-py2.6.egg/Products/CMFCore/Skinnable.py", line 74, in __getattr__
    subob = getattr(ob, name, _MARKER)
  File "/home/stefan/autotest/temp/python26-zope213-cmf22-plone41/eggs/ZODB3-3.10.2-py2.6-linux-x86_64.egg/ZODB/Connection.py", line 856, in setstate
    self._setstate(obj)
  File "/home/stefan/autotest/temp/python26-zope213-cmf22-plone41/eggs/ZODB3-3.10.2-py2.6-linux-x86_64.egg/ZODB/Connection.py", line 897, in _setstate
    p, serial = self._storage.load(obj._p_oid, '')
  File "/home/stefan/autotest/temp/python26-zope213-cmf22-plone41/eggs/ZODB3-3.10.2-py2.6-linux-x86_64.egg/ZODB/DemoStorage.py", line 159, in load
    return self.base.load(oid, version)
  File "/home/stefan/autotest/temp/python26-zope213-cmf22-plone41/eggs/ZODB3-3.10.2-py2.6-linux-x86_64.egg/ZODB/DemoStorage.py", line 159, in load
    return self.base.load(oid, version)
  File "/home/stefan/autotest/temp/python26-zope213-cmf22-plone41/eggs/ZODB3-3.10.2-py2.6-linux-x86_64.egg/ZODB/utils.py", line 253, in __call__
    return func(*args, **kw)
  File "/home/stefan/autotest/temp/python26-zope213-cmf22-plone41/eggs/ZODB3-3.10.2-py2.6-linux-x86_64.egg/ZODB/MappingStorage.py", line 146, in load
    raise ZODB.POSException.POSKeyError(oid)
POSKeyError: 0x2cb2e962d66b1c14



Error in test testBaseUpgrade (plone.app.upgrade.v32.tests.TestFunctionalMigrations)
Traceback (most recent call last):
  File "/usr/local/python2.6/lib/python2.6/unittest.py", line 270, in run
    self.setUp()
  File "/home/stefan/autotest/temp/python26-zope213-cmf22-plone41/eggs/Zope2-2.13.7-py2.6.egg/Testing/ZopeTestCase/PortalTestCase.py", line 62, in setUp
    self._clear()
  File "/home/stefan/autotest/temp/python26-zope213-cmf22-plone41/eggs/Products.PloneTestCase-0.9.13-py2.6.egg/Products/PloneTestCase/PloneTestCase.py", line 86, in _clear
    self._resetRAMCache()
  File "/home/stefan/autotest/temp/python26-zope213-cmf22-plone41/eggs/Products.PloneTestCase-0.9.13-py2.6.egg/Products/PloneTestCase/PloneTestCase.py", line 97, in _resetRAMCache
    cache = queryUtility(IRAMCache)
  File "/home/stefan/autotest/temp/python26-zope213-cmf22-plone41/eggs/zope.component-3.9.5-py2.6.egg/zope/component/_api.py", line 172, in queryUtility
    return getSiteManager(context).queryUtility(interface, name, default)
  File "/home/stefan/autotest/temp/python26-zope213-cmf22-plone41/eggs/zope.component-3.9.5-py2.6.egg/zope/component/registry.py", line 163, in queryUtility
    return self.utilities.lookup((), provided, name, default)
  File "/home/stefan/autotest/temp/python26-zope213-cmf22-plone41/eggs/Products.CMFCore-2.2.4-py2.6.egg/Products/CMFCore/Skinnable.py", line 74, in __getattr__
    subob = getattr(ob, name, _MARKER)
  File "/home/stefan/autotest/temp/python26-zope213-cmf22-plone41/eggs/ZODB3-3.10.2-py2.6-linux-x86_64.egg/ZODB/Connection.py", line 856, in setstate
    self._setstate(obj)
  File "/home/stefan/autotest/temp/python26-zope213-cmf22-plone41/eggs/ZODB3-3.10.2-py2.6-linux-x86_64.egg/ZODB/Connection.py", line 897, in _setstate
    p, serial = self._storage.load(obj._p_oid, '')
  File "/home/stefan/autotest/temp/python26-zope213-cmf22-plone41/eggs/ZODB3-3.10.2-py2.6-linux-x86_64.egg/ZODB/DemoStorage.py", line 159, in load
    return self.base.load(oid, version)
  File "/home/stefan/autotest/temp/python26-zope213-cmf22-plone41/eggs/ZODB3-3.10.2-py2.6-linux-x86_64.egg/ZODB/DemoStorage.py", line 159, in load
    return self.base.load(oid, version)
  File "/home/stefan/autotest/temp/python26-zope213-cmf22-plone41/eggs/ZODB3-3.10.2-py2.6-linux-x86_64.egg/ZODB/utils.py", line 253, in __call__
    return func(*args, **kw)
  File "/home/stefan/autotest/temp/python26-zope213-cmf22-plone41/eggs/ZODB3-3.10.2-py2.6-linux-x86_64.egg/ZODB/MappingStorage.py", line 146, in load
    raise ZODB.POSException.POSKeyError(oid)
POSKeyError: 0x2cb2e962d66b1c14



Error in test testFullUpgrade (plone.app.upgrade.v32.tests.TestFunctionalMigrations)
Traceback (most recent call last):
  File "/usr/local/python2.6/lib/python2.6/unittest.py", line 270, in run
    self.setUp()
  File "/home/stefan/autotest/temp/python26-zope213-cmf22-plone41/eggs/Zope2-2.13.7-py2.6.egg/Testing/ZopeTestCase/PortalTestCase.py", line 62, in setUp
    self._clear()
  File "/home/stefan/autotest/temp/python26-zope213-cmf22-plone41/eggs/Products.PloneTestCase-0.9.13-py2.6.egg/Products/PloneTestCase/PloneTestCase.py", line 86, in _clear
    self._resetRAMCache()
  File "/home/stefan/autotest/temp/python26-zope213-cmf22-plone41/eggs/Products.PloneTestCase-0.9.13-py2.6.egg/Products/PloneTestCase/PloneTestCase.py", line 97, in _resetRAMCache
    cache = queryUtility(IRAMCache)
  File "/home/stefan/autotest/temp/python26-zope213-cmf22-plone41/eggs/zope.component-3.9.5-py2.6.egg/zope/component/_api.py", line 172, in queryUtility
    return getSiteManager(context).queryUtility(interface, name, default)
  File "/home/stefan/autotest/temp/python26-zope213-cmf22-plone41/eggs/zope.component-3.9.5-py2.6.egg/zope/component/registry.py", line 163, in queryUtility
    return self.utilities.lookup((), provided, name, default)
  File "/home/stefan/autotest/temp/python26-zope213-cmf22-plone41/eggs/Products.CMFCore-2.2.4-py2.6.egg/Products/CMFCore/Skinnable.py", line 74, in __getattr__
    subob = getattr(ob, name, _MARKER)
  File "/home/stefan/autotest/temp/python26-zope213-cmf22-plone41/eggs/ZODB3-3.10.2-py2.6-linux-x86_64.egg/ZODB/Connection.py", line 856, in setstate
    self._setstate(obj)
  File "/home/stefan/autotest/temp/python26-zope213-cmf22-plone41/eggs/ZODB3-3.10.2-py2.6-linux-x86_64.egg/ZODB/Connection.py", line 897, in _setstate
    p, serial = self._storage.load(obj._p_oid, '')
  File "/home/stefan/autotest/temp/python26-zope213-cmf22-plone41/eggs/ZODB3-3.10.2-py2.6-linux-x86_64.egg/ZODB/DemoStorage.py", line 159, in load
    return self.base.load(oid, version)
  File "/home/stefan/autotest/temp/python26-zope213-cmf22-plone41/eggs/ZODB3-3.10.2-py2.6-linux-x86_64.egg/ZODB/DemoStorage.py", line 159, in load
    return self.base.load(oid, version)
  File "/home/stefan/autotest/temp/python26-zope213-cmf22-plone41/eggs/ZODB3-3.10.2-py2.6-linux-x86_64.egg/ZODB/utils.py", line 253, in __call__
    return func(*args, **kw)
  File "/home/stefan/autotest/temp/python26-zope213-cmf22-plone41/eggs/ZODB3-3.10.2-py2.6-linux-x86_64.egg/ZODB/MappingStorage.py", line 146, in load
    raise ZODB.POSException.POSKeyError(oid)
POSKeyError: 0x2cb2e962d66b1c14



Error in test testBaseUpgrade (plone.app.upgrade.v33.tests.TestFunctionalMigrations)
Traceback (most recent call last):
  File "/usr/local/python2.6/lib/python2.6/unittest.py", line 270, in run
    self.setUp()
  File "/home/stefan/autotest/temp/python26-zope213-cmf22-plone41/eggs/Zope2-2.13.7-py2.6.egg/Testing/ZopeTestCase/PortalTestCase.py", line 62, in setUp
    self._clear()
  File "/home/stefan/autotest/temp/python26-zope213-cmf22-plone41/eggs/Products.PloneTestCase-0.9.13-py2.6.egg/Products/PloneTestCase/PloneTestCase.py", line 86, in _clear
    self._resetRAMCache()
  File "/home/stefan/autotest/temp/python26-zope213-cmf22-plone41/eggs/Products.PloneTestCase-0.9.13-py2.6.egg/Products/PloneTestCase/PloneTestCase.py", line 97, in _resetRAMCache
    cache = queryUtility(IRAMCache)
  File "/home/stefan/autotest/temp/python26-zope213-cmf22-plone41/eggs/zope.component-3.9.5-py2.6.egg/zope/component/_api.py", line 172, in queryUtility
    return getSiteManager(context).queryUtility(interface, name, default)
  File "/home/stefan/autotest/temp/python26-zope213-cmf22-plone41/eggs/zope.component-3.9.5-py2.6.egg/zope/component/registry.py", line 163, in queryUtility
    return self.utilities.lookup((), provided, name, default)
  File "/home/stefan/autotest/temp/python26-zope213-cmf22-plone41/eggs/Products.CMFCore-2.2.4-py2.6.egg/Products/CMFCore/Skinnable.py", line 74, in __getattr__
    subob = getattr(ob, name, _MARKER)
  File "/home/stefan/autotest/temp/python26-zope213-cmf22-plone41/eggs/ZODB3-3.10.2-py2.6-linux-x86_64.egg/ZODB/Connection.py", line 856, in setstate
    self._setstate(obj)
  File "/home/stefan/autotest/temp/python26-zope213-cmf22-plone41/eggs/ZODB3-3.10.2-py2.6-linux-x86_64.egg/ZODB/Connection.py", line 897, in _setstate
    p, serial = self._storage.load(obj._p_oid, '')
  File "/home/stefan/autotest/temp/python26-zope213-cmf22-plone41/eggs/ZODB3-3.10.2-py2.6-linux-x86_64.egg/ZODB/DemoStorage.py", line 159, in load
    return self.base.load(oid, version)
  File "/home/stefan/autotest/temp/python26-zope213-cmf22-plone41/eggs/ZODB3-3.10.2-py2.6-linux-x86_64.egg/ZODB/DemoStorage.py", line 159, in load
    return self.base.load(oid, version)
  File "/home/stefan/autotest/temp/python26-zope213-cmf22-plone41/eggs/ZODB3-3.10.2-py2.6-linux-x86_64.egg/ZODB/utils.py", line 253, in __call__
    return func(*args, **kw)
  File "/home/stefan/autotest/temp/python26-zope213-cmf22-plone41/eggs/ZODB3-3.10.2-py2.6-linux-x86_64.egg/ZODB/MappingStorage.py", line 146, in load
    raise ZODB.POSException.POSKeyError(oid)
POSKeyError: 0x2cb2e962d66b1c14



Error in test testFolderUpgrade (plone.app.upgrade.v33.tests.TestFunctionalMigrations)
Traceback (most recent call last):
  File "/usr/local/python2.6/lib/python2.6/unittest.py", line 270, in run
    self.setUp()
  File "/home/stefan/autotest/temp/python26-zope213-cmf22-plone41/eggs/Zope2-2.13.7-py2.6.egg/Testing/ZopeTestCase/PortalTestCase.py", line 62, in setUp
    self._clear()
  File "/home/stefan/autotest/temp/python26-zope213-cmf22-plone41/eggs/Products.PloneTestCase-0.9.13-py2.6.egg/Products/PloneTestCase/PloneTestCase.py", line 86, in _clear
    self._resetRAMCache()
  File "/home/stefan/autotest/temp/python26-zope213-cmf22-plone41/eggs/Products.PloneTestCase-0.9.13-py2.6.egg/Products/PloneTestCase/PloneTestCase.py", line 97, in _resetRAMCache
    cache = queryUtility(IRAMCache)
  File "/home/stefan/autotest/temp/python26-zope213-cmf22-plone41/eggs/zope.component-3.9.5-py2.6.egg/zope/component/_api.py", line 172, in queryUtility
    return getSiteManager(context).queryUtility(interface, name, default)
  File "/home/stefan/autotest/temp/python26-zope213-cmf22-plone41/eggs/zope.component-3.9.5-py2.6.egg/zope/component/registry.py", line 163, in queryUtility
    return self.utilities.lookup((), provided, name, default)
  File "/home/stefan/autotest/temp/python26-zope213-cmf22-plone41/eggs/Products.CMFCore-2.2.4-py2.6.egg/Products/CMFCore/Skinnable.py", line 74, in __getattr__
    subob = getattr(ob, name, _MARKER)
  File "/home/stefan/autotest/temp/python26-zope213-cmf22-plone41/eggs/ZODB3-3.10.2-py2.6-linux-x86_64.egg/ZODB/Connection.py", line 856, in setstate
    self._setstate(obj)
  File "/home/stefan/autotest/temp/python26-zope213-cmf22-plone41/eggs/ZODB3-3.10.2-py2.6-linux-x86_64.egg/ZODB/Connection.py", line 897, in _setstate
    p, serial = self._storage.load(obj._p_oid, '')
  File "/home/stefan/autotest/temp/python26-zope213-cmf22-plone41/eggs/ZODB3-3.10.2-py2.6-linux-x86_64.egg/ZODB/DemoStorage.py", line 159, in load
    return self.base.load(oid, version)
  File "/home/stefan/autotest/temp/python26-zope213-cmf22-plone41/eggs/ZODB3-3.10.2-py2.6-linux-x86_64.egg/ZODB/DemoStorage.py", line 159, in load
    return self.base.load(oid, version)
  File "/home/stefan/autotest/temp/python26-zope213-cmf22-plone41/eggs/ZODB3-3.10.2-py2.6-linux-x86_64.egg/ZODB/utils.py", line 253, in __call__
    return func(*args, **kw)
  File "/home/stefan/autotest/temp/python26-zope213-cmf22-plone41/eggs/ZODB3-3.10.2-py2.6-linux-x86_64.egg/ZODB/MappingStorage.py", line 146, in load
    raise ZODB.POSException.POSKeyError(oid)
POSKeyError: 0x2cb2e962d66b1c14



Error in test testFullUpgrade (plone.app.upgrade.v33.tests.TestFunctionalMigrations)
Traceback (most recent call last):
  File "/usr/local/python2.6/lib/python2.6/unittest.py", line 270, in run
    self.setUp()
  File "/home/stefan/autotest/temp/python26-zope213-cmf22-plone41/eggs/Zope2-2.13.7-py2.6.egg/Testing/ZopeTestCase/PortalTestCase.py", line 62, in setUp
    self._clear()
  File "/home/stefan/autotest/temp/python26-zope213-cmf22-plone41/eggs/Products.PloneTestCase-0.9.13-py2.6.egg/Products/PloneTestCase/PloneTestCase.py", line 86, in _clear
    self._resetRAMCache()
  File "/home/stefan/autotest/temp/python26-zope213-cmf22-plone41/eggs/Products.PloneTestCase-0.9.13-py2.6.egg/Products/PloneTestCase/PloneTestCase.py", line 97, in _resetRAMCache
    cache = queryUtility(IRAMCache)
  File "/home/stefan/autotest/temp/python26-zope213-cmf22-plone41/eggs/zope.component-3.9.5-py2.6.egg/zope/component/_api.py", line 172, in queryUtility
    return getSiteManager(context).queryUtility(interface, name, default)
  File "/home/stefan/autotest/temp/python26-zope213-cmf22-plone41/eggs/zope.component-3.9.5-py2.6.egg/zope/component/registry.py", line 163, in queryUtility
    return self.utilities.lookup((), provided, name, default)
  File "/home/stefan/autotest/temp/python26-zope213-cmf22-plone41/eggs/Products.CMFCore-2.2.4-py2.6.egg/Products/CMFCore/Skinnable.py", line 74, in __getattr__
    subob = getattr(ob, name, _MARKER)
  File "/home/stefan/autotest/temp/python26-zope213-cmf22-plone41/eggs/ZODB3-3.10.2-py2.6-linux-x86_64.egg/ZODB/Connection.py", line 856, in setstate
    self._setstate(obj)
  File "/home/stefan/autotest/temp/python26-zope213-cmf22-plone41/eggs/ZODB3-3.10.2-py2.6-linux-x86_64.egg/ZODB/Connection.py", line 897, in _setstate
    p, serial = self._storage.load(obj._p_oid, '')
  File "/home/stefan/autotest/temp/python26-zope213-cmf22-plone41/eggs/ZODB3-3.10.2-py2.6-linux-x86_64.egg/ZODB/DemoStorage.py", line 159, in load
    return self.base.load(oid, version)
  File "/home/stefan/autotest/temp/python26-zope213-cmf22-plone41/eggs/ZODB3-3.10.2-py2.6-linux-x86_64.egg/ZODB/DemoStorage.py", line 159, in load
    return self.base.load(oid, version)
  File "/home/stefan/autotest/temp/python26-zope213-cmf22-plone41/eggs/ZODB3-3.10.2-py2.6-linux-x86_64.egg/ZODB/utils.py", line 253, in __call__
    return func(*args, **kw)
  File "/home/stefan/autotest/temp/python26-zope213-cmf22-plone41/eggs/ZODB3-3.10.2-py2.6-linux-x86_64.egg/ZODB/MappingStorage.py", line 146, in load
    raise ZODB.POSException.POSKeyError(oid)
POSKeyError: 0x2cb2e962d66b1c14



Error in test testFullUpgrade (plone.app.upgrade.v41.tests.TestFunctionalMigrations)
Traceback (most recent call last):
  File "/usr/local/python2.6/lib/python2.6/unittest.py", line 270, in run
    self.setUp()
  File "/home/stefan/autotest/temp/python26-zope213-cmf22-plone41/eggs/Zope2-2.13.7-py2.6.egg/Testing/ZopeTestCase/PortalTestCase.py", line 62, in setUp
    self._clear()
  File "/home/stefan/autotest/temp/python26-zope213-cmf22-plone41/eggs/Products.PloneTestCase-0.9.13-py2.6.egg/Products/PloneTestCase/PloneTestCase.py", line 86, in _clear
    self._resetRAMCache()
  File "/home/stefan/autotest/temp/python26-zope213-cmf22-plone41/eggs/Products.PloneTestCase-0.9.13-py2.6.egg/Products/PloneTestCase/PloneTestCase.py", line 97, in _resetRAMCache
    cache = queryUtility(IRAMCache)
  File "/home/stefan/autotest/temp/python26-zope213-cmf22-plone41/eggs/zope.component-3.9.5-py2.6.egg/zope/component/_api.py", line 172, in queryUtility
    return getSiteManager(context).queryUtility(interface, name, default)
  File "/home/stefan/autotest/temp/python26-zope213-cmf22-plone41/eggs/zope.component-3.9.5-py2.6.egg/zope/component/registry.py", line 163, in queryUtility
    return self.utilities.lookup((), provided, name, default)
  File "/home/stefan/autotest/temp/python26-zope213-cmf22-plone41/eggs/Products.CMFCore-2.2.4-py2.6.egg/Products/CMFCore/Skinnable.py", line 74, in __getattr__
    subob = getattr(ob, name, _MARKER)
  File "/home/stefan/autotest/temp/python26-zope213-cmf22-plone41/eggs/ZODB3-3.10.2-py2.6-linux-x86_64.egg/ZODB/Connection.py", line 856, in setstate
    self._setstate(obj)
  File "/home/stefan/autotest/temp/python26-zope213-cmf22-plone41/eggs/ZODB3-3.10.2-py2.6-linux-x86_64.egg/ZODB/Connection.py", line 897, in _setstate
    p, serial = self._storage.load(obj._p_oid, '')
  File "/home/stefan/autotest/temp/python26-zope213-cmf22-plone41/eggs/ZODB3-3.10.2-py2.6-linux-x86_64.egg/ZODB/DemoStorage.py", line 159, in load
    return self.base.load(oid, version)
  File "/home/stefan/autotest/temp/python26-zope213-cmf22-plone41/eggs/ZODB3-3.10.2-py2.6-linux-x86_64.egg/ZODB/DemoStorage.py", line 159, in load
    return self.base.load(oid, version)
  File "/home/stefan/autotest/temp/python26-zope213-cmf22-plone41/eggs/ZODB3-3.10.2-py2.6-linux-x86_64.egg/ZODB/utils.py", line 253, in __call__
    return func(*args, **kw)
  File "/home/stefan/autotest/temp/python26-zope213-cmf22-plone41/eggs/ZODB3-3.10.2-py2.6-linux-x86_64.egg/ZODB/MappingStorage.py", line 146, in load
    raise ZODB.POSException.POSKeyError(oid)
POSKeyError: 0x2cb2e962d66b1c14

  Ran 12 tests with 0 failures and 12 errors in 15.426 seconds.
Running plone.app.viewletmanager.tests.test_exportimport.Layer tests:
  Tear down plone.app.upgrade.tests.base.FunctionalUpgradeLayer in 0.000 seconds.
  Tear down Products.PloneTestCase.layer.PloneSite
Traceback (most recent call last):
  File "/home/stefan/autotest/temp/python26-zope213-cmf22-plone41/bin/test", line 375, in <module>
    '--test-path', '/home/stefan/autotest/temp/python26-zope213-cmf22-plone41/eggs/wicked-1.1.9-py2.6.egg',
  File "/home/stefan/autotest/temp/python26-zope213-cmf22-plone41/eggs/zope.testing-3.9.6-py2.6.egg/zope/testing/testrunner/__init__.py", line 35, in run
    failed = run_internal(defaults, args, script_parts=script_parts)
  File "/home/stefan/autotest/temp/python26-zope213-cmf22-plone41/eggs/zope.testing-3.9.6-py2.6.egg/zope/testing/testrunner/__init__.py", line 48, in run_internal
    runner.run()
  File "/home/stefan/autotest/temp/python26-zope213-cmf22-plone41/eggs/zope.testing-3.9.6-py2.6.egg/zope/testing/testrunner/runner.py", line 138, in run
    self.run_tests()
  File "/home/stefan/autotest/temp/python26-zope213-cmf22-plone41/eggs/zope.testing-3.9.6-py2.6.egg/zope/testing/testrunner/runner.py", line 219, in run_tests
    setup_layers, self.failures, self.errors)
  File "/home/stefan/autotest/temp/python26-zope213-cmf22-plone41/eggs/zope.testing-3.9.6-py2.6.egg/zope/testing/testrunner/runner.py", line 360, in run_layer
    tear_down_unneeded(options, needed, setup_layers)
  File "/home/stefan/autotest/temp/python26-zope213-cmf22-plone41/eggs/zope.testing-3.9.6-py2.6.egg/zope/testing/testrunner/runner.py", line 605, in tear_down_unneeded
    l.tearDown()
  File "/home/stefan/autotest/temp/python26-zope213-cmf22-plone41/eggs/Products.PloneTestCase-0.9.13-py2.6.egg/Products/PloneTestCase/layer.py", line 39, in tearDown
    func(*args, **kw)
  File "/home/stefan/autotest/temp/python26-zope213-cmf22-plone41/eggs/Products.PloneTestCase-0.9.13-py2.6.egg/Products/PloneTestCase/setup.py", line 178, in cleanupPloneSite
    SiteCleanup(id).run()
  File "/home/stefan/autotest/temp/python26-zope213-cmf22-plone41/eggs/Products.PloneTestCase-0.9.13-py2.6.egg/Products/PloneTestCase/setup.py", line 388, in run
    self.app = self._app()
  File "/home/stefan/autotest/temp/python26-zope213-cmf22-plone41/eggs/Products.PloneTestCase-0.9.13-py2.6.egg/Products/PloneTestCase/setup.py", line 352, in _app
    return ZopeTestCase.app()
  File "/home/stefan/autotest/temp/python26-zope213-cmf22-plone41/eggs/Zope2-2.13.7-py2.6.egg/Testing/ZopeTestCase/base.py", line 31, in app
    app = utils.makerequest(app)
  File "/home/stefan/autotest/temp/python26-zope213-cmf22-plone41/eggs/Zope2-2.13.7-py2.6.egg/Testing/ZopeTestCase/utils.py", line 118, in makerequest
    return _makerequest(app, stdout=stdout, environ=environ)
  File "/home/stefan/autotest/temp/python26-zope213-cmf22-plone41/eggs/Zope2-2.13.7-py2.6.egg/Testing/makerequest.py", line 63, in makerequest
    setDefaultSkin(req)
  File "/home/stefan/autotest/temp/python26-zope213-cmf22-plone41/eggs/zope.publisher-3.12.6-py2.6.egg/zope/publisher/skinnable.py", line 46, in setDefaultSkin
    adapters = zope.component.getSiteManager().adapters
  File "/home/stefan/autotest/temp/python26-zope213-cmf22-plone41/eggs/Products.CMFCore-2.2.4-py2.6.egg/Products/CMFCore/Skinnable.py", line 74, in __getattr__
    subob = getattr(ob, name, _MARKER)
  File "/home/stefan/autotest/temp/python26-zope213-cmf22-plone41/eggs/ZODB3-3.10.2-py2.6-linux-x86_64.egg/ZODB/Connection.py", line 856, in setstate
    self._setstate(obj)
  File "/home/stefan/autotest/temp/python26-zope213-cmf22-plone41/eggs/ZODB3-3.10.2-py2.6-linux-x86_64.egg/ZODB/Connection.py", line 897, in _setstate
    p, serial = self._storage.load(obj._p_oid, '')
  File "/home/stefan/autotest/temp/python26-zope213-cmf22-plone41/eggs/ZODB3-3.10.2-py2.6-linux-x86_64.egg/ZODB/DemoStorage.py", line 159, in load
    return self.base.load(oid, version)
  File "/home/stefan/autotest/temp/python26-zope213-cmf22-plone41/eggs/ZODB3-3.10.2-py2.6-linux-x86_64.egg/ZODB/DemoStorage.py", line 159, in load
    return self.base.load(oid, version)
  File "/home/stefan/autotest/temp/python26-zope213-cmf22-plone41/eggs/ZODB3-3.10.2-py2.6-linux-x86_64.egg/ZODB/utils.py", line 253, in __call__
    return func(*args, **kw)
  File "/home/stefan/autotest/temp/python26-zope213-cmf22-plone41/eggs/ZODB3-3.10.2-py2.6-linux-x86_64.egg/ZODB/MappingStorage.py", line 146, in load
    raise ZODB.POSException.POSKeyError(oid)
ZODB.POSException.POSKeyError: 0x2cb2e962d66b1c14
/home/stefan/autotest/temp/python26-zope213-cmf22-plone41/bin/test:262: DeprecationWarning: zope.testing.testrunner is deprecated in favour of zope.testrunner.
  import zope.testing.testrunner
/home/stefan/autotest/temp/python26-zope213-cmf22-plone41/eggs/zope.testing-3.9.6-py2.6.egg/zope/testing/testrunner/formatter.py:28: DeprecationWarning: zope.testing.exceptions is deprecated in favour of zope.testrunner.exceptions
  from zope.testing.exceptions import DocTestFailureException
Running Testing.ZopeTestCase.layer.ZopeLite tests:
  Set up Testing.ZopeTestCase.layer.ZopeLite in 1.451 seconds.
  Ran 151 tests with 0 failures and 0 errors in 0.790 seconds.
Running Products.PlonePAS.tests.layer.PlonePASLayer tests:
  Set up Products.PloneTestCase.layer.ZCML in 3.219 seconds.
  Set up Products.PloneTestCase.layer.PloneSite in 4.358 seconds.
  Set up Products.PlonePAS.tests.layer.PlonePASLayer in 0.000 seconds.
  Ran 149 tests with 0 failures and 0 errors in 1.946 seconds.
Running zope.testing.testrunner.layer.UnitTests tests:
  Tear down Products.PlonePAS.tests.layer.PlonePASLayer in 0.000 seconds.
  Tear down Products.PloneTestCase.layer.PloneSite in 0.172 seconds.
  Tear down Products.PloneTestCase.layer.ZCML in 0.004 seconds.
  Tear down Testing.ZopeTestCase.layer.ZopeLite in 0.000 seconds.
  Set up zope.testing.testrunner.layer.UnitTests in 0.000 seconds.
  Ran 348 tests with 0 failures and 0 errors in 0.097 seconds.
Tearing down left over layers:
  Tear down zope.testing.testrunner.layer.UnitTests in 0.000 seconds.
Total: 648 tests, 0 failures, 0 errors in 12.658 seconds.
/home/stefan/autotest/temp/python26-zope213-cmf22-plone41/bin/test:262: DeprecationWarning: zope.testing.testrunner is deprecated in favour of zope.testrunner.
  import zope.testing.testrunner
/home/stefan/autotest/temp/python26-zope213-cmf22-plone41/eggs/zope.testing-3.9.6-py2.6.egg/zope/testing/testrunner/formatter.py:28: DeprecationWarning: zope.testing.exceptions is deprecated in favour of zope.testrunner.exceptions
  from zope.testing.exceptions import DocTestFailureException
/home/stefan/autotest/temp/python26-zope213-cmf22-plone41/eggs/plone.fieldsets-2.0.1-py2.6.egg/plone/fieldsets/tests.py:6: DeprecationWarning: zope.testing.doctest is deprecated in favour of the Python standard library doctest module
  from zope.testing import doctest
/home/stefan/autotest/temp/python26-zope213-cmf22-plone41/eggs/plone.indexer-1.0-py2.6.egg/plone/indexer/tests.py:3: DeprecationWarning: zope.testing.doctestunit is deprecated in favour of the Python standard library doctest module
  from zope.testing import doctestunit
Running Products.PloneTestCase.layer.PloneSite tests:
  Set up Testing.ZopeTestCase.layer.ZopeLite in 1.385 seconds.
  Set up Products.PloneTestCase.layer.ZCML in 3.494 seconds.
  Set up Products.PloneTestCase.layer.PloneSite/home/stefan/autotest/temp/python26-zope213-cmf22-plone41/eggs/borg.localrole-3.0.2-py2.6.egg/borg/localrole/tests.py:52: DeprecationWarning: load_config is deprecated. Please import from Zope2.App.zcml
  zcml.load_config('configure.zcml', borg.localrole)
 in 4.595 seconds.
  Ran 5 tests with 0 failures and 0 errors in 0.140 seconds.
Running plone.browserlayer.tests.test_doctest.PloneBrowserLayerLayer tests:
  Set up plone.browserlayer.tests.test_doctest.PloneBrowserLayerLayer in 0.005 seconds.
/home/stefan/autotest/temp/python26-zope213-cmf22-plone41/eggs/plone.browserlayer-2.1-py2.6.egg/plone/browserlayer/README.txt:1: DeprecationWarning: Browser is deprecated. Please import from Testing.testbrowser
  plone.browserlayer tests
  Ran 1 tests with 0 failures and 0 errors in 0.723 seconds.
Running plone.theme.tests.test_doctest.PloneThemeLayer tests:
  Tear down plone.browserlayer.tests.test_doctest.PloneBrowserLayerLayer in 0.000 seconds.
  Set up plone.theme.tests.test_doctest.PloneThemeLayer in 0.004 seconds.
  Ran 1 tests with 0 failures and 0 errors in 0.042 seconds.
Running zope.testing.testrunner.layer.UnitTests tests:
  Tear down plone.theme.tests.test_doctest.PloneThemeLayer in 0.000 seconds.
  Tear down Products.PloneTestCase.layer.PloneSite in 0.171 seconds.
  Tear down Products.PloneTestCase.layer.ZCML in 0.004 seconds.
  Tear down Testing.ZopeTestCase.layer.ZopeLite in 0.000 seconds.
  Set up zope.testing.testrunner.layer.UnitTests in 0.000 seconds.
  Ran 178 tests with 0 failures and 0 errors in 0.486 seconds.
Tearing down left over layers:
  Tear down zope.testing.testrunner.layer.UnitTests in 0.000 seconds.
Total: 185 tests, 0 failures, 0 errors in 12.036 seconds.
/home/stefan/autotest/temp/python26-zope213-cmf22-plone41/bin/test:262: DeprecationWarning: zope.testing.testrunner is deprecated in favour of zope.testrunner.
  import zope.testing.testrunner
/home/stefan/autotest/temp/python26-zope213-cmf22-plone41/eggs/zope.testing-3.9.6-py2.6.egg/zope/testing/testrunner/formatter.py:28: DeprecationWarning: zope.testing.exceptions is deprecated in favour of zope.testrunner.exceptions
  from zope.testing.exceptions import DocTestFailureException
Running Products.PloneTestCase.layer.PloneSite tests:
  Set up Testing.ZopeTestCase.layer.ZopeLite in 0.728 seconds.
  Set up Products.PloneTestCase.layer.ZCML in 3.243 seconds.
  Set up Products.PloneTestCase.layer.PloneSite/home/stefan/autotest/temp/python26-zope213-cmf22-plone41/eggs/plone.portlet.collection-2.0.1-py2.6.egg/plone/portlet/collection/tests/base.py:21: DeprecationWarning: load_config is deprecated. Please import from Zope2.App.zcml
  zcml.load_config('configure.zcml', plone.portlet.collection)
 in 4.441 seconds.
  Ran 173 tests with 0 failures and 0 errors in 16.092 seconds.
Running plone.app.portlets.tests.layer.PlonePortlets tests:
  Set up plone.app.portlets.tests.layer.PlonePortlets in 0.000 seconds.
  Ran 1 tests with 0 failures and 0 errors in 1.296 seconds.
Running plone.app.portlets.tests.test_configuration.TestPortletZCMLLayer tests:
  Tear down plone.app.portlets.tests.layer.PlonePortlets in 0.000 seconds.
  Set up plone.app.portlets.tests.test_configuration.TestPortletZCMLLayer in 0.009 seconds.
  Ran 18 tests with 0 failures and 0 errors in 11.368 seconds.
Running zope.testing.testrunner.layer.UnitTests tests:
  Tear down plone.app.portlets.tests.test_configuration.TestPortletZCMLLayer in 0.000 seconds.
  Tear down Products.PloneTestCase.layer.PloneSite in 0.181 seconds.
  Tear down Products.PloneTestCase.layer.ZCML in 0.005 seconds.
  Tear down Testing.ZopeTestCase.layer.ZopeLite in 0.000 seconds.
  Set up zope.testing.testrunner.layer.UnitTests in 0.000 seconds.
  Ran 5 tests with 0 failures and 0 errors in 0.153 seconds.
Tearing down left over layers:
  Tear down zope.testing.testrunner.layer.UnitTests in 0.000 seconds.
Total: 197 tests, 0 failures, 0 errors in 38.518 seconds.
/home/stefan/autotest/temp/python26-zope213-cmf22-plone41/bin/test:262: DeprecationWarning: zope.testing.testrunner is deprecated in favour of zope.testrunner.
  import zope.testing.testrunner
/home/stefan/autotest/temp/python26-zope213-cmf22-plone41/eggs/zope.testing-3.9.6-py2.6.egg/zope/testing/testrunner/formatter.py:28: DeprecationWarning: zope.testing.exceptions is deprecated in favour of zope.testrunner.exceptions
  from zope.testing.exceptions import DocTestFailureException
Running zope.testing.testrunner.layer.UnitTests tests:
  Set up zope.testing.testrunner.layer.UnitTests in 0.000 seconds.
  Ran 3 tests with 0 failures and 0 errors in 13.091 seconds.
Tearing down left over layers:
  Tear down zope.testing.testrunner.layer.UnitTests in 0.000 seconds.
/home/stefan/autotest/temp/python26-zope213-cmf22-plone41/bin/test:262: DeprecationWarning: zope.testing.testrunner is deprecated in favour of zope.testrunner.
  import zope.testing.testrunner
/home/stefan/autotest/temp/python26-zope213-cmf22-plone41/eggs/zope.testing-3.9.6-py2.6.egg/zope/testing/testrunner/formatter.py:28: DeprecationWarning: zope.testing.exceptions is deprecated in favour of zope.testrunner.exceptions
  from zope.testing.exceptions import DocTestFailureException
Running zope.testing.testrunner.layer.UnitTests tests:
  Set up zope.testing.testrunner.layer.UnitTests in 0.000 seconds.
  Ran 214 tests with 0 failures and 0 errors in 0.558 seconds.
Tearing down left over layers:
  Tear down zope.testing.testrunner.layer.UnitTests in 0.000 seconds.
/home/stefan/autotest/temp/python26-zope213-cmf22-plone41/bin/test:262: DeprecationWarning: zope.testing.testrunner is deprecated in favour of zope.testrunner.
  import zope.testing.testrunner
/home/stefan/autotest/temp/python26-zope213-cmf22-plone41/eggs/zope.testing-3.9.6-py2.6.egg/zope/testing/testrunner/formatter.py:28: DeprecationWarning: zope.testing.exceptions is deprecated in favour of zope.testrunner.exceptions
  from zope.testing.exceptions import DocTestFailureException
Running Products.CMFTestCase.layer.CMFSite tests:
  Set up Testing.ZopeTestCase.layer.ZopeLite in 0.224 seconds.
  Set up Products.CMFTestCase.layer.ZCML in 0.446 seconds.
  Set up Products.CMFTestCase.layer.CMFSite/home/stefan/autotest/temp/python26-zope213-cmf22-plone41/src/Products.GenericSetup/Products/GenericSetup/utils.py:122: DeprecationWarning: UserFolder is deprecated. User folders are no longer part of AccessControl, please depend on Zope2 and import from OFS.userfolder or use the new minimal user folder classes from AccessControl.userfolder.
  obj = getattr( obj, part )
 in 0.219 seconds.
  Ran 58 tests with 0 failures and 0 errors in 0.238 seconds.
Tearing down left over layers:
  Tear down Products.CMFTestCase.layer.CMFSite in 0.018 seconds.
  Tear down Products.CMFTestCase.layer.ZCML in 0.001 seconds.
  Tear down Testing.ZopeTestCase.layer.ZopeLite in 0.000 seconds.
/home/stefan/autotest/temp/python26-zope213-cmf22-plone41/bin/test:262: DeprecationWarning: zope.testing.testrunner is deprecated in favour of zope.testrunner.
  import zope.testing.testrunner
/home/stefan/autotest/temp/python26-zope213-cmf22-plone41/eggs/zope.testing-3.9.6-py2.6.egg/zope/testing/testrunner/formatter.py:28: DeprecationWarning: zope.testing.exceptions is deprecated in favour of zope.testrunner.exceptions
  from zope.testing.exceptions import DocTestFailureException
Running zope.testing.testrunner.layer.UnitTests tests:
  Set up zope.testing.testrunner.layer.UnitTests in 0.000 seconds.
  Ran 25 tests with 0 failures and 0 errors in 0.190 seconds.
Tearing down left over layers:
  Tear down zope.testing.testrunner.layer.UnitTests in 0.000 seconds.
/home/stefan/autotest/temp/python26-zope213-cmf22-plone41/bin/test:262: DeprecationWarning: zope.testing.testrunner is deprecated in favour of zope.testrunner.
  import zope.testing.testrunner
/home/stefan/autotest/temp/python26-zope213-cmf22-plone41/eggs/zope.testing-3.9.6-py2.6.egg/zope/testing/testrunner/formatter.py:28: DeprecationWarning: zope.testing.exceptions is deprecated in favour of zope.testrunner.exceptions
  from zope.testing.exceptions import DocTestFailureException
Running Products.PloneTestCase.layer.PloneSite tests:
  Set up Testing.ZopeTestCase.layer.ZopeLite in 1.353 seconds.
  Set up Products.PloneTestCase.layer.ZCML in 3.371 seconds.
  Set up Products.PloneTestCase.layer.PloneSite in 4.354 seconds.
/home/stefan/autotest/temp/python26-zope213-cmf22-plone41/eggs/Products.PasswordResetTool-2.0.5-py2.6.egg/Products/PasswordResetTool/tests/browser.txt:1: DeprecationWarning: Browser is deprecated. Please import from Testing.testbrowser
  Functional tests for PasswordResetTool
  Ran 2 tests with 0 failures and 0 errors in 3.997 seconds.
Tearing down left over layers:
  Tear down Products.PloneTestCase.layer.PloneSite in 0.173 seconds.
  Tear down Products.PloneTestCase.layer.ZCML in 0.006 seconds.
  Tear down Testing.ZopeTestCase.layer.ZopeLite in 0.000 seconds.
/home/stefan/autotest/temp/python26-zope213-cmf22-plone41/bin/test:262: DeprecationWarning: zope.testing.testrunner is deprecated in favour of zope.testrunner.
  import zope.testing.testrunner
/home/stefan/autotest/temp/python26-zope213-cmf22-plone41/eggs/zope.testing-3.9.6-py2.6.egg/zope/testing/testrunner/formatter.py:28: DeprecationWarning: zope.testing.exceptions is deprecated in favour of zope.testrunner.exceptions
  from zope.testing.exceptions import DocTestFailureException
Running Products.PloneTestCase.layer.PloneSite tests:
  Set up Testing.ZopeTestCase.layer.ZopeLite in 1.445 seconds.
  Set up Products.PloneTestCase.layer.ZCML in 3.349 seconds.
  Set up Products.PloneTestCase.layer.PloneSite in 4.509 seconds.
  Ran 248 tests with 0 failures and 0 errors in 15.427 seconds.
Running zope.testing.testrunner.layer.UnitTests tests:
  Tear down Products.PloneTestCase.layer.PloneSite in 0.185 seconds.
  Tear down Products.PloneTestCase.layer.ZCML in 0.005 seconds.
  Tear down Testing.ZopeTestCase.layer.ZopeLite in 0.000 seconds.
  Set up zope.testing.testrunner.layer.UnitTests in 0.000 seconds.
  Ran 62 tests with 0 failures and 0 errors in 0.013 seconds.
Tearing down left over layers:
  Tear down zope.testing.testrunner.layer.UnitTests in 0.000 seconds.
Total: 310 tests, 0 failures, 0 errors in 25.429 seconds.
/home/stefan/autotest/temp/python26-zope213-cmf22-plone41/bin/test:262: DeprecationWarning: zope.testing.testrunner is deprecated in favour of zope.testrunner.
  import zope.testing.testrunner
/home/stefan/autotest/temp/python26-zope213-cmf22-plone41/eggs/zope.testing-3.9.6-py2.6.egg/zope/testing/testrunner/formatter.py:28: DeprecationWarning: zope.testing.exceptions is deprecated in favour of zope.testrunner.exceptions
  from zope.testing.exceptions import DocTestFailureException
Running Products.PloneTestCase.layer.PloneSite tests:
  Set up Testing.ZopeTestCase.layer.ZopeLite in 0.762 seconds.
  Set up Products.PloneTestCase.layer.ZCML in 3.337 seconds.
  Set up Products.PloneTestCase.layer.PloneSite/home/stefan/autotest/temp/python26-zope213-cmf22-plone41/eggs/Products.TinyMCE-1.2.6-py2.6.egg/Products/TinyMCE/tests.py:21: DeprecationWarning: load_config is deprecated. Please import from Zope2.App.zcml
  zcml.load_config('configure.zcml', Products.TinyMCE)
 in 4.347 seconds.
/home/stefan/autotest/temp/python26-zope213-cmf22-plone41/eggs/Products.TinyMCE-1.2.6-py2.6.egg/Products/TinyMCE/tests/utility.txt:1: DeprecationWarning: Browser is deprecated. Please import from Testing.testbrowser
  ===============
  Ran 8 tests with 0 failures and 0 errors in 5.721 seconds.
Tearing down left over layers:
  Tear down Products.PloneTestCase.layer.PloneSite in 0.173 seconds.
  Tear down Products.PloneTestCase.layer.ZCML in 0.007 seconds.
  Tear down Testing.ZopeTestCase.layer.ZopeLite in 0.000 seconds.
/home/stefan/autotest/temp/python26-zope213-cmf22-plone41/bin/test:262: DeprecationWarning: zope.testing.testrunner is deprecated in favour of zope.testrunner.
  import zope.testing.testrunner
/home/stefan/autotest/temp/python26-zope213-cmf22-plone41/eggs/zope.testing-3.9.6-py2.6.egg/zope/testing/testrunner/formatter.py:28: DeprecationWarning: zope.testing.exceptions is deprecated in favour of zope.testrunner.exceptions
  from zope.testing.exceptions import DocTestFailureException
Running Products.contentmigration.tests.layer.TestLayer tests:
  Set up Testing.ZopeTestCase.layer.ZopeLite in 1.388 seconds.
  Set up Products.PloneTestCase.layer.ZCML in 3.322 seconds.
  Set up Products.PloneTestCase.layer.PloneSite in 4.332 seconds.
  Set up Products.contentmigration.tests.layer.TestLayer in 0.003 seconds.
  Ran 13 tests with 0 failures and 0 errors in 4.405 seconds.
Tearing down left over layers:
  Tear down Products.contentmigration.tests.layer.TestLayer in 0.000 seconds.
  Tear down Products.PloneTestCase.layer.PloneSite in 0.174 seconds.
  Tear down Products.PloneTestCase.layer.ZCML in 0.004 seconds.
  Tear down Testing.ZopeTestCase.layer.ZopeLite in 0.000 seconds.
/home/stefan/autotest/temp/python26-zope213-cmf22-plone41/bin/test:262: DeprecationWarning: zope.testing.testrunner is deprecated in favour of zope.testrunner.
  import zope.testing.testrunner
/home/stefan/autotest/temp/python26-zope213-cmf22-plone41/eggs/zope.testing-3.9.6-py2.6.egg/zope/testing/testrunner/formatter.py:28: DeprecationWarning: zope.testing.exceptions is deprecated in favour of zope.testrunner.exceptions
  from zope.testing.exceptions import DocTestFailureException
Total: 0 tests, 0 failures, 0 errors in 0.000 seconds.
/home/stefan/autotest/temp/python26-zope213-cmf22-plone41/bin/test:262: DeprecationWarning: zope.testing.testrunner is deprecated in favour of zope.testrunner.
  import zope.testing.testrunner
/home/stefan/autotest/temp/python26-zope213-cmf22-plone41/eggs/zope.testing-3.9.6-py2.6.egg/zope/testing/testrunner/formatter.py:28: DeprecationWarning: zope.testing.exceptions is deprecated in favour of zope.testrunner.exceptions
  from zope.testing.exceptions import DocTestFailureException
Running archetypes.referencebrowserwidget.tests.base.layer tests:
  Set up Testing.ZopeTestCase.layer.ZopeLite in 0.000 seconds.
  Set up Products.PloneTestCase.layer.ZCML in 2.506 seconds.
  Set up Products.PloneTestCase.layer.PloneSite in 4.538 seconds.
  Set up archetypes.referencebrowserwidget.tests.base.layer in 0.000 seconds.
  Ran 34 tests with 0 failures and 0 errors in 8.449 seconds.
Running zope.testing.testrunner.layer.UnitTests tests:
  Tear down archetypes.referencebrowserwidget.tests.base.layer in 0.000 seconds.
  Tear down Products.PloneTestCase.layer.PloneSite in 0.183 seconds.
  Tear down Products.PloneTestCase.layer.ZCML in 0.008 seconds.
  Tear down Testing.ZopeTestCase.layer.ZopeLite in 0.000 seconds.
  Set up zope.testing.testrunner.layer.UnitTests in 0.000 seconds.
  Ran 5 tests with 0 failures and 0 errors in 0.001 seconds.
Tearing down left over layers:
  Tear down zope.testing.testrunner.layer.UnitTests in 0.000 seconds.
Total: 39 tests, 0 failures, 0 errors in 16.209 seconds.
/home/stefan/autotest/temp/python26-zope213-cmf22-plone41/bin/test:262: DeprecationWarning: zope.testing.testrunner is deprecated in favour of zope.testrunner.
  import zope.testing.testrunner
/home/stefan/autotest/temp/python26-zope213-cmf22-plone41/eggs/zope.testing-3.9.6-py2.6.egg/zope/testing/testrunner/formatter.py:28: DeprecationWarning: zope.testing.exceptions is deprecated in favour of zope.testrunner.exceptions
  from zope.testing.exceptions import DocTestFailureException
Running archetypes.schemaextender.tests.base.layer tests:
  Set up Testing.ZopeTestCase.layer.ZopeLite in 0.839 seconds.
  Set up Products.PloneTestCase.layer.ZCML in 3.346 seconds.
  Set up Products.PloneTestCase.layer.PloneSite in 4.334 seconds.
  Set up archetypes.schemaextender.tests.base.layer in 0.000 seconds.
  Ran 4 tests with 0 failures and 0 errors in 3.502 seconds.
Running zope.testing.testrunner.layer.UnitTests tests:
  Tear down archetypes.schemaextender.tests.base.layer in 0.000 seconds.
  Tear down Products.PloneTestCase.layer.PloneSite in 0.173 seconds.
  Tear down Products.PloneTestCase.layer.ZCML in 0.007 seconds.
  Tear down Testing.ZopeTestCase.layer.ZopeLite in 0.000 seconds.
  Set up zope.testing.testrunner.layer.UnitTests in 0.000 seconds.
  Ran 19 tests with 0 failures and 0 errors in 0.006 seconds.
Tearing down left over layers:
  Tear down zope.testing.testrunner.layer.UnitTests in 0.000 seconds.
Total: 23 tests, 0 failures, 0 errors in 12.711 seconds.
/home/stefan/autotest/temp/python26-zope213-cmf22-plone41/bin/test:262: DeprecationWarning: zope.testing.testrunner is deprecated in favour of zope.testrunner.
  import zope.testing.testrunner
/home/stefan/autotest/temp/python26-zope213-cmf22-plone41/eggs/zope.testing-3.9.6-py2.6.egg/zope/testing/testrunner/formatter.py:28: DeprecationWarning: zope.testing.exceptions is deprecated in favour of zope.testrunner.exceptions
  from zope.testing.exceptions import DocTestFailureException
Running zope.testing.testrunner.layer.UnitTests tests:
  Set up zope.testing.testrunner.layer.UnitTests in 0.000 seconds.
  Ran 4 tests with 0 failures and 0 errors in 0.047 seconds.
Tearing down left over layers:
  Tear down zope.testing.testrunner.layer.UnitTests in 0.000 seconds.
/home/stefan/autotest/temp/python26-zope213-cmf22-plone41/bin/test:262: DeprecationWarning: zope.testing.testrunner is deprecated in favour of zope.testrunner.
  import zope.testing.testrunner
/home/stefan/autotest/temp/python26-zope213-cmf22-plone41/eggs/zope.testing-3.9.6-py2.6.egg/zope/testing/testrunner/formatter.py:28: DeprecationWarning: zope.testing.exceptions is deprecated in favour of zope.testrunner.exceptions
  from zope.testing.exceptions import DocTestFailureException
/home/stefan/autotest/temp/python26-zope213-cmf22-plone41/eggs/collective.z3cform.datetimewidget-1.0-py2.6.egg/collective/z3cform/datetimewidget/tests.py:25: DeprecationWarning: zope.testing.doctest is deprecated in favour of the Python standard library doctest module
  from zope.testing import doctest
Running zope.testing.testrunner.layer.UnitTests tests:
  Set up zope.testing.testrunner.layer.UnitTests in 0.000 seconds.
  Ran 5 tests with 0 failures and 0 errors in 0.999 seconds.
Tearing down left over layers:
  Tear down zope.testing.testrunner.layer.UnitTests in 0.000 seconds.
/home/stefan/autotest/temp/python26-zope213-cmf22-plone41/bin/test:262: DeprecationWarning: zope.testing.testrunner is deprecated in favour of zope.testrunner.
  import zope.testing.testrunner
/home/stefan/autotest/temp/python26-zope213-cmf22-plone41/eggs/zope.testing-3.9.6-py2.6.egg/zope/testing/testrunner/formatter.py:28: DeprecationWarning: zope.testing.exceptions is deprecated in favour of zope.testrunner.exceptions
  from zope.testing.exceptions import DocTestFailureException
Running Testing.ZopeTestCase.layer.ZopeLite tests:
  Set up Testing.ZopeTestCase.layer.ZopeLite in 0.069 seconds.
  Ran 3 tests with 0 failures and 0 errors in 0.886 seconds.
Tearing down left over layers:
  Tear down Testing.ZopeTestCase.layer.ZopeLite in 0.000 seconds.
/home/stefan/autotest/temp/python26-zope213-cmf22-plone41/bin/test:262: DeprecationWarning: zope.testing.testrunner is deprecated in favour of zope.testrunner.
  import zope.testing.testrunner
/home/stefan/autotest/temp/python26-zope213-cmf22-plone41/eggs/zope.testing-3.9.6-py2.6.egg/zope/testing/testrunner/formatter.py:28: DeprecationWarning: zope.testing.exceptions is deprecated in favour of zope.testrunner.exceptions
  from zope.testing.exceptions import DocTestFailureException
Running Testing.ZopeTestCase.layer.ZopeLite tests:
  Set up Testing.ZopeTestCase.layer.ZopeLite in 0.039 seconds.
  Ran 2 tests with 0 failures and 0 errors in 1.036 seconds.
Running zope.testing.testrunner.layer.UnitTests tests:
  Tear down Testing.ZopeTestCase.layer.ZopeLite in 0.000 seconds.
  Set up zope.testing.testrunner.layer.UnitTests in 0.000 seconds.
  Ran 1 tests with 0 failures and 0 errors in 0.128 seconds.
Tearing down left over layers:
  Tear down zope.testing.testrunner.layer.UnitTests in 0.000 seconds.
Total: 3 tests, 0 failures, 0 errors in 1.381 seconds.
/home/stefan/autotest/temp/python26-zope213-cmf22-plone41/bin/test:262: DeprecationWarning: zope.testing.testrunner is deprecated in favour of zope.testrunner.
  import zope.testing.testrunner
/home/stefan/autotest/temp/python26-zope213-cmf22-plone41/eggs/zope.testing-3.9.6-py2.6.egg/zope/testing/testrunner/formatter.py:28: DeprecationWarning: zope.testing.exceptions is deprecated in favour of zope.testrunner.exceptions
  from zope.testing.exceptions import DocTestFailureException
Running Testing.ZopeTestCase.layer.ZopeLite tests:
  Set up Testing.ZopeTestCase.layer.ZopeLite in 0.047 seconds.
  Ran 1 tests with 0 failures and 0 errors in 0.226 seconds.
Running kss.core.tests.base.KSSLayer tests:
  Tear down Testing.ZopeTestCase.layer.ZopeLite in 0.000 seconds.
  Set up kss.core.tests.base.KSSCoreLayer in 0.027 seconds.
  Set up kss.core.tests.base.KSSLayer in 0.063 seconds.
  Ran 15 tests with 0 failures and 0 errors in 0.153 seconds.
Running kss.core.tests.test_ttwapi.layer tests:
  Set up kss.core.tests.test_ttwapi.layer in 0.001 seconds.
  Ran 3 tests with 0 failures and 0 errors in 0.026 seconds.
Running zope.testing.testrunner.layer.UnitTests tests:
  Tear down kss.core.tests.test_ttwapi.layer in 0.000 seconds.
  Tear down kss.core.tests.base.KSSLayer in 0.000 seconds.
  Tear down kss.core.tests.base.KSSCoreLayer in 0.000 seconds.
  Set up zope.testing.testrunner.layer.UnitTests in 0.000 seconds.
  Ran 2 tests with 0 failures and 0 errors in 0.009 seconds.
Tearing down left over layers:
  Tear down zope.testing.testrunner.layer.UnitTests in 0.000 seconds.
Total: 21 tests, 0 failures, 0 errors in 0.852 seconds.
/home/stefan/autotest/temp/python26-zope213-cmf22-plone41/bin/test:262: DeprecationWarning: zope.testing.testrunner is deprecated in favour of zope.testrunner.
  import zope.testing.testrunner
/home/stefan/autotest/temp/python26-zope213-cmf22-plone41/eggs/zope.testing-3.9.6-py2.6.egg/zope/testing/testrunner/formatter.py:28: DeprecationWarning: zope.testing.exceptions is deprecated in favour of zope.testrunner.exceptions
  from zope.testing.exceptions import DocTestFailureException
/home/stefan/autotest/temp/python26-zope213-cmf22-plone41/eggs/plone.app.imaging-1.0.5-py2.6.egg/plone/app/imaging/tests/base.py:1: DeprecationWarning: Browser is deprecated. Please import from Testing.testbrowser
  from Products.Five.testbrowser import Browser
***********************************************
WARNING: LinguaPlone not found. Skipping tests.
***********************************************
***********************************************
WARNING: LinguaPlone not found. Skipping tests.
***********************************************
Running plone.app.blob.tests.layer.BlobLayer tests:
  Set up Testing.ZopeTestCase.layer.ZopeLite in 0.825 seconds.
  Set up Products.PloneTestCase.layer.ZCML in 3.283 seconds.
  Set up Products.PloneTestCase.layer.PloneSite in 4.344 seconds.
  Set up plone.app.blob.tests.layer.BlobLayer in 0.084 seconds.
/home/stefan/autotest/temp/python26-zope213-cmf22-plone41/eggs/Products.PortalTransforms-2.0.6-py2.6.egg/Products/PortalTransforms/libtransforms/commandtransform.py:103: DeprecationWarning: os.popen4 is deprecated.  Use the subprocess module.
  cin, couterr = os.popen4(command, 'b')
  Ran 24 tests with 0 failures and 0 errors in 7.058 seconds.
Running plone.app.blob.tests.layer.BlobReplacementLayer tests:
  Set up plone.app.blob.tests.layer.BlobReplacementLayer in 0.203 seconds.
  Ran 59 tests with 0 failures and 0 errors in 14.902 seconds.
Running zope.testing.testrunner.layer.UnitTests tests:
  Tear down plone.app.blob.tests.layer.BlobReplacementLayer in 0.000 seconds.
  Tear down plone.app.blob.tests.layer.BlobLayer in 0.000 seconds.
  Tear down Products.PloneTestCase.layer.PloneSite in 0.185 seconds.
  Tear down Products.PloneTestCase.layer.ZCML in 0.009 seconds.
  Tear down Testing.ZopeTestCase.layer.ZopeLite in 0.000 seconds.
  Set up zope.testing.testrunner.layer.UnitTests in 0.000 seconds.
  Ran 2 tests with 0 failures and 0 errors in 0.001 seconds.
Tearing down left over layers:
  Tear down zope.testing.testrunner.layer.UnitTests in 0.000 seconds.
Total: 85 tests, 0 failures, 0 errors in 31.741 seconds.
/home/stefan/autotest/temp/python26-zope213-cmf22-plone41/bin/test:262: DeprecationWarning: zope.testing.testrunner is deprecated in favour of zope.testrunner.
  import zope.testing.testrunner
/home/stefan/autotest/temp/python26-zope213-cmf22-plone41/eggs/zope.testing-3.9.6-py2.6.egg/zope/testing/testrunner/formatter.py:28: DeprecationWarning: zope.testing.exceptions is deprecated in favour of zope.testrunner.exceptions
  from zope.testing.exceptions import DocTestFailureException
/home/stefan/autotest/temp/python26-zope213-cmf22-plone41/eggs/plone.testing-4.0-py2.6.egg/plone/testing/z2.py:19: DeprecationWarning: Zope2VocabularyRegistry is deprecated. Please import from Zope2.App.schema
  from Products.Five.schema import Zope2VocabularyRegistry
Running plone.app.caching.testing.PloneAppCaching:Functional tests:
  Set up plone.testing.zca.LayerCleanup in 0.000 seconds.
  Set up plone.testing.z2.Startup/home/stefan/autotest/temp/python26-zope213-cmf22-plone41/eggs/zope.configuration-3.7.4-py2.6.egg/zope/configuration/config.py:193: DeprecationWarning: FiveSecurityPolicy is deprecated. Please import from AccessControl.security
  obj = getattr(mod, oname)
 in 0.220 seconds.
  Set up plone.app.testing.layers.PloneFixture in 7.731 seconds.
  Set up plone.app.caching.testing.PloneAppCaching in 0.650 seconds.
  Set up plone.app.caching.testing.PloneAppCaching:Functional in 0.000 seconds.
  Ran 16 tests with 0 failures and 0 errors in 14.805 seconds.
Running plone.testing.zca.UnitTesting tests:
  Tear down plone.app.caching.testing.PloneAppCaching:Functional in 0.000 seconds.
  Tear down plone.app.caching.testing.PloneAppCaching in 0.005 seconds.
  Tear down plone.app.testing.layers.PloneFixture in 0.106 seconds.
  Tear down plone.testing.z2.Startup in 0.008 seconds.
  Tear down plone.testing.zca.LayerCleanup in 0.007 seconds.
  Set up plone.testing.zca.UnitTesting in 0.000 seconds.
  Ran 162 tests with 0 failures and 0 errors in 0.177 seconds.
Tearing down left over layers:
  Tear down plone.testing.zca.UnitTesting in 0.000 seconds.
Total: 178 tests, 0 failures, 0 errors in 24.225 seconds.
/home/stefan/autotest/temp/python26-zope213-cmf22-plone41/bin/test:262: DeprecationWarning: zope.testing.testrunner is deprecated in favour of zope.testrunner.
  import zope.testing.testrunner
/home/stefan/autotest/temp/python26-zope213-cmf22-plone41/eggs/zope.testing-3.9.6-py2.6.egg/zope/testing/testrunner/formatter.py:28: DeprecationWarning: zope.testing.exceptions is deprecated in favour of zope.testrunner.exceptions
  from zope.testing.exceptions import DocTestFailureException
/home/stefan/autotest/temp/python26-zope213-cmf22-plone41/eggs/plone.testing-4.0-py2.6.egg/plone/testing/z2.py:19: DeprecationWarning: Zope2VocabularyRegistry is deprecated. Please import from Zope2.App.schema
  from Products.Five.schema import Zope2VocabularyRegistry
Running plone.app.discussion.testing.PloneAppDiscussion:Functional tests:
  Set up plone.testing.zca.LayerCleanup in 0.000 seconds.
  Set up plone.testing.z2.Startup/home/stefan/autotest/temp/python26-zope213-cmf22-plone41/eggs/zope.configuration-3.7.4-py2.6.egg/zope/configuration/config.py:193: DeprecationWarning: FiveSecurityPolicy is deprecated. Please import from AccessControl.security
  obj = getattr(mod, oname)
 in 0.194 seconds.
  Set up plone.app.testing.layers.PloneFixture in 7.454 seconds.
  Set up plone.app.discussion.testing.PloneAppDiscussion in 0.612 seconds.
  Set up plone.app.discussion.testing.PloneAppDiscussion:Functional in 0.000 seconds.
  Ran 2 tests with 0 failures and 0 errors in 13.067 seconds.
Running plone.app.discussion.testing.PloneAppDiscussion:Integration tests:
  Tear down plone.app.discussion.testing.PloneAppDiscussion:Functional in 0.000 seconds.
  Set up plone.app.discussion.testing.PloneAppDiscussion:Integration in 0.000 seconds.
  Ran 149 tests with 0 failures and 0 errors in 16.805 seconds.
Tearing down left over layers:
  Tear down plone.app.discussion.testing.PloneAppDiscussion:Integration in 0.000 seconds.
  Tear down plone.app.discussion.testing.PloneAppDiscussion in 0.004 seconds.
  Tear down plone.app.testing.layers.PloneFixture in 0.104 seconds.
  Tear down plone.testing.z2.Startup in 0.008 seconds.
  Tear down plone.testing.zca.LayerCleanup in 0.007 seconds.
Total: 151 tests, 0 failures, 0 errors in 38.759 seconds.
/home/stefan/autotest/temp/python26-zope213-cmf22-plone41/bin/test:262: DeprecationWarning: zope.testing.testrunner is deprecated in favour of zope.testrunner.
  import zope.testing.testrunner
/home/stefan/autotest/temp/python26-zope213-cmf22-plone41/eggs/zope.testing-3.9.6-py2.6.egg/zope/testing/testrunner/formatter.py:28: DeprecationWarning: zope.testing.exceptions is deprecated in favour of zope.testrunner.exceptions
  from zope.testing.exceptions import DocTestFailureException
Running Testing.ZopeTestCase.layer.ZopeLite tests:
  Set up Testing.ZopeTestCase.layer.ZopeLite in 0.845 seconds.
  Ran 2 tests with 0 failures and 0 errors in 0.008 seconds.
Running plone.app.folder.tests.layer.IntegrationLayer tests:
  Set up Products.PloneTestCase.layer.ZCML in 3.263 seconds.
  Set up Products.PloneTestCase.layer.PloneSite in 4.449 seconds.
  Set up plone.app.folder.tests.layer.IntegrationLayer in 0.077 seconds.
  Ran 27 tests with 0 failures and 0 errors in 6.675 seconds.
Running plone.app.folder.tests.layer.PartialOrderingIntegrationLayer tests:
  Set up plone.app.folder.tests.layer.PartialOrderingIntegrationLayer in 0.000 seconds.
  Ran 3 tests with 0 failures and 0 errors in 0.327 seconds.
Tearing down left over layers:
  Tear down plone.app.folder.tests.layer.PartialOrderingIntegrationLayer in 0.000 seconds.
  Tear down plone.app.folder.tests.layer.IntegrationLayer in 0.000 seconds.
  Tear down Products.PloneTestCase.layer.PloneSite in 0.175 seconds.
  Tear down Products.PloneTestCase.layer.ZCML in 0.004 seconds.
  Tear down Testing.ZopeTestCase.layer.ZopeLite in 0.000 seconds.
Total: 32 tests, 0 failures, 0 errors in 16.440 seconds.
/home/stefan/autotest/temp/python26-zope213-cmf22-plone41/bin/test:262: DeprecationWarning: zope.testing.testrunner is deprecated in favour of zope.testrunner.
  import zope.testing.testrunner
/home/stefan/autotest/temp/python26-zope213-cmf22-plone41/eggs/zope.testing-3.9.6-py2.6.egg/zope/testing/testrunner/formatter.py:28: DeprecationWarning: zope.testing.exceptions is deprecated in favour of zope.testrunner.exceptions
  from zope.testing.exceptions import DocTestFailureException
/home/stefan/autotest/temp/python26-zope213-cmf22-plone41/eggs/plone.app.controlpanel-2.1.1-py2.6.egg/plone/app/controlpanel/tests/cptc.py:10: DeprecationWarning: Browser is deprecated. Please import from Testing.testbrowser
  from Products.Five.testbrowser import Browser
Running plone.app.imaging.testing.ImagingLayer tests:
  Set up Testing.ZopeTestCase.layer.ZopeLite in 0.827 seconds.
  Set up Products.PloneTestCase.layer.ZCML in 3.347 seconds.
  Set up Products.PloneTestCase.layer.PloneSite in 4.339 seconds.
  Set up collective.testcaselayer.ptc.PTCLayer in 0.024 seconds.
  Set up plone.app.imaging.testing.ImagingLayer/home/stefan/autotest/temp/python26-zope213-cmf22-plone41/eggs/plone.app.imaging-1.0.5-py2.6.egg/plone/app/imaging/testing.py:14: DeprecationWarning: load_config is deprecated. Please import from Zope2.App.zcml
  zcml.load_config('testing.zcml', imaging)
 in 0.119 seconds.
  Ran 44 tests with 0 failures and 0 errors in 7.511 seconds.
Running zope.testing.testrunner.layer.UnitTests tests:
  Tear down plone.app.imaging.testing.ImagingLayer in 0.000 seconds.
  Tear down collective.testcaselayer.ptc.PTCLayer in 0.000 seconds.
  Tear down Products.PloneTestCase.layer.PloneSite in 0.175 seconds.
  Tear down Products.PloneTestCase.layer.ZCML in 0.005 seconds.
  Tear down Testing.ZopeTestCase.layer.ZopeLite in 0.000 seconds.
  Set up zope.testing.testrunner.layer.UnitTests in 0.000 seconds.
  Ran 7 tests with 0 failures and 0 errors in 0.001 seconds.
Tearing down left over layers:
  Tear down zope.testing.testrunner.layer.UnitTests in 0.000 seconds.
Total: 51 tests, 0 failures, 0 errors in 16.867 seconds.
/home/stefan/autotest/temp/python26-zope213-cmf22-plone41/bin/test:262: DeprecationWarning: zope.testing.testrunner is deprecated in favour of zope.testrunner.
  import zope.testing.testrunner
/home/stefan/autotest/temp/python26-zope213-cmf22-plone41/eggs/zope.testing-3.9.6-py2.6.egg/zope/testing/testrunner/formatter.py:28: DeprecationWarning: zope.testing.exceptions is deprecated in favour of zope.testrunner.exceptions
  from zope.testing.exceptions import DocTestFailureException
Running Products.PloneTestCase.layer.PloneSite tests:
  Set up Testing.ZopeTestCase.layer.ZopeLite in 1.423 seconds.
  Set up Products.PloneTestCase.layer.ZCML in 3.404 seconds.
  Set up Products.PloneTestCase.layer.PloneSite in 4.338 seconds.
  Ran 1 tests with 0 failures and 0 errors in 0.295 seconds.
Tearing down left over layers:
  Tear down Products.PloneTestCase.layer.PloneSite in 0.173 seconds.
  Tear down Products.PloneTestCase.layer.ZCML in 0.004 seconds.
  Tear down Testing.ZopeTestCase.layer.ZopeLite in 0.000 seconds.
/home/stefan/autotest/temp/python26-zope213-cmf22-plone41/bin/test:262: DeprecationWarning: zope.testing.testrunner is deprecated in favour of zope.testrunner.
  import zope.testing.testrunner
/home/stefan/autotest/temp/python26-zope213-cmf22-plone41/eggs/zope.testing-3.9.6-py2.6.egg/zope/testing/testrunner/formatter.py:28: DeprecationWarning: zope.testing.exceptions is deprecated in favour of zope.testrunner.exceptions
  from zope.testing.exceptions import DocTestFailureException
Running plone.app.linkintegrity.tests.layer.PloneLinkintegrity tests:
  Set up Testing.ZopeTestCase.layer.ZopeLite in 1.412 seconds.
  Set up Products.PloneTestCase.layer.ZCML in 3.319 seconds.
  Set up Products.PloneTestCase.layer.PloneSite in 4.407 seconds.
  Set up collective.testcaselayer.ptc.PTCLayer in 0.024 seconds.
  Set up plone.app.linkintegrity.tests.layer.PloneLinkintegrity in 0.615 seconds.
  Ran 27 tests with 0 failures and 0 errors in 33.033 seconds.
Running zope.testing.testrunner.layer.UnitTests tests:
  Tear down plone.app.linkintegrity.tests.layer.PloneLinkintegrity in 0.000 seconds.
  Tear down collective.testcaselayer.ptc.PTCLayer in 0.000 seconds.
  Tear down Products.PloneTestCase.layer.PloneSite in 0.177 seconds.
  Tear down Products.PloneTestCase.layer.ZCML in 0.006 seconds.
  Tear down Testing.ZopeTestCase.layer.ZopeLite in 0.000 seconds.
  Set up zope.testing.testrunner.layer.UnitTests in 0.000 seconds.
  Ran 2 tests with 0 failures and 0 errors in 0.001 seconds.
Tearing down left over layers:
  Tear down zope.testing.testrunner.layer.UnitTests in 0.000 seconds.
Total: 29 tests, 0 failures, 0 errors in 43.632 seconds.
/home/stefan/autotest/temp/python26-zope213-cmf22-plone41/bin/test:262: DeprecationWarning: zope.testing.testrunner is deprecated in favour of zope.testrunner.
  import zope.testing.testrunner
/home/stefan/autotest/temp/python26-zope213-cmf22-plone41/eggs/zope.testing-3.9.6-py2.6.egg/zope/testing/testrunner/formatter.py:28: DeprecationWarning: zope.testing.exceptions is deprecated in favour of zope.testrunner.exceptions
  from zope.testing.exceptions import DocTestFailureException
Total: 0 tests, 0 failures, 0 errors in 0.000 seconds.
/home/stefan/autotest/temp/python26-zope213-cmf22-plone41/bin/test:262: DeprecationWarning: zope.testing.testrunner is deprecated in favour of zope.testrunner.
  import zope.testing.testrunner
/home/stefan/autotest/temp/python26-zope213-cmf22-plone41/eggs/zope.testing-3.9.6-py2.6.egg/zope/testing/testrunner/formatter.py:28: DeprecationWarning: zope.testing.exceptions is deprecated in favour of zope.testrunner.exceptions
  from zope.testing.exceptions import DocTestFailureException
/home/stefan/autotest/temp/python26-zope213-cmf22-plone41/eggs/plone.testing-4.0-py2.6.egg/plone/testing/z2.py:19: DeprecationWarning: Zope2VocabularyRegistry is deprecated. Please import from Zope2.App.schema
  from Products.Five.schema import Zope2VocabularyRegistry
Running plone.app.registry.testing.plone.app.registry:Integration tests:
  Set up plone.testing.zca.LayerCleanup in 0.000 seconds.
  Set up plone.testing.z2.Startup/home/stefan/autotest/temp/python26-zope213-cmf22-plone41/eggs/zope.configuration-3.7.4-py2.6.egg/zope/configuration/config.py:193: DeprecationWarning: FiveSecurityPolicy is deprecated. Please import from AccessControl.security
  obj = getattr(mod, oname)
 in 0.206 seconds.
  Set up plone.app.testing.layers.PloneFixture in 7.989 seconds.
  Set up plone.app.registry.testing.PloneAppRegistry in 0.324 seconds.
  Set up plone.app.registry.testing.plone.app.registry:Integration in 0.000 seconds.
  Ran 2 tests with 0 failures and 0 errors in 0.006 seconds.
Running plone.testing.zca.UnitTesting tests:
  Tear down plone.app.registry.testing.plone.app.registry:Integration in 0.000 seconds.
  Tear down plone.app.registry.testing.PloneAppRegistry in 0.003 seconds.
  Tear down plone.app.testing.layers.PloneFixture in 0.104 seconds.
  Tear down plone.testing.z2.Startup in 0.008 seconds.
  Tear down plone.testing.zca.LayerCleanup in 0.002 seconds.
  Set up plone.testing.zca.UnitTesting in 0.000 seconds.
  Ran 37 tests with 0 failures and 0 errors in 0.973 seconds.
Tearing down left over layers:
  Tear down plone.testing.zca.UnitTesting in 0.000 seconds.
Total: 39 tests, 0 failures, 0 errors in 10.090 seconds.
/home/stefan/autotest/temp/python26-zope213-cmf22-plone41/bin/test:262: DeprecationWarning: zope.testing.testrunner is deprecated in favour of zope.testrunner.
  import zope.testing.testrunner
/home/stefan/autotest/temp/python26-zope213-cmf22-plone41/eggs/zope.testing-3.9.6-py2.6.egg/zope/testing/testrunner/formatter.py:28: DeprecationWarning: zope.testing.exceptions is deprecated in favour of zope.testrunner.exceptions
  from zope.testing.exceptions import DocTestFailureException
/home/stefan/autotest/temp/python26-zope213-cmf22-plone41/eggs/plone.testing-4.0-py2.6.egg/plone/testing/z2.py:19: DeprecationWarning: Zope2VocabularyRegistry is deprecated. Please import from Zope2.App.schema
  from Products.Five.schema import Zope2VocabularyRegistry
Running zope.testing.testrunner.layer.UnitTests tests:
  Set up zope.testing.testrunner.layer.UnitTests in 0.000 seconds.
/home/stefan/autotest/temp/python26-zope213-cmf22-plone41/eggs/zope.configuration-3.7.4-py2.6.egg/zope/configuration/config.py:193: DeprecationWarning: FiveSecurityPolicy is deprecated. Please import from AccessControl.security
  obj = getattr(mod, oname)
  Ran 3 tests with 0 failures and 0 errors in 1 minutes 2.883 seconds.
Tearing down left over layers:
  Tear down zope.testing.testrunner.layer.UnitTests in 0.000 seconds.
/home/stefan/autotest/temp/python26-zope213-cmf22-plone41/bin/test:262: DeprecationWarning: zope.testing.testrunner is deprecated in favour of zope.testrunner.
  import zope.testing.testrunner
/home/stefan/autotest/temp/python26-zope213-cmf22-plone41/eggs/zope.testing-3.9.6-py2.6.egg/zope/testing/testrunner/formatter.py:28: DeprecationWarning: zope.testing.exceptions is deprecated in favour of zope.testrunner.exceptions
  from zope.testing.exceptions import DocTestFailureException
Running Products.PloneTestCase.layer.PloneSite tests:
  Set up Testing.ZopeTestCase.layer.ZopeLite in 1.329 seconds.
  Set up Products.PloneTestCase.layer.ZCML in 3.351 seconds.
  Set up Products.PloneTestCase.layer.PloneSite in 4.365 seconds.
  Ran 7 tests with 0 failures and 0 errors in 8.033 seconds.
Tearing down left over layers:
  Tear down Products.PloneTestCase.layer.PloneSite in 0.181 seconds.
  Tear down Products.PloneTestCase.layer.ZCML in 0.006 seconds.
  Tear down Testing.ZopeTestCase.layer.ZopeLite in 0.000 seconds.
/home/stefan/autotest/temp/python26-zope213-cmf22-plone41/bin/test:262: DeprecationWarning: zope.testing.testrunner is deprecated in favour of zope.testrunner.
  import zope.testing.testrunner
/home/stefan/autotest/temp/python26-zope213-cmf22-plone41/eggs/zope.testing-3.9.6-py2.6.egg/zope/testing/testrunner/formatter.py:28: DeprecationWarning: zope.testing.exceptions is deprecated in favour of zope.testrunner.exceptions
  from zope.testing.exceptions import DocTestFailureException
/home/stefan/autotest/temp/python26-zope213-cmf22-plone41/eggs/plone.testing-4.0-py2.6.egg/plone/testing/z2.py:19: DeprecationWarning: Zope2VocabularyRegistry is deprecated. Please import from Zope2.App.schema
  from Products.Five.schema import Zope2VocabularyRegistry
Running plone.app.uuid.testing.plone.app.uuid:Functional tests:
  Set up plone.testing.zca.LayerCleanup in 0.000 seconds.
  Set up plone.testing.z2.Startup/home/stefan/autotest/temp/python26-zope213-cmf22-plone41/eggs/zope.configuration-3.7.4-py2.6.egg/zope/configuration/config.py:193: DeprecationWarning: FiveSecurityPolicy is deprecated. Please import from AccessControl.security
  obj = getattr(mod, oname)
 in 0.278 seconds.
  Set up plone.app.testing.layers.PloneFixture in 8.120 seconds.
  Set up plone.app.uuid.testing.PloneAppUUID in 0.026 seconds.
  Set up plone.app.uuid.testing.plone.app.uuid:Functional in 0.000 seconds.
  Ran 3 tests with 0 failures and 0 errors in 1.019 seconds.
Running plone.app.uuid.testing.plone.app.uuid:Integration tests:
  Tear down plone.app.uuid.testing.plone.app.uuid:Functional in 0.000 seconds.
  Set up plone.app.uuid.testing.plone.app.uuid:Integration in 0.000 seconds.
  Ran 5 tests with 0 failures and 0 errors in 0.292 seconds.
Tearing down left over layers:
  Tear down plone.app.uuid.testing.plone.app.uuid:Integration in 0.000 seconds.
  Tear down plone.app.uuid.testing.PloneAppUUID in 0.004 seconds.
  Tear down plone.app.testing.layers.PloneFixture in 0.106 seconds.
  Tear down plone.testing.z2.Startup in 0.008 seconds.
  Tear down plone.testing.zca.LayerCleanup in 0.003 seconds.
Total: 8 tests, 0 failures, 0 errors in 10.367 seconds.
/home/stefan/autotest/temp/python26-zope213-cmf22-plone41/bin/test:262: DeprecationWarning: zope.testing.testrunner is deprecated in favour of zope.testrunner.
  import zope.testing.testrunner
/home/stefan/autotest/temp/python26-zope213-cmf22-plone41/eggs/zope.testing-3.9.6-py2.6.egg/zope/testing/testrunner/formatter.py:28: DeprecationWarning: zope.testing.exceptions is deprecated in favour of zope.testrunner.exceptions
  from zope.testing.exceptions import DocTestFailureException
/home/stefan/autotest/temp/python26-zope213-cmf22-plone41/eggs/plone.app.z3cform-0.5.4-py2.6.egg/plone/app/z3cform/tests/test_kss_attr.py:3: DeprecationWarning: Browser is deprecated. Please import from Testing.testbrowser
  from Products.Five.testbrowser import Browser
/home/stefan/autotest/temp/python26-zope213-cmf22-plone41/eggs/plone.app.z3cform-0.5.4-py2.6.egg/plone/app/z3cform/tests/tests.py:3: DeprecationWarning: zope.testing.doctest is deprecated in favour of the Python standard library doctest module
  import zope.testing.doctest
Running Products.PloneTestCase.layer.PloneSite tests:
  Set up Testing.ZopeTestCase.layer.ZopeLite in 1.423 seconds.
  Set up Products.PloneTestCase.layer.ZCML in 3.525 seconds.
  Set up Products.PloneTestCase.layer.PloneSite/home/stefan/autotest/temp/python26-zope213-cmf22-plone41/eggs/plone.app.z3cform-0.5.4-py2.6.egg/plone/app/z3cform/tests/tests.py:21: DeprecationWarning: load_config is deprecated. Please import from Zope2.App.zcml
  zcml.load_config('testing.zcml', plone.app.z3cform.tests)
 in 4.600 seconds.
  Ran 5 tests with 0 failures and 0 errors in 0.761 seconds.
Running plone.app.z3cform.tests.layer.KSSUnitTestLayer tests:
  Tear down Products.PloneTestCase.layer.PloneSite in 0.174 seconds.
  Tear down Products.PloneTestCase.layer.ZCML in 0.004 seconds.
  Tear down Testing.ZopeTestCase.layer.ZopeLite in 0.000 seconds.
  Set up plone.app.z3cform.tests.layer.KSSUnitTestLayer in 0.378 seconds.
  Ran 9 tests with 0 failures and 0 errors in 0.135 seconds.
Running zope.testing.testrunner.layer.UnitTests tests:
  Tear down plone.app.z3cform.tests.layer.KSSUnitTestLayer in 0.001 seconds.
  Set up zope.testing.testrunner.layer.UnitTests in 0.000 seconds.
  Ran 3 tests with 0 failures and 0 errors in 0.004 seconds.
Tearing down left over layers:
  Tear down zope.testing.testrunner.layer.UnitTests in 0.000 seconds.
Total: 17 tests, 0 failures, 0 errors in 11.739 seconds.
/home/stefan/autotest/temp/python26-zope213-cmf22-plone41/bin/test:262: DeprecationWarning: zope.testing.testrunner is deprecated in favour of zope.testrunner.
  import zope.testing.testrunner
/home/stefan/autotest/temp/python26-zope213-cmf22-plone41/eggs/zope.testing-3.9.6-py2.6.egg/zope/testing/testrunner/formatter.py:28: DeprecationWarning: zope.testing.exceptions is deprecated in favour of zope.testrunner.exceptions
  from zope.testing.exceptions import DocTestFailureException
Running zope.testing.testrunner.layer.UnitTests tests:
  Set up zope.testing.testrunner.layer.UnitTests in 0.000 seconds.
  Ran 18 tests with 0 failures and 0 errors in 1.191 seconds.
Tearing down left over layers:
  Tear down zope.testing.testrunner.layer.UnitTests in 0.000 seconds.
/home/stefan/autotest/temp/python26-zope213-cmf22-plone41/bin/test:262: DeprecationWarning: zope.testing.testrunner is deprecated in favour of zope.testrunner.
  import zope.testing.testrunner
/home/stefan/autotest/temp/python26-zope213-cmf22-plone41/eggs/zope.testing-3.9.6-py2.6.egg/zope/testing/testrunner/formatter.py:28: DeprecationWarning: zope.testing.exceptions is deprecated in favour of zope.testrunner.exceptions
  from zope.testing.exceptions import DocTestFailureException
Running zope.testing.testrunner.layer.UnitTests tests:
  Set up zope.testing.testrunner.layer.UnitTests in 0.000 seconds.
  Ran 61 tests with 0 failures and 0 errors in 3.168 seconds.
Tearing down left over layers:
  Tear down zope.testing.testrunner.layer.UnitTests in 0.000 seconds.
/home/stefan/autotest/temp/python26-zope213-cmf22-plone41/bin/test:262: DeprecationWarning: zope.testing.testrunner is deprecated in favour of zope.testrunner.
  import zope.testing.testrunner
/home/stefan/autotest/temp/python26-zope213-cmf22-plone41/eggs/zope.testing-3.9.6-py2.6.egg/zope/testing/testrunner/formatter.py:28: DeprecationWarning: zope.testing.exceptions is deprecated in favour of zope.testrunner.exceptions
  from zope.testing.exceptions import DocTestFailureException
Running zope.testing.testrunner.layer.UnitTests tests:
  Set up zope.testing.testrunner.layer.UnitTests in 0.000 seconds.
  Ran 57 tests with 0 failures and 0 errors in 0.051 seconds.
Tearing down left over layers:
  Tear down zope.testing.testrunner.layer.UnitTests in 0.000 seconds.
/home/stefan/autotest/temp/python26-zope213-cmf22-plone41/bin/test:262: DeprecationWarning: zope.testing.testrunner is deprecated in favour of zope.testrunner.
  import zope.testing.testrunner
/home/stefan/autotest/temp/python26-zope213-cmf22-plone41/eggs/zope.testing-3.9.6-py2.6.egg/zope/testing/testrunner/formatter.py:28: DeprecationWarning: zope.testing.exceptions is deprecated in favour of zope.testrunner.exceptions
  from zope.testing.exceptions import DocTestFailureException
/home/stefan/autotest/temp/python26-zope213-cmf22-plone41/eggs/plone.folder-1.0.1-py2.6.egg/plone/folder/tests/layer.py:2: DeprecationWarning: load_config is deprecated. Please import from Zope2.App.zcml
  from Products.Five.zcml import load_config
Running plone.folder.tests.layer.PloneFolderLayer tests:
  Set up plone.folder.tests.layer.PloneFolderLayer in 0.007 seconds.
  Ran 67 tests with 0 failures and 0 errors in 4.943 seconds.
Tearing down left over layers:
  Tear down plone.folder.tests.layer.PloneFolderLayer in 0.000 seconds.
/home/stefan/autotest/temp/python26-zope213-cmf22-plone41/bin/test:262: DeprecationWarning: zope.testing.testrunner is deprecated in favour of zope.testrunner.
  import zope.testing.testrunner
/home/stefan/autotest/temp/python26-zope213-cmf22-plone41/eggs/zope.testing-3.9.6-py2.6.egg/zope/testing/testrunner/formatter.py:28: DeprecationWarning: zope.testing.exceptions is deprecated in favour of zope.testrunner.exceptions
  from zope.testing.exceptions import DocTestFailureException
Running plone.outputfilters.tests.base.layer tests:
  Set up Testing.ZopeTestCase.layer.ZopeLite in 1.258 seconds.
  Set up Products.PloneTestCase.layer.ZCML in 3.681 seconds.
  Set up Products.PloneTestCase.layer.PloneSite in 4.432 seconds.
  Set up plone.outputfilters.tests.base.layer in 0.000 seconds.
/home/stefan/autotest/temp/python26-zope213-cmf22-plone41/eggs/plone.outputfilters-1.0-py2.6.egg/plone/outputfilters/README.txt:1: DeprecationWarning: load_string is deprecated. Please import from Zope2.App.zcml
  Introduction
  Ran 36 tests with 0 failures and 0 errors in 5.502 seconds.
Running zope.testing.testrunner.layer.UnitTests tests:
  Tear down plone.outputfilters.tests.base.layer in 0.000 seconds.
  Tear down Products.PloneTestCase.layer.PloneSite in 0.175 seconds.
  Tear down Products.PloneTestCase.layer.ZCML in 0.005 seconds.
  Tear down Testing.ZopeTestCase.layer.ZopeLite in 0.000 seconds.
  Set up zope.testing.testrunner.layer.UnitTests in 0.000 seconds.
  Ran 4 tests with 0 failures and 0 errors in 0.000 seconds.
Tearing down left over layers:
  Tear down zope.testing.testrunner.layer.UnitTests in 0.000 seconds.
Total: 40 tests, 0 failures, 0 errors in 15.553 seconds.
#### Running tests for group ATCT ####
#### Finished tests for group ATCT ####

#### Running tests for group Add-ons ####
#### Finished tests for group Add-ons ####

#### Running tests for group Archetypes ####
#### Finished tests for group Archetypes ####

#### Running tests for group CMF ####
#### Finished tests for group CMF ####

#### Running tests for group CMFEditions ####
#### Finished tests for group CMFEditions ####

#### Running tests for group Plone ####
#### Finished tests for group Plone ####

#### Running tests for group PlonePAS ####
#### Finished tests for group PlonePAS ####

#### Running tests for group plone ####
#### Finished tests for group plone ####

#### Running tests for group portlets ####
#### Finished tests for group portlets ####

#### Running tests for group z3c.autoinclude ####
#### Finished tests for group z3c.autoinclude ####

#### Running tests for AccessControl ####
#### Finished tests for AccessControl ####

#### Running tests for Products.CMFTestCase ####
#### Finished tests for Products.CMFTestCase ####

#### Running tests for Products.ExtendedPathIndex ####
#### Finished tests for Products.ExtendedPathIndex ####

#### Running tests for Products.PasswordResetTool ####
#### Finished tests for Products.PasswordResetTool ####

#### Running tests for Products.ResourceRegistries ####
#### Finished tests for Products.ResourceRegistries ####

#### Running tests for Products.TinyMCE ####
#### Finished tests for Products.TinyMCE ####

#### Running tests for Products.contentmigration ####
#### Finished tests for Products.contentmigration ####

#### Running tests for Products.i18ntestcase ####
#### Finished tests for Products.i18ntestcase ####

#### Running tests for archetypes.referencebrowserwidget ####
#### Finished tests for archetypes.referencebrowserwidget ####

#### Running tests for archetypes.schemaextender ####
#### Finished tests for archetypes.schemaextender ####

#### Running tests for collective.monkeypatcher ####
#### Finished tests for collective.monkeypatcher ####

#### Running tests for collective.z3cform.datetimewidget ####
#### Finished tests for collective.z3cform.datetimewidget ####

#### Running tests for five.customerize ####
#### Finished tests for five.customerize ####

#### Running tests for five.formlib ####
#### Finished tests for five.formlib ####

#### Running tests for kss.core ####
#### Finished tests for kss.core ####

#### Running tests for plone.app.blob ####
#### Finished tests for plone.app.blob ####

#### Running tests for plone.app.caching ####
#### Finished tests for plone.app.caching ####

#### Running tests for plone.app.discussion ####
#### Finished tests for plone.app.discussion ####

#### Running tests for plone.app.folder ####
#### Finished tests for plone.app.folder ####

#### Running tests for plone.app.imaging ####
#### Finished tests for plone.app.imaging ####

#### Running tests for plone.app.jquerytools ####
#### Finished tests for plone.app.jquerytools ####

#### Running tests for plone.app.linkintegrity ####
#### Finished tests for plone.app.linkintegrity ####

#### Running tests for plone.app.locales ####
#### Finished tests for plone.app.locales ####

#### Running tests for plone.app.registry ####
#### Finished tests for plone.app.registry ####

#### Running tests for plone.app.testing ####
#### Finished tests for plone.app.testing ####

#### Running tests for plone.app.users ####
#### Finished tests for plone.app.users ####

#### Running tests for plone.app.uuid ####
#### Finished tests for plone.app.uuid ####

#### Running tests for plone.app.z3cform ####
#### Finished tests for plone.app.z3cform ####

#### Running tests for plone.autoform ####
#### Finished tests for plone.autoform ####

#### Running tests for plone.cachepurging ####
#### Finished tests for plone.cachepurging ####

#### Running tests for plone.caching ####
#### Finished tests for plone.caching ####

#### Running tests for plone.folder ####
#### Finished tests for plone.folder ####

#### Running tests for plone.outputfilters ####
#### Finished tests for plone.outputfilt/home/stefan/autotest/temp/python26-zope213-cmf22-plone41/bin/test:262: DeprecationWarning: zope.testing.testrunner is deprecated in favour of zope.testrunner.
  import zope.testing.testrunner
/home/stefan/autotest/temp/python26-zope213-cmf22-plone41/eggs/zope.testing-3.9.6-py2.6.egg/zope/testing/testrunner/formatter.py:28: DeprecationWarning: zope.testing.exceptions is deprecated in favour of zope.testrunner.exceptions
  from zope.testing.exceptions import DocTestFailureException
/home/stefan/autotest/temp/python26-zope213-cmf22-plone41/eggs/plone.registry-1.0-py2.6.egg/plone/registry/tests.py:4: DeprecationWarning: zope.testing.doctestunit is deprecated in favour of the Python standard library doctest module
  from zope.testing import doctestunit
/home/stefan/autotest/temp/python26-zope213-cmf22-plone41/eggs/zope.testing-3.9.6-py2.6.egg/zope/testing/doctestunit.py:27: DeprecationWarning: zope.testing.doctest is deprecated in favour of the Python standard library doctest module
  from doctest import DocFileSuite, DocTestSuite
Running zope.testing.testrunner.layer.UnitTests tests:
  Set up zope.testing.testrunner.layer.UnitTests in 0.000 seconds.
/home/stefan/autotest/temp/python26-zope213-cmf22-plone41/eggs/plone.registry-1.0-py2.6.egg/plone/registry/registry.py:274: DeprecationWarning: The Records persistent class is deprecated and should not be used.
  warnings.warn("The Records persistent class is deprecated and should not be used.", DeprecationWarning)
  Ran 112 tests with 0 failures and 0 errors in 0.057 seconds.
Tearing down left over layers:
  Tear down zope.testing.testrunner.layer.UnitTests in 0.000 seconds.
/home/stefan/autotest/temp/python26-zope213-cmf22-plone41/bin/test:262: DeprecationWarning: zope.testing.testrunner is deprecated in favour of zope.testrunner.
  import zope.testing.testrunner
/home/stefan/autotest/temp/python26-zope213-cmf22-plone41/eggs/zope.testing-3.9.6-py2.6.egg/zope/testing/testrunner/formatter.py:28: DeprecationWarning: zope.testing.exceptions is deprecated in favour of zope.testrunner.exceptions
  from zope.testing.exceptions import DocTestFailureException
Running zope.testing.testrunner.layer.UnitTests tests:
  Set up zope.testing.testrunner.layer.UnitTests in 0.000 seconds.
  Ran 33 tests with 0 failures and 0 errors in 0.114 seconds.
Tearing down left over layers:
  Tear down zope.testing.testrunner.layer.UnitTests in 0.000 seconds.
/home/stefan/autotest/temp/python26-zope213-cmf22-plone41/bin/test:262: DeprecationWarning: zope.testing.testrunner is deprecated in favour of zope.testrunner.
  import zope.testing.testrunner
/home/stefan/autotest/temp/python26-zope213-cmf22-plone41/eggs/zope.testing-3.9.6-py2.6.egg/zope/testing/testrunner/formatter.py:28: DeprecationWarning: zope.testing.exceptions is deprecated in favour of zope.testrunner.exceptions
  from zope.testing.exceptions import DocTestFailureException
/home/stefan/autotest/temp/python26-zope213-cmf22-plone41/eggs/plone.stringinterp-1.0.4-py2.6.egg/plone/stringinterp/tests/stringinterpTestCase.py:5: DeprecationWarning: Browser is deprecated. Please import from Testing.testbrowser
  from Products.Five.testbrowser import Browser
Running Products.PloneTestCase.layer.PloneSite tests:
  Set up Testing.ZopeTestCase.layer.ZopeLite in 1.400 seconds.
  Set up Products.PloneTestCase.layer.ZCML in 3.329 seconds.
  Set up Products.PloneTestCase.layer.PloneSite/home/stefan/autotest/temp/python26-zope213-cmf22-plone41/eggs/plone.stringinterp-1.0.4-py2.6.egg/plone/stringinterp/tests/stringinterpTestCase.py:19: DeprecationWarning: load_config is deprecated. Please import from Zope2.App.zcml
  zcml.load_config('configure.zcml', plone.stringinterp)
 in 4.516 seconds.
  Ran 2 tests with 0 failures and 0 errors in 0.430 seconds.
Tearing down left over layers:
  Tear down Products.PloneTestCase.layer.PloneSite in 0.172 seconds.
  Tear down Products.PloneTestCase.layer.ZCML in 0.004 seconds.
  Tear down Testing.ZopeTestCase.layer.ZopeLite in 0.000 seconds.
/home/stefan/autotest/temp/python26-zope213-cmf22-plone41/bin/test:262: DeprecationWarning: zope.testing.testrunner is deprecated in favour of zope.testrunner.
  import zope.testing.testrunner
/home/stefan/autotest/temp/python26-zope213-cmf22-plone41/eggs/zope.testing-3.9.6-py2.6.egg/zope/testing/testrunner/formatter.py:28: DeprecationWarning: zope.testing.exceptions is deprecated in favour of zope.testrunner.exceptions
  from zope.testing.exceptions import DocTestFailureException
Running zope.testing.testrunner.layer.UnitTests tests:
  Set up zope.testing.testrunner.layer.UnitTests in 0.000 seconds.
  Ran 16 tests with 0 failures and 0 errors in 0.320 seconds.
Tearing down left over layers:
  Tear down zope.testing.testrunner.layer.UnitTests in 0.000 seconds.
/home/stefan/autotest/temp/python26-zope213-cmf22-plone41/bin/test:262: DeprecationWarning: zope.testing.testrunner is deprecated in favour of zope.testrunner.
  import zope.testing.testrunner
/home/stefan/autotest/temp/python26-zope213-cmf22-plone41/eggs/zope.testing-3.9.6-py2.6.egg/zope/testing/testrunner/formatter.py:28: DeprecationWarning: zope.testing.exceptions is deprecated in favour of zope.testrunner.exceptions
  from zope.testing.exceptions import DocTestFailureException
Test-module import failures:

Module: plone.testing.tests

IOError: [Errno 2] No such file or directory: '/home/stefan/autotest/temp/python26-zope213-cmf22-plone41/eggs/plone.testing-4.0-py2.6.egg/plone/testing/../../../README.txt'



Test-modules with import problems:
  plone.testing.tests
Total: 0 tests, 0 failures, 0 errors in 0.000 seconds.
/home/stefan/autotest/temp/python26-zope213-cmf22-plone41/bin/test:262: DeprecationWarning: zope.testing.testrunner is deprecated in favour of zope.testrunner.
  import zope.testing.testrunner
/home/stefan/autotest/temp/python26-zope213-cmf22-plone41/eggs/zope.testing-3.9.6-py2.6.egg/zope/testing/testrunner/formatter.py:28: DeprecationWarning: zope.testing.exceptions is deprecated in favour of zope.testrunner.exceptions
  from zope.testing.exceptions import DocTestFailureException
Running plone.testing.zca.UnitTesting tests:
  Set up plone.testing.zca.UnitTesting in 0.000 seconds.
  Ran 11 tests with 0 failures and 0 errors in 0.009 seconds.
Running zope.testing.testrunner.layer.UnitTests tests:
  Tear down plone.testing.zca.UnitTesting in 0.000 seconds.
  Set up zope.testing.testrunner.layer.UnitTests in 0.000 seconds.
  Ran 12 tests with 0 failures and 0 errors in 0.005 seconds.
Tearing down left over layers:
  Tear down zope.testing.testrunner.layer.UnitTests in 0.000 seconds.
Total: 23 tests, 0 failures, 0 errors in 0.083 seconds.
/home/stefan/autotest/temp/python26-zope213-cmf22-plone41/bin/test:262: DeprecationWarning: zope.testing.testrunner is deprecated in favour of zope.testrunner.
  import zope.testing.testrunner
/home/stefan/autotest/temp/python26-zope213-cmf22-plone41/eggs/zope.testing-3.9.6-py2.6.egg/zope/testing/testrunner/formatter.py:28: DeprecationWarning: zope.testing.exceptions is deprecated in favour of zope.testrunner.exceptions
  from zope.testing.exceptions import DocTestFailureException
Running zope.testing.testrunner.layer.UnitTests tests:
  Set up zope.testing.testrunner.layer.UnitTests in 0.000 seconds.
  Ran 6 tests with 0 failures and 0 errors in 0.759 seconds.
Tearing down left over layers:
  Tear down zope.testing.testrunner.layer.UnitTests in 0.000 seconds.
/home/stefan/autotest/temp/python26-zope213-cmf22-plone41/bin/test:262: DeprecationWarning: zope.testing.testrunner is deprecated in favour of zope.testrunner.
  import zope.testing.testrunner
/home/stefan/autotest/temp/python26-zope213-cmf22-plone41/eggs/zope.testing-3.9.6-py2.6.egg/zope/testing/testrunner/formatter.py:28: DeprecationWarning: zope.testing.exceptions is deprecated in favour of zope.testrunner.exceptions
  from zope.testing.exceptions import DocTestFailureException
Running plone.z3cform.testing_zcml_layer tests:
  Set up plone.z3cform.testing_zcml_layer in 0.321 seconds.
  Ran 4 tests with 0 failures and 0 errors in 0.277 seconds.
Running zope.testing.testrunner.layer.UnitTests tests:
  Tear down plone.z3cform.testing_zcml_layer ... not supported
  Running in a subprocess.
  Set up zope.testing.testrunner.layer.UnitTests in 0.000 seconds.
  Ran 3 tests with 0 failures and 0 errors in 0.771 seconds.
  Tear down zope.testing.testrunner.layer.UnitTests in 0.000 seconds.
Total: 7 tests, 0 failures, 0 errors in 4.154 seconds.
/home/stefan/autotest/temp/python26-zope213-cmf22-plone41/bin/test:262: DeprecationWarning: zope.testing.testrunner is deprecated in favour of zope.testrunner.
  import zope.testing.testrunner
/home/stefan/autotest/temp/python26-zope213-cmf22-plone41/eggs/zope.testing-3.9.6-py2.6.egg/zope/testing/testrunner/formatter.py:28: DeprecationWarning: zope.testing.exceptions is deprecated in favour of zope.testrunner.exceptions
  from zope.testing.exceptions import DocTestFailureException
Total: 0 tests, 0 failures, 0 errors in 0.000 seconds.
/home/stefan/autotest/temp/python26-zope213-cmf22-plone41/bin/test:262: DeprecationWarning: zope.testing.testrunner is deprecated in favour of zope.testrunner.
  import zope.testing.testrunner
/home/stefan/autotest/temp/python26-zope213-cmf22-plone41/eggs/zope.testing-3.9.6-py2.6.egg/zope/testing/testrunner/formatter.py:28: DeprecationWarning: zope.testing.exceptions is deprecated in favour of zope.testrunner.exceptions
  from zope.testing.exceptions import DocTestFailureException
/home/stefan/autotest/temp/python26-zope213-cmf22-plone41/eggs/plonetheme.sunburst-1.1.4-py2.6.egg/plonetheme/sunburst/tests/base.py:6: DeprecationWarning: Browser is deprecated. Please import from Testing.testbrowser
  from Products.Five.testbrowser import Browser
Running plonetheme.sunburst.tests.base.Layer tests:
  Set up Testing.ZopeTestCase.layer.ZopeLite in 1.417 seconds.
  Set up Products.PloneTestCase.layer.ZCML in 3.431 seconds.
  Set up Products.PloneTestCase.layer.PloneSite in 4.521 seconds.
  Set up collective.testcaselayer.ptc.PTCLayer in 0.024 seconds.
  Set up plonetheme.sunburst.tests.base.Layer/home/stefan/autotest/temp/python26-zope213-cmf22-plone41/eggs/plonetheme.sunburst-1.1.4-py2.6.egg/plonetheme/sunburst/tests/base.py:18: DeprecationWarning: load_config is deprecated. Please import from Zope2.App.zcml
  zcml.load_config('configure.zcml', package=sunburst)
 in 0.006 seconds.
/home/stefan/autotest/temp/python26-zope213-cmf22-plone41/eggs/plonetheme.sunburst-1.1.4-py2.6.egg/plonetheme/sunburst/README.txt:1: DeprecationWarning: load_string is deprecated. Please import from Zope2.App.zcml
  Detailed documentation
  Ran 3 tests with 0 failures and 0 errors in 1.235 seconds.
Tearing down left over layers:
  Tear down plonetheme.sunburst.tests.base.Layer in 0.000 seconds.
  Tear down collective.testcaselayer.ptc.PTCLayer in 0.000 seconds.
  Tear down Products.PloneTestCase.layer.PloneSite in 0.180 seconds.
  Tear down Products.PloneTestCase.layer.ZCML in 0.004 seconds.
  Tear down Testing.ZopeTestCase.layer.ZopeLite in 0.000 seconds.
/home/stefan/autotest/temp/python26-zope213-cmf22-plone41/bin/test:262: DeprecationWarning: zope.testing.testrunner is deprecated in favour of zope.testrunner.
  import zope.testing.testrunner
/home/stefan/autotest/temp/python26-zope213-cmf22-plone41/eggs/zope.testing-3.9.6-py2.6.egg/zope/testing/testrunner/formatter.py:28: DeprecationWarning: zope.testing.exceptions is deprecated in favour of zope.testrunner.exceptions
  from zope.testing.exceptions import DocTestFailureException
Total: 0 tests, 0 failures, 0 errors in 0.000 seconds.
/home/stefan/autotest/temp/python26-zope213-cmf22-plone41/bin/test:262: DeprecationWarning: zope.testing.testrunner is deprecated in favour of zope.testrunner.
  import zope.testing.testrunner
/home/stefan/autotest/temp/python26-zope213-cmf22-plone41/eggs/zope.testing-3.9.6-py2.6.egg/zope/testing/testrunner/formatter.py:28: DeprecationWarning: zope.testing.exceptions is deprecated in favour of zope.testrunner.exceptions
  from zope.testing.exceptions import DocTestFailureException
/home/stefan/autotest/temp/python26-zope213-cmf22-plone41/eggs/wicked-1.1.9-py2.6.egg/wicked/utils.py:223: DeprecationWarning: zope.testing.doctest is deprecated in favour of the Python standard library doctest module
  from zope.testing import doctest
Running Products.PloneTestCase.layer.ZCML tests:
  Set up Testing.ZopeTestCase.layer.ZopeLite in 0.842 seconds.
  Set up Products.PloneTestCase.layer.ZCML in 3.361 seconds.
  Ran 3 tests with 0 failures and 0 errors in 0.037 seconds.
Running wicked.at.tests.wickedtestcase.WickedSite tests:
  Set up Products.PloneTestCase.layer.PloneSite/home/stefan/autotest/temp/python26-zope213-cmf22-plone41/eggs/wicked-1.1.9-py2.6.egg/wicked/at/tests/wickedtestcase.py:19: DeprecationWarning: load_config is deprecated. Please import from Zope2.App.zcml
  zcml.load_config("configure.zcml", package=wicked.atcontent)
 in 5.285 seconds.
  Set up wicked.at.tests.wickedtestcase.WickedSite in 0.002 seconds.
  Ran 23 tests with 0 failures and 0 errors in 5.321 seconds.
Running wicked.at.tests.test_scope.Scoped tests:
  Set up wicked.at.tests.test_scope.Scoped in 0.001 seconds.
  Ran 3 tests with 0 failures and 0 errors in 0.599 seconds.
Running wicked.plone.tests.SelectiveATCT tests:
  Tear down wicked.at.tests.test_scope.Scoped in 0.000 seconds.
  Tear down wicked.at.tests.wickedtestcase.WickedSite in 0.002 seconds.
  Set up wicked.plone.tests.SelectiveATCT in 0.003 seconds.
  Ran 22 tests with 0 failures and 0 errors in 6.616 seconds.
Running wicked.plone.tests.ZCMLLayer tests:
  Tear down wicked.plone.tests.SelectiveATCT in 0.004 seconds.
  Set up wicked.plone.tests.ZCMLLayer in 0.019 seconds.
  Ran 2 tests with 0 failures and 0 errors in 0.626 seconds.
Running zope.testing.testrunner.layer.UnitTests tests:
  Tear down wicked.plone.tests.ZCMLLayer in 0.194 seconds.
  Tear down Products.PloneTestCase.layer.PloneSite in 0.001 seconds.
  Tear down Products.PloneTestCase.layer.ZCML in 0.004 seconds.
  Tear down Testing.ZopeTestCase.layer.ZopeLite in 0.000 seconds.
  Set up zope.testing.testrunner.layer.UnitTests in 0.000 seconds.
  Ran 34 tests with 0 failures and 0 errors in 0.017 seconds.
Tearing down left over layers:
  Tear down zope.testing.testrunner.layer.UnitTests in 0.000 seconds.
Total: 87 tests, 0 failures, 0 errors in 24.291 seconds.
/home/stefan/autotest/temp/python26-zope213-cmf22-plone41/bin/test:262: DeprecationWarning: zope.testing.testrunner is deprecated in favour of zope.testrunner.
  import zope.testing.testrunner
/home/stefan/autotest/temp/python26-zope213-cmf22-plone41/eggs/zope.testing-3.9.6-py2.6.egg/zope/testing/testrunner/formatter.py:28: DeprecationWarning: zope.testing.exceptions is deprecated in favour of zope.testrunner.exceptions
  from zope.testing.exceptions import DocTestFailureException
Running zope.testing.testrunner.layer.UnitTests tests:
  Set up zope.testing.testrunner.layer.UnitTests in 0.000 seconds.
  Ran 2 tests with 0 failures and 0 errors in 0.015 seconds.
Tearing down left over layers:
  Tear down zope.testing.testrunner.layer.UnitTests in 0.000 seconds.
/home/stefan/autotest/temp/python26-zope213-cmf22-plone41/bin/test:262: DeprecationWarning: zope.testing.testrunner is deprecated in favour of zope.testrunner.
  import zope.testing.testrunner
/home/stefan/autotest/temp/python26-zope213-cmf22-plone41/eggs/zope.testing-3.9.6-py2.6.egg/zope/testing/testrunner/formatter.py:28: DeprecationWarning: zope.testing.exceptions is deprecated in favour of zope.testrunner.exceptions
  from zope.testing.exceptions import DocTestFailureException
Running zope.testing.testrunner.layer.UnitTests tests:
  Set up zope.testing.testrunner.layer.UnitTests in 0.000 seconds.
  Ran 38 tests with 0 failures and 0 errors in 3.919 seconds.
Tearing down left over layers:
  Tear down zope.testing.testrunner.layer.UnitTests in 0.000 seconds.
/home/stefan/autotest/temp/python26-zope213-cmf22-plone41/bin/test:262: DeprecationWarning: zope.testing.testrunner is deprecated in favour of zope.testrunner.
  import zope.testing.testrunner
/home/stefan/autotest/temp/python26-zope213-cmf22-plone41/eggs/zope.testing-3.9.6-py2.6.egg/zope/testing/testrunner/formatter.py:28: DeprecationWarning: zope.testing.exceptions is deprecated in favour of zope.testrunner.exceptions
  from zope.testing.exceptions import DocTestFailureException
/home/stefan/autotest/temp/python26-zope213-cmf22-plone41/eggs/z3c.formwidget.query-0.5-py2.6.egg/z3c/formwidget/query/tests.py:4: DeprecationWarning: zope.testing.doctestunit is deprecated in favour of the Python standard library doctest module
  from zope.testing import doctestunit
/home/stefan/autotest/temp/python26-zope213-cmf22-plone41/eggs/zope.testing-3.9.6-py2.6.egg/zope/testing/doctestunit.py:27: DeprecationWarning: zope.testing.doctest is deprecated in favour of the Python standard library doctest module
  from doctest import DocFileSuite, DocTestSuite
Running zope.testing.testrunner.layer.UnitTests tests:
  Set up zope.testing.testrunner.layer.UnitTests in 0.000 seconds.
  Ran 25 tests with 0 failures and 0 errors in 0.399 seconds.
Tearing down left over layers:
  Tear down zope.testing.testrunner.layer.UnitTests in 0.000 seconds.
ers ####

#### Running tests for plone.registry ####
#### Finished tests for plone.registry ####

#### Running tests for plone.scale ####
#### Finished tests for plone.scale ####

#### Running tests for plone.stringinterp ####
#### Finished tests for plone.stringinterp ####

#### Running tests for plone.supermodel ####
#### Finished tests for plone.supermodel ####

#### Running tests for plone.testing ####
#### Finished tests for plone.testing ####

#### Running tests for plone.transformchain ####
#### Finished tests for plone.transformchain ####

#### Running tests for plone.uuid ####
#### Finished tests for plone.uuid ####

#### Running tests for plone.z3cform ####
#### Finished tests for plone.z3cform ####

#### Running tests for plonetheme.classic ####
#### Finished tests for plonetheme.classic ####

#### Running tests for plonetheme.sunburst ####
#### Finished tests for plonetheme.sunburst ####

#### Running tests for rdflib ####
#### Finished tests for rdflib ####

#### Running tests for wicked ####
#### Finished tests for wicked ####

#### Running tests for z3c.batching ####
#### Finished tests for z3c.batching ####

#### Running tests for z3c.form ####
#### Finished tests for z3c.form ####

#### Running tests for z3c.formwidget.query ####
#### Finished tests for z3c.formwidget.query ####

Packages with test failures:

Failing tests in group Plone
Failing tests in plone.testing

Total time elapsed: 1306.505 seconds

Grand total: 108 packages, 2 failures


FAILED (108 packages, 2 failures)


More information about the Testbot mailing list