[Testbot] FAILED (113 packages, 8 failures) : Plone-4.1 Zope-2.13 Python-2.6.5

Plone Tests plone-tests at epy.co.at
Sun Jan 30 08:05:59 UTC 2011


Plone Tests : FAILED (113 packages, 8 failures)
Plone-4.1 Zope-2.13 Python-2.6.5

Running ./bin/alltests -q --no-color --no-progress
/home/stefan/autotest/temp/python26-zope213-cmf22-plone41/eggs/Products.CMFCore-2.2.2-py2.6.egg/Products/CMFCore/FSObject.py:21: DeprecationWarning: RoleManager is deprecated. RoleManager is no longer part of AccessControl, please depend on Zope2 and import from OFS.role or use the new minimal RoleManager class from AccessControl.rolemanager.
  from AccessControl.Role import RoleManager
Running Products.CMFTestCase.layer.CMFSite tests:
  Set up Testing.ZopeTestCase.layer.ZopeLite in 1.009 seconds.
  Set up Products.CMFTestCase.layer.ZCML/home/stefan/autotest/temp/python26-zope213-cmf22-plone41/eggs/zope.configuration-3.7.2-py2.6.egg/zope/configuration/fields.py:419: UserWarning: You did not specify an i18n translation domain for the 'title' field in /home/stefan/autotest/temp/python26-zope213-cmf22-plone41/eggs/Products.kupu-1.5.0b1-py2.6.egg/Products/kupu/plone/configure.zcml
  "'%s' field in %s" % (self.getName(), context.info.file )
/home/stefan/autotest/temp/python26-zope213-cmf22-plone41/eggs/zope.configuration-3.7.2-py2.6.egg/zope/configuration/fields.py:419: UserWarning: You did not specify an i18n translation domain for the 'description' field in /home/stefan/autotest/temp/python26-zope213-cmf22-plone41/eggs/Products.kupu-1.5.0b1-py2.6.egg/Products/kupu/plone/configure.zcml
  "'%s' field in %s" % (self.getName(), context.info.file )
 in 4.123 seconds.
  Set up Products.CMFTestCase.layer.CMFSite/home/stefan/autotest/temp/python26-zope213-cmf22-plone41/eggs/Products.GenericSetup-1.6.1-py2.6.egg/Products/GenericSetup/utils.py:123: DeprecationWarning: UserFolder is deprecated. User folders are no longer part of AccessControl, please depend on Zope2 and import from OFS.userfolder or use the new minimal user folder classes from AccessControl.userfolder.
  obj = getattr( obj, part )
 in 1.480 seconds.
/home/stefan/autotest/temp/python26-zope213-cmf22-plone41/eggs/Products.CMFDynamicViewFTI-4.0-py2.6.egg/Products/CMFDynamicViewFTI/tests/test_browserdefault.py:44: DeprecationWarning: load_config is deprecated. Please import from Zope2.App.zcml
  zcml.load_config('configure.zcml', plone.app.contentmenu)
  Ran 31 tests with 0 failures and 0 errors in 0.524 seconds.
Running Products.PloneTestCase.layer.PloneSite tests:
  Tear down Products.CMFTestCase.layer.CMFSite in 0.032 seconds.
  Tear down Products.CMFTestCase.layer.ZCML in 0.004 seconds.
  Set up Products.PloneTestCase.layer.ZCML in 2.714 seconds.
  Set up Products.PloneTestCase.layer.PloneSite in 5.297 seconds.
/home/stefan/autotest/temp/python26-zope213-cmf22-plone41/src/Products.ZCatalog/src/Products/ZCatalog/ZCatalog.py:602: DeprecationWarning: Your query None produced no query restriction. Currently the entire catalog content is returned. In Zope 2.14 this will result in an empty LazyCat to be returned.
  return self._catalog.searchResults(REQUEST, used, **kw)
  Ran 614 tests with 0 failures and 0 errors in 1 minutes 22.768 seconds.
Tearing down left over layers:
  Tear down Products.PloneTestCase.layer.PloneSite in 0.199 seconds.
  Tear down Products.PloneTestCase.layer.ZCML in 0.011 seconds.
  Tear down Testing.ZopeTestCase.layer.ZopeLite in 0.000 seconds.
Total: 645 tests, 0 failures, 0 errors in 1 minutes 38.707 seconds.
/home/stefan/autotest/temp/python26-zope213-cmf22-plone41/eggs/Products.CMFCore-2.2.2-py2.6.egg/Products/CMFCore/FSObject.py:21: DeprecationWarning: RoleManager is deprecated. RoleManager is no longer part of AccessControl, please depend on Zope2 and import from OFS.role or use the new minimal RoleManager class from AccessControl.rolemanager.
  from AccessControl.Role import RoleManager
/home/stefan/autotest/temp/python26-zope213-cmf22-plone41/eggs/zope.configuration-3.7.2-py2.6.egg/zope/configuration/fields.py:419: UserWarning: You did not specify an i18n translation domain for the 'title' field in /home/stefan/autotest/temp/python26-zope213-cmf22-plone41/eggs/Products.kupu-1.5.0b1-py2.6.egg/Products/kupu/plone/configure.zcml
  "'%s' field in %s" % (self.getName(), context.info.file )
/home/stefan/autotest/temp/python26-zope213-cmf22-plone41/eggs/zope.configuration-3.7.2-py2.6.egg/zope/configuration/fields.py:419: UserWarning: You did not specify an i18n translation domain for the 'description' field in /home/stefan/autotest/temp/python26-zope213-cmf22-plone41/eggs/Products.kupu-1.5.0b1-py2.6.egg/Products/kupu/plone/configure.zcml
  "'%s' field in %s" % (self.getName(), context.info.file )
/home/stefan/autotest/temp/python26-zope213-cmf22-plone41/eggs/Products.i18ntestcase-1.2-py2.6.egg/Products/i18ntestcase/PotTestCase.py:13: DeprecationWarning: The popen2 module is deprecated.  Use the subprocess module.
  from popen2 import popen4
/home/stefan/autotest/temp/python26-zope213-cmf22-plone41/eggs/Products.kupu-1.5.0b1-py2.6.egg/Products/kupu/plone/tests/TestContent.py:4: DeprecationWarning: Products.ATReferenceBrowserWidget.ATReferenceBrowserWidget has moved to archetypes.referencebrowserwidget.widget. Import of Products.ATReferenceBrowserWidget.ATReferenceBrowserWidget will become unsupported in Plone 5.0
  from Products.ATReferenceBrowserWidget.ATReferenceBrowserWidget import ReferenceBrowserWidget
Running Testing.ZopeTestCase.layer.ZopeLite tests:
  Set up Testing.ZopeTestCase.layer.ZopeLite in 0.000 seconds.
  Ran 3 tests with 0 failures and 0 errors in 0.010 seconds.
Running Products.PloneTestCase.layer.PloneSite tests:
  Set up Products.PloneTestCase.layer.ZCML in 2.688 seconds.
  Set up Products.PloneTestCase.layer.PloneSite/home/stefan/autotest/temp/python26-zope213-cmf22-plone41/eggs/Products.kupu-1.5.0b1-py2.6.egg/Products/kupu/plone/util.py:29: DeprecationWarning: minimalpath() is deprecated and will be removed in CMF 2.3.
  kupu_plone_skin_dir = minimalpath(os.path.join(kupu_package_dir, relpath))
/home/stefan/autotest/temp/python26-zope213-cmf22-plone41/eggs/Products.kupu-1.5.0b1-py2.6.egg/Products/kupu/plone/util.py:30: DeprecationWarning: createDirectoryView() called with deprecated reg_key format. Support for old key formats will be removed in CMF 2.3. Please use the new key format <product>:<subdir> instead.
  createDirectoryView(skinstool, kupu_plone_skin_dir, name)
<string>:207: DeprecationWarning: changeSkin should be called with 'REQUEST' as second argument. The BBB code will be removed in CMF 2.3.
/home/stefan/autotest/temp/python26-zope213-cmf22-plone41/eggs/Products.kupu-1.5.0b1-py2.6.egg/Products/kupu/plone/tests/kuputestcase.py:26: DeprecationWarning: load_config is deprecated. Please import from Zope2.App.zcml
  zcml.load_config('configure.zcml', Products.kupu.plone)
 in 5.462 seconds.
/home/stefan/autotest/temp/python26-zope213-cmf22-plone41/src/Products.CMFPlacefulWorkflow/Products/CMFPlacefulWorkflow/tests/policy_form.txt:1: DeprecationWarning: Browser is deprecated. Please import from Testing.testbrowser
  ;-*-Doctest-*-
/home/stefan/autotest/temp/python26-zope213-cmf22-plone41/eggs/Products.kupu-1.5.0b1-py2.6.egg/Products/kupu/plone/plonedrawers.py:224: DeprecationWarning: getIcon() is deprecated and provides only limited backwards compatibility. It will be removed in CMF 2.4. Please use getIconExprObject() instead.
  return "%s/%s" % (self.base, type.getIcon())


Failure in test test_baselineReferencesMaintained (plone.app.iterate.tests.test_iterate.TestIterations)
Traceback (most recent call last):
  File "/usr/local/python2.6/lib/python2.6/unittest.py", line 279, in run
    testMethod()
  File "/home/stefan/autotest/temp/python26-zope213-cmf22-plone41/eggs/plone.app.iterate-2.1a1-py2.6.egg/plone/app/iterate/tests/test_iterate.py", line 155, in test_baselineReferencesMaintained
    self.assertEqual( len(doc.getReferences()), 1 )
  File "/usr/local/python2.6/lib/python2.6/unittest.py", line 350, in failUnlessEqual
    (msg or '%r != %r' % (first, second))
AssertionError: 2 != 1

  Ran 390 tests with 1 failures and 0 errors in 23.005 seconds.
Running Products.CMFPlacefulWorkflow.tests.test_exportimport.ExportImportLayer tests:
  Set up Products.CMFPlacefulWorkflow.tests.test_exportimport.ExportImportLayer in 0.001 seconds.
  Ran 1 tests with 0 failures and 0 errors in 1.011 seconds.
Running zope.testing.testrunner.layer.UnitTests tests:
  Tear down Products.CMFPlacefulWorkflow.tests.test_exportimport.ExportImportLayer in 0.000 seconds.
  Tear down Products.PloneTestCase.layer.PloneSite in 0.207 seconds.
  Tear down Products.PloneTestCase.layer.ZCML in 0.009 seconds.
  Tear down Testing.ZopeTestCase.layer.ZopeLite in 0.000 seconds.
  Set up zope.testing.testrunner.layer.UnitTests in 0.000 seconds.
Generated checkid_setup request to http://www.myopenid.com/server with assocication {HMAC-SHA1}{4d45115d}{wywg8Q==}
Generated checkid_setup request to http://www.myopenid.com/server with assocication {HMAC-SHA1}{4d45115e}{3cRv5g==}
  Ran 19 tests with 0 failures and 0 errors in 1.784 seconds.
Tearing down left over layers:
  Tear down zope.testing.testrunner.layer.UnitTests in 0.000 seconds.
Total: 413 tests, 1 failures, 0 errors in 35.199 seconds.
/home/stefan/autotest/temp/python26-zope213-cmf22-plone41/eggs/Products.CMFCore-2.2.2-py2.6.egg/Products/CMFCore/FSObject.py:21: DeprecationWarning: RoleManager is deprecated. RoleManager is no longer part of AccessControl, please depend on Zope2 and import from OFS.role or use the new minimal RoleManager class from AccessControl.rolemanager.
  from AccessControl.Role import RoleManager
Running Testing.ZopeTestCase.layer.ZopeLite tests:
  Set up Testing.ZopeTestCase.layer.ZopeLite in 0.739 seconds.
/home/stefan/autotest/temp/python26-zope213-cmf22-plone41/bin/test:1: DeprecationWarning: load_config is deprecated. Please import from Zope2.App.zcml
  #!/usr/local/python2.6/bin/python
  Ran 9 tests with 0 failures and 0 errors in 0.094 seconds.
Running Products.Archetypes.tests.layer.ZCML tests:
  Set up Products.CMFCore.testing.FunctionalZCMLLayer in 0.232 seconds.
  Set up Products.Archetypes.tests.layer.ZCML in 0.210 seconds.
  Ran 59 tests with 0 failures and 0 errors in 3.852 seconds.
Running Products.Archetypes.tests.layer.ArchetypesSite tests:
  Set up Products.Archetypes.tests.layer.ArchetypesSite/home/stefan/autotest/temp/python26-zope213-cmf22-plone41/eggs/Products.GenericSetup-1.6.1-py2.6.egg/Products/GenericSetup/utils.py:123: DeprecationWarning: UserFolder is deprecated. User folders are no longer part of AccessControl, please depend on Zope2 and import from OFS.userfolder or use the new minimal user folder classes from AccessControl.userfolder.
  obj = getattr( obj, part )
 in 1.443 seconds.
/home/stefan/autotest/temp/python26-zope213-cmf22-plone41/src/Products.ZCatalog/src/Products/ZCatalog/ZCatalog.py:602: DeprecationWarning: Your query None produced no query restriction. Currently the entire catalog content is returned. In Zope 2.14 this will result in an empty LazyCat to be returned.
  return self._catalog.searchResults(REQUEST, used, **kw)
  Ran 461 tests with 0 failures and 0 errors in 35.312 seconds.
Running Products.PloneTestCase.layer.PloneSite tests:
  Tear down Products.Archetypes.tests.layer.ArchetypesSite in 0.039 seconds.
  Tear down Products.Archetypes.tests.layer.ZCML in 0.005 seconds.
  Tear down Products.CMFCore.testing.FunctionalZCMLLayer in 0.000 seconds.
  Set up Products.PloneTestCase.layer.ZCML/home/stefan/autotest/temp/python26-zope213-cmf22-plone41/eggs/zope.configuration-3.7.2-py2.6.egg/zope/configuration/fields.py:419: UserWarning: You did not specify an i18n translation domain for the 'title' field in /home/stefan/autotest/temp/python26-zope213-cmf22-plone41/eggs/Products.kupu-1.5.0b1-py2.6.egg/Products/kupu/plone/configure.zcml
  "'%s' field in %s" % (self.getName(), context.info.file )
/home/stefan/autotest/temp/python26-zope213-cmf22-plone41/eggs/zope.configuration-3.7.2-py2.6.egg/zope/configuration/fields.py:419: UserWarning: You did not specify an i18n translation domain for the 'description' field in /home/stefan/autotest/temp/python26-zope213-cmf22-plone41/eggs/Products.kupu-1.5.0b1-py2.6.egg/Products/kupu/plone/configure.zcml
  "'%s' field in %s" % (self.getName(), context.info.file )
 in 3.412 seconds.
  Set up Products.PloneTestCase.layer.PloneSite in 4.451 seconds.
  Ran 10 tests with 0 failures and 0 errors in 1.650 seconds.
Running plone.app.kss.tests.kss_and_plone_layer.KSSAndPloneLayer tests:
  Set up plone.app.kss.tests.kss_and_plone_layer.KSSAndPloneLayer in 0.005 seconds.
  Ran 19 tests with 0 failures and 0 errors in 1.885 seconds.
Running zope.testing.testrunner.layer.UnitTests tests:
  Tear down plone.app.kss.tests.kss_and_plone_layer.KSSAndPloneLayer in 0.000 seconds.
  Tear down Products.PloneTestCase.layer.PloneSite in 0.191 seconds.
  Tear down Products.PloneTestCase.layer.ZCML in 0.006 seconds.
  Tear down Testing.ZopeTestCase.layer.ZopeLite in 0.000 seconds.
  Set up zope.testing.testrunner.layer.UnitTests in 0.000 seconds.
  Ran 25 tests with 0 failures and 0 errors in 0.108 seconds.
Tearing down left over layers:
  Tear down zope.testing.testrunner.layer.UnitTests in 0.000 seconds.
Total: 583 tests, 0 failures, 0 errors in 55.085 seconds.
/home/stefan/autotest/temp/python26-zope213-cmf22-plone41/eggs/Products.CMFCore-2.2.2-py2.6.egg/Products/CMFCore/FSObject.py:21: DeprecationWarning: RoleManager is deprecated. RoleManager is no longer part of AccessControl, please depend on Zope2 and import from OFS.role or use the new minimal RoleManager class from AccessControl.rolemanager.
  from AccessControl.Role import RoleManager
Running Testing.ZopeTestCase.layer.ZopeLite tests:
  Set up Testing.ZopeTestCase.layer.ZopeLite in 0.083 seconds.


Failure in test /home/stefan/autotest/temp/python26-zope213-cmf22-plone41/eggs/five.localsitemanager-2.0.4-py2.6.egg/five/localsitemanager/browser.txt
Traceback (most recent call last):
  File "/usr/local/python2.6/lib/python2.6/unittest.py", line 279, in run
    testMethod()
  File "/usr/local/python2.6/lib/python2.6/doctest.py", line 2152, in runTest
    raise self.failureException(self.format_failure(new.getvalue()))
AssertionError: Failed doctest test for browser.txt
  File "/home/stefan/autotest/temp/python26-zope213-cmf22-plone41/eggs/five.localsitemanager-2.0.4-py2.6.egg/five/localsitemanager/browser.txt", line 0

----------------------------------------------------------------------
File "/home/stefan/autotest/temp/python26-zope213-cmf22-plone41/eggs/five.localsitemanager-2.0.4-py2.6.egg/five/localsitemanager/browser.txt", line 37, in browser.txt
Failed example:
    uf._doAddUser('admin', 'admin', ['Manager'], [])
Differences (ndiff with -expected +actual):
    + <User 'admin'>


  Ran 228 tests with 1 failures and 0 errors in 1.279 seconds.
Running Products.CMFCalendar.testing.FunctionalLayer tests:
  Set up Products.CMFCore.testing.FunctionalZCMLLayer in 0.212 seconds.
  Set up Products.CMFCalendar.testing.FunctionalLayer/home/stefan/autotest/temp/python26-zope213-cmf22-plone41/eggs/Products.GenericSetup-1.6.1-py2.6.egg/Products/GenericSetup/utils.py:123: DeprecationWarning: UserFolder is deprecated. User folders are no longer part of AccessControl, please depend on Zope2 and import from OFS.userfolder or use the new minimal user folder classes from AccessControl.userfolder.
  obj = getattr( obj, part )
 in 0.336 seconds.


Failure in test /home/stefan/autotest/temp/python26-zope213-cmf22-plone41/eggs/Products.CMFCalendar-2.2.2-py2.6.egg/Products/CMFCalendar/browser/event.txt
Traceback (most recent call last):
  File "/usr/local/python2.6/lib/python2.6/unittest.py", line 279, in run
    testMethod()
  File "/usr/local/python2.6/lib/python2.6/doctest.py", line 2152, in runTest
    raise self.failureException(self.format_failure(new.getvalue()))
AssertionError: Failed doctest test for event.txt
  File "/home/stefan/autotest/temp/python26-zope213-cmf22-plone41/eggs/Products.CMFCalendar-2.2.2-py2.6.egg/Products/CMFCalendar/browser/event.txt", line 0

----------------------------------------------------------------------
File "/home/stefan/autotest/temp/python26-zope213-cmf22-plone41/eggs/Products.CMFCalendar-2.2.2-py2.6.egg/Products/CMFCalendar/browser/event.txt", line 9, in event.txt
Failed example:
    uf._doAddUser('mgr', 'mgrpw', ['Manager'], [])
Differences (ndiff with -expected +actual):
    + <User 'mgr'>


  Ran 20 tests with 1 failures and 0 errors in 1.423 seconds.
Running Products.CMFCore.testing.EventZCMLLayer tests:
  Tear down Products.CMFCalendar.testing.FunctionalLayer in 0.017 seconds.
  Tear down Products.CMFCore.testing.FunctionalZCMLLayer in 0.001 seconds.
  Set up Products.CMFCore.testing.EventZCMLLayer in 0.001 seconds.
  Ran 8 tests with 0 failures and 0 errors in 0.201 seconds.
Running Products.CMFCore.testing.ExportImportZCMLLayer tests:
  Tear down Products.CMFCore.testing.EventZCMLLayer in 0.000 seconds.
  Set up Products.CMFCore.testing.ExportImportZCMLLayer in 0.001 seconds.
  Ran 10 tests with 0 failures and 0 errors in 0.985 seconds.
Running Products.CMFCore.testing.TraversingEventZCMLLayer tests:
  Tear down Products.CMFCore.testing.ExportImportZCMLLayer in 0.000 seconds.
  Set up Products.CMFCore.testing.TraversingEventZCMLLayer in 0.001 seconds.
  Ran 5 tests with 0 failures and 0 errors in 0.164 seconds.
Running Products.CMFDefault.testing.FunctionalLayer tests:
  Tear down Products.CMFCore.testing.TraversingEventZCMLLayer in 0.000 seconds.
  Set up Products.CMFCore.testing.FunctionalZCMLLayer in 0.190 seconds.
  Set up Products.CMFDefault.testing.FunctionalLayer in 0.243 seconds.


Failure in test /home/stefan/autotest/temp/python26-zope213-cmf22-plone41/eggs/Products.CMFDefault-2.2.2-py2.6.egg/Products/CMFDefault/browser/tests/btreefolder.txt
Traceback (most recent call last):
  File "/usr/local/python2.6/lib/python2.6/unittest.py", line 279, in run
    testMethod()
  File "/usr/local/python2.6/lib/python2.6/doctest.py", line 2152, in runTest
    raise self.failureException(self.format_failure(new.getvalue()))
AssertionError: Failed doctest test for btreefolder.txt
  File "/home/stefan/autotest/temp/python26-zope213-cmf22-plone41/eggs/Products.CMFDefault-2.2.2-py2.6.egg/Products/CMFDefault/browser/tests/btreefolder.txt", line 0

----------------------------------------------------------------------
File "/home/stefan/autotest/temp/python26-zope213-cmf22-plone41/eggs/Products.CMFDefault-2.2.2-py2.6.egg/Products/CMFDefault/browser/tests/btreefolder.txt", line 7, in btreefolder.txt
Failed example:
    uf._doAddUser('mgr', 'mgrpw', ['Manager'], [])
Differences (ndiff with -expected +actual):
    + <User 'mgr'>




Failure in test /home/stefan/autotest/temp/python26-zope213-cmf22-plone41/eggs/Products.CMFDefault-2.2.2-py2.6.egg/Products/CMFDefault/browser/tests/document.txt
Traceback (most recent call last):
  File "/usr/local/python2.6/lib/python2.6/unittest.py", line 279, in run
    testMethod()
  File "/usr/local/python2.6/lib/python2.6/doctest.py", line 2152, in runTest
    raise self.failureException(self.format_failure(new.getvalue()))
AssertionError: Failed doctest test for document.txt
  File "/home/stefan/autotest/temp/python26-zope213-cmf22-plone41/eggs/Products.CMFDefault-2.2.2-py2.6.egg/Products/CMFDefault/browser/tests/document.txt", line 0

----------------------------------------------------------------------
File "/home/stefan/autotest/temp/python26-zope213-cmf22-plone41/eggs/Products.CMFDefault-2.2.2-py2.6.egg/Products/CMFDefault/browser/tests/document.txt", line 10, in document.txt
Failed example:
    uf._doAddUser('mgr', 'mgrpw', ['Manager'], [])
Differences (ndiff with -expected +actual):
    + <User 'mgr'>




Failure in test /home/stefan/autotest/temp/python26-zope213-cmf22-plone41/eggs/Products.CMFDefault-2.2.2-py2.6.egg/Products/CMFDefault/browser/tests/favorite.txt
Traceback (most recent call last):
  File "/usr/local/python2.6/lib/python2.6/unittest.py", line 279, in run
    testMethod()
  File "/usr/local/python2.6/lib/python2.6/doctest.py", line 2152, in runTest
    raise self.failureException(self.format_failure(new.getvalue()))
AssertionError: Failed doctest test for favorite.txt
  File "/home/stefan/autotest/temp/python26-zope213-cmf22-plone41/eggs/Products.CMFDefault-2.2.2-py2.6.egg/Products/CMFDefault/browser/tests/favorite.txt", line 0

----------------------------------------------------------------------
File "/home/stefan/autotest/temp/python26-zope213-cmf22-plone41/eggs/Products.CMFDefault-2.2.2-py2.6.egg/Products/CMFDefault/browser/tests/favorite.txt", line 7, in favorite.txt
Failed example:
    uf._doAddUser('mgr', 'mgrpw', ['Manager'], [])
Differences (ndiff with -expected +actual):
    + <User 'mgr'>




Failure in test /home/stefan/autotest/temp/python26-zope213-cmf22-plone41/eggs/Products.CMFDefault-2.2.2-py2.6.egg/Products/CMFDefault/browser/tests/file.txt
Traceback (most recent call last):
  File "/usr/local/python2.6/lib/python2.6/unittest.py", line 279, in run
    testMethod()
  File "/usr/local/python2.6/lib/python2.6/doctest.py", line 2152, in runTest
    raise self.failureException(self.format_failure(new.getvalue()))
AssertionError: Failed doctest test for file.txt
  File "/home/stefan/autotest/temp/python26-zope213-cmf22-plone41/eggs/Products.CMFDefault-2.2.2-py2.6.egg/Products/CMFDefault/browser/tests/file.txt", line 0

----------------------------------------------------------------------
File "/home/stefan/autotest/temp/python26-zope213-cmf22-plone41/eggs/Products.CMFDefault-2.2.2-py2.6.egg/Products/CMFDefault/browser/tests/file.txt", line 7, in file.txt
Failed example:
    uf._doAddUser('mgr', 'mgrpw', ['Manager'], [])
Differences (ndiff with -expected +actual):
    + <User 'mgr'>




Failure in test /home/stefan/autotest/temp/python26-zope213-cmf22-plone41/eggs/Products.CMFDefault-2.2.2-py2.6.egg/Products/CMFDefault/browser/tests/folder.txt
Traceback (most recent call last):
  File "/usr/local/python2.6/lib/python2.6/unittest.py", line 279, in run
    testMethod()
  File "/usr/local/python2.6/lib/python2.6/doctest.py", line 2152, in runTest
    raise self.failureException(self.format_failure(new.getvalue()))
AssertionError: Failed doctest test for folder.txt
  File "/home/stefan/autotest/temp/python26-zope213-cmf22-plone41/eggs/Products.CMFDefault-2.2.2-py2.6.egg/Products/CMFDefault/browser/tests/folder.txt", line 0

----------------------------------------------------------------------
File "/home/stefan/autotest/temp/python26-zope213-cmf22-plone41/eggs/Products.CMFDefault-2.2.2-py2.6.egg/Products/CMFDefault/browser/tests/folder.txt", line 7, in folder.txt
Failed example:
    uf._doAddUser('mgr', 'mgrpw', ['Manager'], [])
Differences (ndiff with -expected +actual):
    + <User 'mgr'>




Failure in test /home/stefan/autotest/temp/python26-zope213-cmf22-plone41/eggs/Products.CMFDefault-2.2.2-py2.6.egg/Products/CMFDefault/browser/tests/link.txt
Traceback (most recent call last):
  File "/usr/local/python2.6/lib/python2.6/unittest.py", line 279, in run
    testMethod()
  File "/usr/local/python2.6/lib/python2.6/doctest.py", line 2152, in runTest
    raise self.failureException(self.format_failure(new.getvalue()))
AssertionError: Failed doctest test for link.txt
  File "/home/stefan/autotest/temp/python26-zope213-cmf22-plone41/eggs/Products.CMFDefault-2.2.2-py2.6.egg/Products/CMFDefault/browser/tests/link.txt", line 0

----------------------------------------------------------------------
File "/home/stefan/autotest/temp/python26-zope213-cmf22-plone41/eggs/Products.CMFDefault-2.2.2-py2.6.egg/Products/CMFDefault/browser/tests/link.txt", line 7, in link.txt
Failed example:
    uf._doAddUser('mgr', 'mgrpw', ['Manager'], [])
Differences (ndiff with -expected +actual):
    + <User 'mgr'>




Failure in test /home/stefan/autotest/temp/python26-zope213-cmf22-plone41/eggs/Products.CMFDefault-2.2.2-py2.6.egg/Products/CMFDefault/browser/tests/metadata.txt
Traceback (most recent call last):
  File "/usr/local/python2.6/lib/python2.6/unittest.py", line 279, in run
    testMethod()
  File "/usr/local/python2.6/lib/python2.6/doctest.py", line 2152, in runTest
    raise self.failureException(self.format_failure(new.getvalue()))
AssertionError: Failed doctest test for metadata.txt
  File "/home/stefan/autotest/temp/python26-zope213-cmf22-plone41/eggs/Products.CMFDefault-2.2.2-py2.6.egg/Products/CMFDefault/browser/tests/metadata.txt", line 0

----------------------------------------------------------------------
File "/home/stefan/autotest/temp/python26-zope213-cmf22-plone41/eggs/Products.CMFDefault-2.2.2-py2.6.egg/Products/CMFDefault/browser/tests/metadata.txt", line 11, in metadata.txt
Failed example:
    uf._doAddUser('mgr', 'mgrpw', ['Manager'], [])
Differences (ndiff with -expected +actual):
    + <User 'mgr'>




Failure in test /home/stefan/autotest/temp/python26-zope213-cmf22-plone41/eggs/Products.CMFDefault-2.2.2-py2.6.egg/Products/CMFDefault/formlib/form.txt
Traceback (most recent call last):
  File "/usr/local/python2.6/lib/python2.6/unittest.py", line 279, in run
    testMethod()
  File "/usr/local/python2.6/lib/python2.6/doctest.py", line 2152, in runTest
    raise self.failureException(self.format_failure(new.getvalue()))
AssertionError: Failed doctest test for form.txt
  File "/home/stefan/autotest/temp/python26-zope213-cmf22-plone41/eggs/Products.CMFDefault-2.2.2-py2.6.egg/Products/CMFDefault/formlib/form.txt", line 0

----------------------------------------------------------------------
File "/home/stefan/autotest/temp/python26-zope213-cmf22-plone41/eggs/Products.CMFDefault-2.2.2-py2.6.egg/Products/CMFDefault/formlib/form.txt", line 7, in form.txt
Failed example:
    uf._doAddUser('mgr', 'mgrpw', ['Manager'], [])
Differences (ndiff with -expected +actual):
    + <User 'mgr'>


  Ran 32 tests with 8 failures and 0 errors in 4.114 seconds.
Running Products.CMFUid.testing.UidEventZCMLLayer tests:
  Tear down Products.CMFDefault.testing.FunctionalLayer in 0.015 seconds.
  Tear down Products.CMFCore.testing.FunctionalZCMLLayer in 0.002 seconds.
  Set up Products.CMFUid.testing.UidEventZCMLLayer in 0.001 seconds.
  Ran 12 tests with 0 failures and 0 errors in 0.307 seconds.
Running Products.DCWorkflow.testing.ExportImportZCMLLayer tests:
  Tear down Products.CMFUid.testing.UidEventZCMLLayer in 0.000 seconds.
  Set up Products.DCWorkflow.testing.ExportImportZCMLLayer in 0.179 seconds.
  Ran 38 tests with 0 failures and 0 errors in 0.728 seconds.
Running Products.GenericSetup.testing.ExportImportZCMLLayer tests:
  Tear down Products.DCWorkflow.testing.ExportImportZCMLLayer in 0.001 seconds.
  Set up Products.GenericSetup.testing.ExportImportZCMLLayer in 0.083 seconds.
  Ran 192 tests with 0 failures and 0 errors in 0.623 seconds.
Running zope.testing.testrunner.layer.UnitTests tests:
  Tear down Products.GenericSetup.testing.ExportImportZCMLLayer in 0.000 seconds.
  Tear down Testing.ZopeTestCase.layer.ZopeLite in 0.000 seconds.
  Set up zope.testing.testrunner.layer.UnitTests in 0.000 seconds.
  Ran 261 tests with 0 failures and 0 errors in 0.286 seconds.
Tearing down left over layers:
  Tear down zope.testing.testrunner.layer.UnitTests in 0.000 seconds.
Total: 806 tests, 10 failures, 0 errors in 12.781 seconds.
/home/stefan/autotest/temp/python26-zope213-cmf22-plone41/eggs/Products.CMFCore-2.2.2-py2.6.egg/Products/CMFCore/FSObject.py:21: DeprecationWarning: RoleManager is deprecated. RoleManager is no longer part of AccessControl, please depend on Zope2 and import from OFS.role or use the new minimal RoleManager class from AccessControl.rolemanager.
  from AccessControl.Role import RoleManager
Running Testing.ZopeTestCase.layer.ZopeLite tests:
  Set up Testing.ZopeTestCase.layer.ZopeLite in 1.018 seconds.
  Ran 27 tests with 0 failures and 0 errors in 0.056 seconds.
Running Products.PloneTestCase.layer.PloneSite tests:
  Set up Products.PloneTestCase.layer.ZCML/home/stefan/autotest/temp/python26-zope213-cmf22-plone41/eggs/zope.configuration-3.7.2-py2.6.egg/zope/configuration/fields.py:419: UserWarning: You did not specify an i18n translation domain for the 'title' field in /home/stefan/autotest/temp/python26-zope213-cmf22-plone41/eggs/Products.kupu-1.5.0b1-py2.6.egg/Products/kupu/plone/configure.zcml
  "'%s' field in %s" % (self.getName(), context.info.file )
/home/stefan/autotest/temp/python26-zope213-cmf22-plone41/eggs/zope.configuration-3.7.2-py2.6.egg/zope/configuration/fields.py:419: UserWarning: You did not specify an i18n translation domain for the 'description' field in /home/stefan/autotest/temp/python26-zope213-cmf22-plone41/eggs/Products.kupu-1.5.0b1-py2.6.egg/Products/kupu/plone/configure.zcml
  "'%s' field in %s" % (self.getName(), context.info.file )
 in 3.637 seconds.
  Set up Products.PloneTestCase.layer.PloneSite in 5.690 seconds.
  Ran 135 tests with 0 failures and 0 errors in 23.566 seconds.
Running Products.CMFDiffTool.tests.BaseTestCase.CMFDiffToolLayer tests:
  Set up Products.CMFDiffTool.tests.BaseTestCase.CMFDiffToolLayer/home/stefan/autotest/temp/python26-zope213-cmf22-plone41/eggs/Products.CMFDiffTool-2.0-py2.6.egg/Products/CMFDiffTool/tests/BaseTestCase.py:39: DeprecationWarning: load_config is deprecated. Please import from Zope2.App.zcml
  zcml.load_config('configure.zcml', schemaextender)
 in 0.013 seconds.
  Ran 2 tests with 0 failures and 0 errors in 0.298 seconds.
Running Products.CMFTestCase.layer.CMFSite tests:
  Tear down Products.CMFDiffTool.tests.BaseTestCase.CMFDiffToolLayer in 0.218 seconds.
  Tear down Products.PloneTestCase.layer.PloneSite in 0.006 seconds.
  Tear down Products.PloneTestCase.layer.ZCML in 0.004 seconds.
  Set up Products.CMFTestCase.layer.ZCML in 2.830 seconds.
  Set up Products.CMFTestCase.layer.CMFSite/home/stefan/autotest/temp/python26-zope213-cmf22-plone41/eggs/Products.GenericSetup-1.6.1-py2.6.egg/Products/GenericSetup/utils.py:123: DeprecationWarning: UserFolder is deprecated. User folders are no longer part of AccessControl, please depend on Zope2 and import from OFS.userfolder or use the new minimal user folder classes from AccessControl.userfolder.
  obj = getattr( obj, part )
 in 1.419 seconds.
  Ran 20 tests with 0 failures and 0 errors in 0.389 seconds.
Running plone.app.blob.tests.layer.BlobReplacementLayer tests:
  Tear down Products.CMFTestCase.layer.CMFSite in 0.032 seconds.
  Tear down Products.CMFTestCase.layer.ZCML in 0.003 seconds.
  Set up Products.PloneTestCase.layer.ZCML in 2.766 seconds.
  Set up Products.PloneTestCase.layer.PloneSite in 4.454 seconds.
  Set up plone.app.blob.tests.layer.BlobLayer in 0.092 seconds.
  Set up plone.app.blob.tests.layer.BlobReplacementLayer in 0.201 seconds.
  Ran 6 tests with 0 failures and 0 errors in 2.036 seconds.
Running zope.testing.testrunner.layer.UnitTests tests:
  Tear down plone.app.blob.tests.layer.BlobReplacementLayer in 0.000 seconds.
  Tear down plone.app.blob.tests.layer.BlobLayer in 0.000 seconds.
  Tear down Products.PloneTestCase.layer.PloneSite in 0.216 seconds.
  Tear down Products.PloneTestCase.layer.ZCML in 0.005 seconds.
  Tear down Testing.ZopeTestCase.layer.ZopeLite in 0.000 seconds.
  Set up zope.testing.testrunner.layer.UnitTests in 0.000 seconds.
  Ran 1 tests with 0 failures and 0 errors in 0.005 seconds.
Tearing down left over layers:
  Tear down zope.testing.testrunner.layer.UnitTests in 0.000 seconds.
Total: 191 tests, 0 failures, 0 errors in 50.339 seconds.
/home/stefan/autotest/temp/python26-zope213-cmf22-plone41/eggs/Products.CMFCore-2.2.2-py2.6.egg/Products/CMFCore/FSObject.py:21: DeprecationWarning: RoleManager is deprecated. RoleManager is no longer part of AccessControl, please depend on Zope2 and import from OFS.role or use the new minimal RoleManager class from AccessControl.rolemanager.
  from AccessControl.Role import RoleManager
/home/stefan/autotest/temp/python26-zope213-cmf22-plone41/src/Products.CMFPlone/Products/CMFPlone/tests/testSSOLogin.py:1: DeprecationWarning: Browser is deprecated. Please import from Testing.testbrowser
  from Products.Five.testbrowser import Browser
/home/stefan/autotest/temp/python26-zope213-cmf22-plone41/eggs/plone.app.content-2.0.2-py2.6.egg/plone/app/content/browser/tests/test_doctests.py:1: DeprecationWarning: zope.testing.doctest is deprecated in favour of the Python standard library doctest module
  from zope.testing import doctest
/home/stefan/autotest/temp/python26-zope213-cmf22-plone41/eggs/plone.app.i18n-2.0-py2.6.egg/plone/app/i18n/locales/browser/tests.py:7: DeprecationWarning: zope.testing.doctestunit is deprecated in favour of the Python standard library doctest module
  from zope.testing.doctestunit import DocTestSuite
Running Testing.ZopeTestCase.layer.ZopeLite tests:
  Set up Testing.ZopeTestCase.layer.ZopeLite in 0.454 seconds.
  Ran 120 tests with 0 failures and 0 errors in 0.727 seconds.
Running Products.CMFTestCase.layer.CMFSite tests:
  Set up Products.CMFTestCase.layer.ZCML/home/stefan/autotest/temp/python26-zope213-cmf22-plone41/eggs/zope.configuration-3.7.2-py2.6.egg/zope/configuration/fields.py:419: UserWarning: You did not specify an i18n translation domain for the 'title' field in /home/stefan/autotest/temp/python26-zope213-cmf22-plone41/eggs/Products.kupu-1.5.0b1-py2.6.egg/Products/kupu/plone/configure.zcml
  "'%s' field in %s" % (self.getName(), context.info.file )
/home/stefan/autotest/temp/python26-zope213-cmf22-plone41/eggs/zope.configuration-3.7.2-py2.6.egg/zope/configuration/fields.py:419: UserWarning: You did not specify an i18n translation domain for the 'description' field in /home/stefan/autotest/temp/python26-zope213-cmf22-plone41/eggs/Products.kupu-1.5.0b1-py2.6.egg/Products/kupu/plone/configure.zcml
  "'%s' field in %s" % (self.getName(), context.info.file )
 in 3.414 seconds.
  Set up Products.CMFTestCase.layer.CMFSite/home/stefan/autotest/temp/python26-zope213-cmf22-plone41/eggs/Products.GenericSetup-1.6.1-py2.6.egg/Products/GenericSetup/utils.py:123: DeprecationWarning: UserFolder is deprecated. User folders are no longer part of AccessControl, please depend on Zope2 and import from OFS.userfolder or use the new minimal user folder classes from AccessControl.userfolder.
  obj = getattr( obj, part )
 in 0.231 seconds.
  Ran 31 tests with 0 failures and 0 errors in 3.074 seconds.
Running Products.PloneTestCase.layer.ZCML tests:
  Tear down Products.CMFTestCase.layer.CMFSite in 0.017 seconds.
  Tear down Products.CMFTestCase.layer.ZCML in 0.004 seconds.
  Set up Products.PloneTestCase.layer.ZCML in 2.555 seconds.
  Ran 12 tests with 0 failures and 0 errors in 0.016 seconds.
Running Products.PloneTestCase.layer.PloneSite tests:
  Set up Products.PloneTestCase.layer.PloneSite in 11.395 seconds.
/home/stefan/autotest/temp/python26-zope213-cmf22-plone41/eggs/Products.PortalTransforms-2.0.3-py2.6.egg/Products/PortalTransforms/libtransforms/commandtransform.py:103: DeprecationWarning: os.popen4 is deprecated.  Use the subprocess module.
  cin, couterr = os.popen4(command, 'b')


Failure in test /home/stefan/autotest/temp/python26-zope213-cmf22-plone41/eggs/plone.app.controlpanel-2.1b1-py2.6.egg/plone/app/controlpanel/tests/markup.txt
Traceback (most recent call last):
  File "/usr/local/python2.6/lib/python2.6/unittest.py", line 279, in run
    testMethod()
  File "/usr/local/python2.6/lib/python2.6/doctest.py", line 2152, in runTest
    raise self.failureException(self.format_failure(new.getvalue()))
AssertionError: Failed doctest test for markup.txt
  File "/home/stefan/autotest/temp/python26-zope213-cmf22-plone41/eggs/plone.app.controlpanel-2.1b1-py2.6.egg/plone/app/controlpanel/tests/markup.txt", line 0

----------------------------------------------------------------------
File "/home/stefan/autotest/temp/python26-zope213-cmf22-plone41/eggs/plone.app.controlpanel-2.1b1-py2.6.egg/plone/app/controlpanel/tests/markup.txt", line 17, in markup.txt
Failed example:
    self.browser.getControl(name='form.allowed_types').value
Expected:
    ['text/html', 'text/x-web-textile']
Got:
    ['text/html', 'text/x-plone-outputfilters-html', 'text/x-web-textile']


  Ran 1480 tests with 1 failures and 0 errors in 4 minutes 18.959 seconds.
Running plone.app.contentrules.tests.test_configuration.TestContentrulesGSLayer tests:
  Set up plone.app.contentrules.tests.test_configuration.TestContentrulesGSLayer in 0.002 seconds.
  Ran 6 tests with 0 failures and 0 errors in 2.601 seconds.
Running plone.app.customerize.tests.layer.PloneCustomerize tests:
  Tear down plone.app.contentrules.tests.test_configuration.TestContentrulesGSLayer in 0.000 seconds.
  Set up plone.app.customerize.tests.layer.PloneCustomerize in 0.009 seconds.
  Ran 2 tests with 0 failures and 0 errors in 2.993 seconds.
Running plone.app.kss.tests.kss_and_plone_layer.KSSAndPloneLayer tests:
  Tear down plone.app.customerize.tests.layer.PloneCustomerize in 0.000 seconds.
  Set up plone.app.kss.tests.kss_and_plone_layer.KSSAndPloneLayer in 0.005 seconds.
  Ran 15 tests with 0 failures and 0 errors in 1.272 seconds.
Running plone.app.upgrade.tests.base.FunctionalUpgradeLayer tests:
  Tear down plone.app.kss.tests.kss_and_plone_layer.KSSAndPloneLayer in 0.000 seconds.
  Set up plone.app.upgrade.tests.base.FunctionalUpgradeLayer in 0.000 seconds.
  Ran 12 tests with 0 failures and 0 errors in 1 minutes 9.510 seconds.
Running plone.app.viewletmanager.tests.test_exportimport.Layer tests:
  Tear down plone.app.upgrade.tests.base.FunctionalUpgradeLayer in 0.000 seconds.
  Tear down Products.PloneTestCase.layer.PloneSite in 0.643 seconds.
  Tear down Products.PloneTestCase.layer.ZCML in 0.016 seconds.
  Tear down Testing.ZopeTestCase.layer.ZopeLite in 0.000 seconds.
  Set up plone.app.viewletmanager.tests.test_exportimport.Layer in 0.000 seconds.
  Ran 16 tests with 0 failures and 0 errors in 0.054 seconds.
Running zope.testing.testrunner.layer.UnitTests tests:
  Tear down plone.app.viewletmanager.tests.test_exportimport.Layer in 0.000 seconds.
  Set up zope.testing.testrunner.layer.UnitTests in 0.000 seconds.
  Ran 130 tests with 0 failures and 0 errors in 0.919 seconds.
Tearing down left over layers:
  Tear down zope.testing.testrunner.layer.UnitTests in 0.000 seconds.
Total: 1824 tests, 1 failures, 0 errors in 6 minutes 2.764 seconds.
/home/stefan/autotest/temp/python26-zope213-cmf22-plone41/eggs/Products.CMFCore-2.2.2-py2.6.egg/Products/CMFCore/FSObject.py:21: DeprecationWarning: RoleManager is deprecated. RoleManager is no longer part of AccessControl, please depend on Zope2 and import from OFS.role or use the new minimal RoleManager class from AccessControl.rolemanager.
  from AccessControl.Role import RoleManager
Running Testing.ZopeTestCase.layer.ZopeLite tests:
  Set up Testing.ZopeTestCase.layer.ZopeLite in 1.419 seconds.
  Ran 151 tests with 0 failures and 0 errors in 0.809 seconds.
Running Products.PlonePAS.tests.layer.PlonePASLayer tests:
  Set up Products.PloneTestCase.layer.ZCML/home/stefan/autotest/temp/python26-zope213-cmf22-plone41/eggs/zope.configuration-3.7.2-py2.6.egg/zope/configuration/fields.py:419: UserWarning: You did not specify an i18n translation domain for the 'title' field in /home/stefan/autotest/temp/python26-zope213-cmf22-plone41/eggs/Products.kupu-1.5.0b1-py2.6.egg/Products/kupu/plone/configure.zcml
  "'%s' field in %s" % (self.getName(), context.info.file )
/home/stefan/autotest/temp/python26-zope213-cmf22-plone41/eggs/zope.configuration-3.7.2-py2.6.egg/zope/configuration/fields.py:419: UserWarning: You did not specify an i18n translation domain for the 'description' field in /home/stefan/autotest/temp/python26-zope213-cmf22-plone41/eggs/Products.kupu-1.5.0b1-py2.6.egg/Products/kupu/plone/configure.zcml
  "'%s' field in %s" % (self.getName(), context.info.file )
 in 3.426 seconds.
  Set up Products.PloneTestCase.layer.PloneSite in 4.370 seconds.
  Set up Products.PlonePAS.tests.layer.PlonePASLayer in 0.000 seconds.
  Ran 149 tests with 0 failures and 0 errors in 1.953 seconds.
Running zope.testing.testrunner.layer.UnitTests tests:
  Tear down Products.PlonePAS.tests.layer.PlonePASLayer in 0.000 seconds.
  Tear down Products.PloneTestCase.layer.PloneSite in 0.185 seconds.
  Tear down Products.PloneTestCase.layer.ZCML in 0.004 seconds.
  Tear down Testing.ZopeTestCase.layer.ZopeLite in 0.000 seconds.
  Set up zope.testing.testrunner.layer.UnitTests in 0.000 seconds.
  Ran 347 tests with 0 failures and 0 errors in 0.097 seconds.
Tearing down left over layers:
  Tear down zope.testing.testrunner.layer.UnitTests in 0.000 seconds.
Total: 647 tests, 0 failures, 0 errors in 12.882 seconds.
/home/stefan/autotest/temp/python26-zope213-cmf22-plone41/eggs/Products.CMFCore-2.2.2-py2.6.egg/Products/CMFCore/FSObject.py:21: DeprecationWarning: RoleManager is deprecated. RoleManager is no longer part of AccessControl, please depend on Zope2 and import from OFS.role or use the new minimal RoleManager class from AccessControl.rolemanager.
  from AccessControl.Role import RoleManager
/home/stefan/autotest/temp/python26-zope213-cmf22-plone41/eggs/plone.fieldsets-2.0-py2.6.egg/plone/fieldsets/tests.py:6: DeprecationWarning: zope.testing.doctest is deprecated in favour of the Python standard library doctest module
  from zope.testing import doctest
/home/stefan/autotest/temp/python26-zope213-cmf22-plone41/eggs/plone.indexer-1.0-py2.6.egg/plone/indexer/tests.py:3: DeprecationWarning: zope.testing.doctestunit is deprecated in favour of the Python standard library doctest module
  from zope.testing import doctestunit
Running Products.PloneTestCase.layer.PloneSite tests:
  Set up Testing.ZopeTestCase.layer.ZopeLite in 1.353 seconds.
  Set up Products.PloneTestCase.layer.ZCML/home/stefan/autotest/temp/python26-zope213-cmf22-plone41/eggs/zope.configuration-3.7.2-py2.6.egg/zope/configuration/fields.py:419: UserWarning: You did not specify an i18n translation domain for the 'title' field in /home/stefan/autotest/temp/python26-zope213-cmf22-plone41/eggs/Products.kupu-1.5.0b1-py2.6.egg/Products/kupu/plone/configure.zcml
  "'%s' field in %s" % (self.getName(), context.info.file )
/home/stefan/autotest/temp/python26-zope213-cmf22-plone41/eggs/zope.configuration-3.7.2-py2.6.egg/zope/configuration/fields.py:419: UserWarning: You did not specify an i18n translation domain for the 'description' field in /home/stefan/autotest/temp/python26-zope213-cmf22-plone41/eggs/Products.kupu-1.5.0b1-py2.6.egg/Products/kupu/plone/configure.zcml
  "'%s' field in %s" % (self.getName(), context.info.file )
 in 3.560 seconds.
  Set up Products.PloneTestCase.layer.PloneSite/home/stefan/autotest/temp/python26-zope213-cmf22-plone41/eggs/borg.localrole-3.0.2-py2.6.egg/borg/localrole/tests.py:52: DeprecationWarning: load_config is deprecated. Please import from Zope2.App.zcml
  zcml.load_config('configure.zcml', borg.localrole)
 in 4.604 seconds.
  Ran 5 tests with 0 failures and 0 errors in 0.138 seconds.
Running plone.browserlayer.tests.test_doctest.PloneBrowserLayerLayer tests:
  Set up plone.browserlayer.tests.test_doctest.PloneBrowserLayerLayer in 0.004 seconds.
/home/stefan/autotest/temp/python26-zope213-cmf22-plone41/eggs/plone.browserlayer-2.0.1-py2.6.egg/plone/browserlayer/README.txt:1: DeprecationWarning: Browser is deprecated. Please import from Testing.testbrowser
  plone.browserlayer tests
  Ran 1 tests with 0 failures and 0 errors in 0.705 seconds.
Running plone.theme.tests.test_doctest.PloneThemeLayer tests:
  Tear down plone.browserlayer.tests.test_doctest.PloneBrowserLayerLayer in 0.000 seconds.
  Set up plone.theme.tests.test_doctest.PloneThemeLayer in 0.004 seconds.
  Ran 1 tests with 0 failures and 0 errors in 0.042 seconds.
Running zope.testing.testrunner.layer.UnitTests tests:
  Tear down plone.theme.tests.test_doctest.PloneThemeLayer in 0.000 seconds.
  Tear down Products.PloneTestCase.layer.PloneSite in 0.184 seconds.
  Tear down Products.PloneTestCase.layer.ZCML in 0.005 seconds.
  Tear down Testing.ZopeTestCase.layer.ZopeLite in 0.000 seconds.
  Set up zope.testing.testrunner.layer.UnitTests in 0.000 seconds.
  Ran 176 tests with 0 failures and 0 errors in 0.482 seconds.
Tearing down left over layers:
  Tear down zope.testing.testrunner.layer.UnitTests in 0.000 seconds.
Total: 183 tests, 0 failures, 0 errors in 12.062 seconds.
/home/stefan/autotest/temp/python26-zope213-cmf22-plone41/eggs/Products.CMFCore-2.2.2-py2.6.egg/Products/CMFCore/FSObject.py:21: DeprecationWarning: RoleManager is deprecated. RoleManager is no longer part of AccessControl, please depend on Zope2 and import from OFS.role or use the new minimal RoleManager class from AccessControl.rolemanager.
  from AccessControl.Role import RoleManager
Running Products.PloneTestCase.layer.PloneSite tests:
  Set up Testing.ZopeTestCase.layer.ZopeLite in 0.824 seconds.
  Set up Products.PloneTestCase.layer.ZCML/home/stefan/autotest/temp/python26-zope213-cmf22-plone41/eggs/zope.configuration-3.7.2-py2.6.egg/zope/configuration/fields.py:419: UserWarning: You did not specify an i18n translation domain for the 'title' field in /home/stefan/autotest/temp/python26-zope213-cmf22-plone41/eggs/Products.kupu-1.5.0b1-py2.6.egg/Products/kupu/plone/configure.zcml
  "'%s' field in %s" % (self.getName(), context.info.file )
/home/stefan/autotest/temp/python26-zope213-cmf22-plone41/eggs/zope.configuration-3.7.2-py2.6.egg/zope/configuration/fields.py:419: UserWarning: You did not specify an i18n translation domain for the 'description' field in /home/stefan/autotest/temp/python26-zope213-cmf22-plone41/eggs/Products.kupu-1.5.0b1-py2.6.egg/Products/kupu/plone/configure.zcml
  "'%s' field in %s" % (self.getName(), context.info.file )
 in 3.823 seconds.
  Set up Products.PloneTestCase.layer.PloneSite/home/stefan/autotest/temp/python26-zope213-cmf22-plone41/eggs/plone.portlet.collection-2.0.1-py2.6.egg/plone/portlet/collection/tests/base.py:21: DeprecationWarning: load_config is deprecated. Please import from Zope2.App.zcml
  zcml.load_config('configure.zcml', plone.portlet.collection)
 in 4.451 seconds.
  Ran 171 tests with 0 failures and 0 errors in 15.661 seconds.
Running plone.app.portlets.tests.test_configuration.TestPortletZCMLLayer tests:
  Set up plone.app.portlets.tests.test_configuration.TestPortletZCMLLayer in 0.007 seconds.
  Ran 18 tests with 0 failures and 0 errors in 11.021 seconds.
Running zope.testing.testrunner.layer.UnitTests tests:
  Tear down plone.app.portlets.tests.test_configuration.TestPortletZCMLLayer in 0.000 seconds.
  Tear down Products.PloneTestCase.layer.PloneSite in 0.194 seconds.
  Tear down Products.PloneTestCase.layer.ZCML in 0.005 seconds.
  Tear down Testing.ZopeTestCase.layer.ZopeLite in 0.000 seconds.
  Set up zope.testing.testrunner.layer.UnitTests in 0.000 seconds.
  Ran 5 tests with 0 failures and 0 errors in 0.152 seconds.
Tearing down left over layers:
  Tear down zope.testing.testrunner.layer.UnitTests in 0.000 seconds.
Total: 194 tests, 0 failures, 0 errors in 36.851 seconds.
Running zope.testing.testrunner.layer.UnitTests tests:
  Set up zope.testing.testrunner.layer.UnitTests in 0.000 seconds.
  Ran 3 tests with 0 failures and 0 errors in 48.269 seconds.
Tearing down left over layers:
  Tear down zope.testing.testrunner.layer.UnitTests in 0.000 seconds.
Running zope.testing.testrunner.layer.UnitTests tests:
  Set up zope.testing.testrunner.layer.UnitTests in 0.000 seconds.
  Ran 214 tests with 0 failures and 0 errors in 0.574 seconds.
Tearing down left over layers:
  Tear down zope.testing.testrunner.layer.UnitTests in 0.000 seconds.
Traceback (most recent call last):
  File "/home/stefan/autotest/temp/python26-zope213-cmf22-plone41/bin/test", line 375, in <module>
    '--test-path', '/home/stefan/autotest/temp/python26-zope213-cmf22-plone41/eggs/plone.openid-2.0-py2.6.egg',
  File "/home/stefan/autotest/temp/python26-zope213-cmf22-plone41/eggs/zope.testing-3.9.4-py2.6.egg/zope/testing/testrunner/__init__.py", line 32, in run
    failed = run_internal(defaults, args, script_parts=script_parts)
  File "/home/stefan/autotest/temp/python26-zope213-cmf22-plone41/eggs/zope.testing-3.9.4-py2.6.egg/zope/testing/testrunner/__init__.py", line 45, in run_internal
    runner.run()
  File "/home/stefan/autotest/temp/python26-zope213-cmf22-plone41/eggs/zope.testing-3.9.4-py2.6.egg/zope/testing/testrunner/runner.py", line 126, in run
    feature.global_setup()
  File "/home/stefan/autotest/temp/python26-zope213-cmf22-plone41/eggs/zope.testing-3.9.4-py2.6.egg/zope/testing/testrunner/find.py", line 418, in global_setup
    tests = find_tests(self.runner.options, self.runner.found_suites)
  File "/home/stefan/autotest/temp/python26-zope213-cmf22-plone41/eggs/zope.testing-3.9.4-py2.6.egg/zope/testing/testrunner/find.py", line 117, in find_tests
    for suite in found_suites:
  File "/home/stefan/autotest/temp/python26-zope213-cmf22-plone41/eggs/zope.testing-3.9.4-py2.6.egg/zope/testing/testrunner/find.py", line 127, in find_suites
    for fpath, package in find_test_files(options):
  File "/home/stefan/autotest/temp/python26-zope213-cmf22-plone41/eggs/zope.testing-3.9.4-py2.6.egg/zope/testing/testrunner/find.py", line 184, in find_test_files
    for f, package in find_test_files_(options):
  File "/home/stefan/autotest/temp/python26-zope213-cmf22-plone41/eggs/zope.testing-3.9.4-py2.6.egg/zope/testing/testrunner/find.py", line 212, in find_test_files_
    for (p, package) in test_dirs(options, {}):
  File "/home/stefan/autotest/temp/python26-zope213-cmf22-plone41/eggs/zope.testing-3.9.4-py2.6.egg/zope/testing/testrunner/find.py", line 268, in test_dirs
    p = import_name(p)
  File "/home/stefan/autotest/temp/python26-zope213-cmf22-plone41/eggs/zope.testing-3.9.4-py2.6.egg/zope/testing/testrunner/find.py", line 335, in import_name
    __import__(name)
ImportError: No module named Plone
/home/stefan/autotest/temp/python26-zope213-cmf22-plone41/eggs/Products.CMFCore-2.2.2-py2.6.egg/Products/CMFCore/FSObject.py:21: DeprecationWarning: RoleManager is deprecated. RoleManager is no longer part of AccessControl, please depend on Zope2 and import from OFS.role or use the new minimal RoleManager class from AccessControl.rolemanager.
  from AccessControl.Role import RoleManager
Running Products.CMFTestCase.layer.CMFSite tests:
  Set up Testing.ZopeTestCase.layer.ZopeLite in 0.214 seconds.
  Set up Products.CMFTestCase.layer.ZCML in 0.415 seconds.
  Set up Products.CMFTestCase.layer.CMFSite/home/stefan/autotest/temp/python26-zope213-cmf22-plone41/eggs/Products.GenericSetup-1.6.1-py2.6.egg/Products/GenericSetup/utils.py:123: DeprecationWarning: UserFolder is deprecated. User folders are no longer part of AccessControl, please depend on Zope2 and import from OFS.userfolder or use the new minimal user folder classes from AccessControl.userfolder.
  obj = getattr( obj, part )
 in 0.235 seconds.
  Ran 58 tests with 0 failures and 0 errors in 0.227 seconds.
Tearing down left over layers:
  Tear down Products.CMFTestCase.layer.CMFSite in 0.018 seconds.
  Tear down Products.CMFTestCase.layer.ZCML in 0.001 seconds.
  Tear down Testing.ZopeTestCase.layer.ZopeLite in 0.000 seconds.
Running zope.testing.testrunner.layer.UnitTests tests:
  Set up zope.testing.testrunner.layer.UnitTests in 0.000 seconds.
  Ran 25 tests with 0 failures and 0 errors in 0.184 seconds.
Tearing down left over layers:
  Tear down zope.testing.testrunner.layer.UnitTests in 0.000 seconds.
/home/stefan/autotest/temp/python26-zope213-cmf22-plone41/eggs/Products.CMFCore-2.2.2-py2.6.egg/Products/CMFCore/FSObject.py:21: DeprecationWarning: RoleManager is deprecated. RoleManager is no longer part of AccessControl, please depend on Zope2 and import from OFS.role or use the new minimal RoleManager class from AccessControl.rolemanager.
  from AccessControl.Role import RoleManager
Running Products.PloneTestCase.layer.PloneSite tests:
  Set up Testing.ZopeTestCase.layer.ZopeLite in 1.359 seconds.
  Set up Products.PloneTestCase.layer.ZCML/home/stefan/autotest/temp/python26-zope213-cmf22-plone41/eggs/zope.configuration-3.7.2-py2.6.egg/zope/configuration/fields.py:419: UserWarning: You did not specify an i18n translation domain for the 'title' field in /home/stefan/autotest/temp/python26-zope213-cmf22-plone41/eggs/Products.kupu-1.5.0b1-py2.6.egg/Products/kupu/plone/configure.zcml
  "'%s' field in %s" % (self.getName(), context.info.file )
/home/stefan/autotest/temp/python26-zope213-cmf22-plone41/eggs/zope.configuration-3.7.2-py2.6.egg/zope/configuration/fields.py:419: UserWarning: You did not specify an i18n translation domain for the 'description' field in /home/stefan/autotest/temp/python26-zope213-cmf22-plone41/eggs/Products.kupu-1.5.0b1-py2.6.egg/Products/kupu/plone/configure.zcml
  "'%s' field in %s" % (self.getName(), context.info.file )
 in 3.656 seconds.
  Set up Products.PloneTestCase.layer.PloneSite in 4.502 seconds.
/home/stefan/autotest/temp/python26-zope213-cmf22-plone41/eggs/Products.PasswordResetTool-2.0.5-py2.6.egg/Products/PasswordResetTool/tests/browser.txt:1: DeprecationWarning: Browser is deprecated. Please import from Testing.testbrowser
  Functional tests for PasswordResetTool
  Ran 2 tests with 0 failures and 0 errors in 4.114 seconds.
Tearing down left over layers:
  Tear down Products.PloneTestCase.layer.PloneSite in 0.195 seconds.
  Tear down Products.PloneTestCase.layer.ZCML in 0.006 seconds.
  Tear down Testing.ZopeTestCase.layer.ZopeLite in 0.000 seconds.
/home/stefan/autotest/temp/python26-zope213-cmf22-plone41/eggs/Products.CMFCore-2.2.2-py2.6.egg/Products/CMFCore/FSObject.py:21: DeprecationWarning: RoleManager is deprecated. RoleManager is no longer part of AccessControl, please depend on Zope2 and import from OFS.role or use the new minimal RoleManager class from AccessControl.rolemanager.
  from AccessControl.Role import RoleManager
Running Products.PloneTestCase.layer.PloneSite tests:
  Set up Testing.ZopeTestCase.layer.ZopeLite in 1.408 seconds.
  Set up Products.PloneTestCase.layer.ZCML/home/stefan/autotest/temp/python26-zope213-cmf22-plone41/eggs/zope.configuration-3.7.2-py2.6.egg/zope/configuration/fields.py:419: UserWarning: You did not specify an i18n translation domain for the 'title' field in /home/stefan/autotest/temp/python26-zope213-cmf22-plone41/eggs/Products.kupu-1.5.0b1-py2.6.egg/Products/kupu/plone/configure.zcml
  "'%s' field in %s" % (self.getName(), context.info.file )
/home/stefan/autotest/temp/python26-zope213-cmf22-plone41/eggs/zope.configuration-3.7.2-py2.6.egg/zope/configuration/fields.py:419: UserWarning: You did not specify an i18n translation domain for the 'description' field in /home/stefan/autotest/temp/python26-zope213-cmf22-plone41/eggs/Products.kupu-1.5.0b1-py2.6.egg/Products/kupu/plone/configure.zcml
  "'%s' field in %s" % (self.getName(), context.info.file )
 in 3.765 seconds.
  Set up Products.PloneTestCase.layer.PloneSite in 4.361 seconds.
  Ran 63 tests with 0 failures and 0 errors in 1.403 seconds.
Tearing down left over layers:
  Tear down Products.PloneTestCase.layer.PloneSite in 0.192 seconds.
  Tear down Products.PloneTestCase.layer.ZCML in 0.004 seconds.
  Tear down Testing.ZopeTestCase.layer.ZopeLite in 0.000 seconds.
/home/stefan/autotest/temp/python26-zope213-cmf22-plone41/eggs/Products.CMFCore-2.2.2-py2.6.egg/Products/CMFCore/FSObject.py:21: DeprecationWarning: RoleManager is deprecated. RoleManager is no longer part of AccessControl, please depend on Zope2 and import from OFS.role or use the new minimal RoleManager class from AccessControl.rolemanager.
  from AccessControl.Role import RoleManager
Running Products.PloneTestCase.layer.PloneSite tests:
  Set up Testing.ZopeTestCase.layer.ZopeLite in 1.388 seconds.
  Set up Products.PloneTestCase.layer.ZCML/home/stefan/autotest/temp/python26-zope213-cmf22-plone41/eggs/zope.configuration-3.7.2-py2.6.egg/zope/configuration/fields.py:419: UserWarning: You did not specify an i18n translation domain for the 'title' field in /home/stefan/autotest/temp/python26-zope213-cmf22-plone41/eggs/Products.kupu-1.5.0b1-py2.6.egg/Products/kupu/plone/configure.zcml
  "'%s' field in %s" % (self.getName(), context.info.file )
/home/stefan/autotest/temp/python26-zope213-cmf22-plone41/eggs/zope.configuration-3.7.2-py2.6.egg/zope/configuration/fields.py:419: UserWarning: You did not specify an i18n translation domain for the 'description' field in /home/stefan/autotest/temp/python26-zope213-cmf22-plone41/eggs/Products.kupu-1.5.0b1-py2.6.egg/Products/kupu/plone/configure.zcml
  "'%s' field in %s" % (self.getName(), context.info.file )
 in 3.570 seconds.
  Set up Products.PloneTestCase.layer.PloneSite in 4.514 seconds.
  Ran 248 tests with 0 failures and 0 errors in 15.699 seconds.
Running zope.testing.testrunner.layer.UnitTests tests:
  Tear down Products.PloneTestCase.layer.PloneSite in 0.199 seconds.
  Tear down Products.PloneTestCase.layer.ZCML in 0.005 seconds.
  Tear down Testing.ZopeTestCase.layer.ZopeLite in 0.000 seconds.
  Set up zope.testing.testrunner.layer.UnitTests in 0.000 seconds.
  Ran 62 tests with 0 failures and 0 errors in 0.013 seconds.
Tearing down left over layers:
  Tear down zope.testing.testrunner.layer.UnitTests in 0.000 seconds.
Total: 310 tests, 0 failures, 0 errors in 25.884 seconds.
/home/stefan/autotest/temp/python26-zope213-cmf22-plone41/eggs/Products.CMFCore-2.2.2-py2.6.egg/Products/CMFCore/FSObject.py:21: DeprecationWarning: RoleManager is deprecated. RoleManager is no longer part of AccessControl, please depend on Zope2 and import from OFS.role or use the new minimal RoleManager class from AccessControl.rolemanager.
  from AccessControl.Role import RoleManager
Running Products.PloneTestCase.layer.PloneSite tests:
  Set up Testing.ZopeTestCase.layer.ZopeLite in 0.778 seconds.
  Set up Products.PloneTestCase.layer.ZCML/home/stefan/autotest/temp/python26-zope213-cmf22-plone41/eggs/zope.configuration-3.7.2-py2.6.egg/zope/configuration/fields.py:419: UserWarning: You did not specify an i18n translation domain for the 'title' field in /home/stefan/autotest/temp/python26-zope213-cmf22-plone41/eggs/Products.kupu-1.5.0b1-py2.6.egg/Products/kupu/plone/configure.zcml
  "'%s' field in %s" % (self.getName(), context.info.file )
/home/stefan/autotest/temp/python26-zope213-cmf22-plone41/eggs/zope.configuration-3.7.2-py2.6.egg/zope/configuration/fields.py:419: UserWarning: You did not specify an i18n translation domain for the 'description' field in /home/stefan/autotest/temp/python26-zope213-cmf22-plone41/eggs/Products.kupu-1.5.0b1-py2.6.egg/Products/kupu/plone/configure.zcml
  "'%s' field in %s" % (self.getName(), context.info.file )
 in 3.651 seconds.
  Set up Products.PloneTestCase.layer.PloneSite/home/stefan/autotest/temp/python26-zope213-cmf22-plone41/src/Products.TinyMCE/Products/TinyMCE/tests.py:18: DeprecationWarning: load_config is deprecated. Please import from Zope2.App.zcml
  zcml.load_config('configure.zcml', Products.TinyMCE)
 in 4.533 seconds.
/home/stefan/autotest/temp/python26-zope213-cmf22-plone41/src/Products.TinyMCE/Products/TinyMCE/tests/browser.txt:1: DeprecationWarning: Browser is deprecated. Please import from Testing.testbrowser
  =======
  Ran 7 tests with 0 failures and 0 errors in 2.431 seconds.
Tearing down left over layers:
  Tear down Products.PloneTestCase.layer.PloneSite in 0.189 seconds.
  Tear down Products.PloneTestCase.layer.ZCML in 0.007 seconds.
  Tear down Testing.ZopeTestCase.layer.ZopeLite in 0.000 seconds.
Running zope.testing.testrunner.layer.UnitTests tests:
  Set up zope.testing.testrunner.layer.UnitTests in 0.000 seconds.
  Ran 176 tests with 0 failures and 0 errors in 3.851 seconds.
Tearing down left over layers:
  Tear down zope.testing.testrunner.layer.UnitTests in 0.000 seconds.
/home/stefan/autotest/temp/python26-zope213-cmf22-plone41/eggs/Products.CMFCore-2.2.2-py2.6.egg/Products/CMFCore/FSObject.py:21: DeprecationWarning: RoleManager is deprecated. RoleManager is no longer part of AccessControl, please depend on Zope2 and import from OFS.role or use the new minimal RoleManager class from AccessControl.rolemanager.
  from AccessControl.Role import RoleManager
Running Products.contentmigration.tests.layer.TestLayer tests:
  Set up Testing.ZopeTestCase.layer.ZopeLite in 1.387 seconds.
  Set up Products.PloneTestCase.layer.ZCML/home/stefan/autotest/temp/python26-zope213-cmf22-plone41/eggs/zope.configuration-3.7.2-py2.6.egg/zope/configuration/fields.py:419: UserWarning: You did not specify an i18n translation domain for the 'title' field in /home/stefan/autotest/temp/python26-zope213-cmf22-plone41/eggs/Products.kupu-1.5.0b1-py2.6.egg/Products/kupu/plone/configure.zcml
  "'%s' field in %s" % (self.getName(), context.info.file )
/home/stefan/autotest/temp/python26-zope213-cmf22-plone41/eggs/zope.configuration-3.7.2-py2.6.egg/zope/configuration/fields.py:419: UserWarning: You did not specify an i18n translation domain for the 'description' field in /home/stefan/autotest/temp/python26-zope213-cmf22-plone41/eggs/Products.kupu-1.5.0b1-py2.6.egg/Products/kupu/plone/configure.zcml
  "'%s' field in %s" % (self.getName(), context.info.file )
 in 3.706 seconds.
  Set up Products.PloneTestCase.layer.PloneSite in 4.629 seconds.
  Set up Products.contentmigration.tests.layer.TestLayer in 0.002 seconds.
  Ran 13 tests with 0 failures and 0 errors in 4.578 seconds.
Tearing down left over layers:
  Tear down Products.contentmigration.tests.layer.TestLayer in 0.000 seconds.
  Tear down Products.PloneTestCase.layer.PloneSite in 0.189 seconds.
  Tear down Products.PloneTestCase.layer.ZCML in 0.004 seconds.
  Tear down Testing.ZopeTestCase.layer.ZopeLite in 0.000 seconds.
Total: 0 tests, 0 failures, 0 errors in 0.000 seconds.
/home/stefan/autotest/temp/python26-zope213-cmf22-plone41/eggs/Products.CMFCore-2.2.2-py2.6.egg/Products/CMFCore/FSObject.py:21: DeprecationWarning: RoleManager is deprecated. RoleManager is no longer part of AccessControl, please depend on Zope2 and import from OFS.role or use the new minimal RoleManager class from AccessControl.rolemanager.
  from AccessControl.Role import RoleManager
/home/stefan/autotest/temp/python26-zope213-cmf22-plone41/eggs/zope.configuration-3.7.2-py2.6.egg/zope/configuration/fields.py:419: UserWarning: You did not specify an i18n translation domain for the 'title' field in /home/stefan/autotest/temp/python26-zope213-cmf22-plone41/eggs/Products.kupu-1.5.0b1-py2.6.egg/Products/kupu/plone/configure.zcml
  "'%s' field in %s" % (self.getName(), context.info.file )
/home/stefan/autotest/temp/python26-zope213-cmf22-plone41/eggs/zope.configuration-3.7.2-py2.6.egg/zope/configuration/fields.py:419: UserWarning: You did not specify an i18n translation domain for the 'description' field in /home/stefan/autotest/temp/python26-zope213-cmf22-plone41/eggs/Products.kupu-1.5.0b1-py2.6.egg/Products/kupu/plone/configure.zcml
  "'%s' field in %s" % (self.getName(), context.info.file )
Running archetypes.referencebrowserwidget.tests.base.layer tests:
  Set up Testing.ZopeTestCase.layer.ZopeLite in 0.000 seconds.
  Set up Products.PloneTestCase.layer.ZCML in 2.717 seconds.
  Set up Products.PloneTestCase.layer.PloneSite in 4.502 seconds.
  Set up archetypes.referencebrowserwidget.tests.base.layer in 0.000 seconds.
  Ran 33 tests with 0 failures and 0 errors in 8.527 seconds.
Running zope.testing.testrunner.layer.UnitTests tests:
  Tear down archetypes.referencebrowserwidget.tests.base.layer in 0.000 seconds.
  Tear down Products.PloneTestCase.layer.PloneSite in 0.194 seconds.
  Tear down Products.PloneTestCase.layer.ZCML in 0.008 seconds.
  Tear down Testing.ZopeTestCase.layer.ZopeLite in 0.000 seconds.
  Set up zope.testing.testrunner.layer.UnitTests in 0.000 seconds.
  Ran 5 tests with 0 failures and 0 errors in 0.001 seconds.
Tearing down left over layers:
  Tear down zope.testing.testrunner.layer.UnitTests in 0.000 seconds.
Total: 38 tests, 0 failures, 0 errors in 16.474 seconds.
/home/stefan/autotest/temp/python26-zope213-cmf22-plone41/eggs/Products.CMFCore-2.2.2-py2.6.egg/Products/CMFCore/FSObject.py:21: DeprecationWarning: RoleManager is deprecated. RoleManager is no longer part of AccessControl, please depend on Zope2 and import from OFS.role or use the new minimal RoleManager class from AccessControl.rolemanager.
  from AccessControl.Role import RoleManager
Running archetypes.schemaextender.tests.base.layer tests:
  Set up Testing.ZopeTestCase.layer.ZopeLite in 0.825 seconds.
  Set up Products.PloneTestCase.layer.ZCML/home/stefan/autotest/temp/python26-zope213-cmf22-plone41/eggs/zope.configuration-3.7.2-py2.6.egg/zope/configuration/fields.py:419: UserWarning: You did not specify an i18n translation domain for the 'title' field in /home/stefan/autotest/temp/python26-zope213-cmf22-plone41/eggs/Products.kupu-1.5.0b1-py2.6.egg/Products/kupu/plone/configure.zcml
  "'%s' field in %s" % (self.getName(), context.info.file )
/home/stefan/autotest/temp/python26-zope213-cmf22-plone41/eggs/zope.configuration-3.7.2-py2.6.egg/zope/configuration/fields.py:419: UserWarning: You did not specify an i18n translation domain for the 'description' field in /home/stefan/autotest/temp/python26-zope213-cmf22-plone41/eggs/Products.kupu-1.5.0b1-py2.6.egg/Products/kupu/plone/configure.zcml
  "'%s' field in %s" % (self.getName(), context.info.file )
 in 3.547 seconds.
  Set up Products.PloneTestCase.layer.PloneSite in 4.356 seconds.
  Set up archetypes.schemaextender.tests.base.layer in 0.000 seconds.
  Ran 4 tests with 0 failures and 0 errors in 3.452 seconds.
Running zope.testing.testrunner.layer.UnitTests tests:
  Tear down archetypes.schemaextender.tests.base.layer in 0.000 seconds.
  Tear down Products.PloneTestCase.layer.PloneSite in 0.191 seconds.
  Tear down Products.PloneTestCase.layer.ZCML in 0.008 seconds.
  Tear down Testing.ZopeTestCase.layer.ZopeLite in 0.000 seconds.
  Set up zope.testing.testrunner.layer.UnitTests in 0.000 seconds.
  Ran 19 tests with 0 failures and 0 errors in 0.007 seconds.
Tearing down left over layers:
  Tear down zope.testing.testrunner.layer.UnitTests in 0.000 seconds.
Total: 23 tests, 0 failures, 0 errors in 12.886 seconds.
Running zope.testing.testrunner.layer.UnitTests tests:
  Set up zope.testing.testrunner.layer.UnitTests in 0.000 seconds.
  Ran 4 tests with 0 failures and 0 errors in 0.043 seconds.
Tearing down left over layers:
  Tear down zope.testing.testrunner.layer.UnitTests in 0.000 seconds.
/home/stefan/autotest/temp/python26-zope213-cmf22-plone41/eggs/collective.z3cform.datetimewidget-1.0-py2.6.egg/collective/z3cform/datetimewidget/tests.py:25: DeprecationWarning: zope.testing.doctest is deprecated in favour of the Python standard library doctest module
  from zope.testing import doctest
Running zope.testing.testrunner.layer.UnitTests tests:
  Set up zope.testing.testrunner.layer.UnitTests in 0.000 seconds.
  Ran 5 tests with 0 failures and 0 errors in 0.981 seconds.
Tearing down left over layers:
  Tear down zope.testing.testrunner.layer.UnitTests in 0.000 seconds.
Running Testing.ZopeTestCase.layer.ZopeLite tests:
  Set up Testing.ZopeTestCase.layer.ZopeLite in 0.038 seconds.


Failure in test /home/stefan/autotest/temp/python26-zope213-cmf22-plone41/eggs/five.customerize-1.0-py2.6.egg/five/customerize/browser.txt
Traceback (most recent call last):
  File "/usr/local/python2.6/lib/python2.6/unittest.py", line 279, in run
    testMethod()
  File "/usr/local/python2.6/lib/python2.6/doctest.py", line 2152, in runTest
    raise self.failureException(self.format_failure(new.getvalue()))
AssertionError: Failed doctest test for browser.txt
  File "/home/stefan/autotest/temp/python26-zope213-cmf22-plone41/eggs/five.customerize-1.0-py2.6.egg/five/customerize/browser.txt", line 0

----------------------------------------------------------------------
File "/home/stefan/autotest/temp/python26-zope213-cmf22-plone41/eggs/five.customerize-1.0-py2.6.egg/five/customerize/browser.txt", line 18, in browser.txt
Failed example:
    uf._doAddUser('manager', 'r00t', ['Manager'], [])
Differences (ndiff with -expected +actual):
    + <User 'manager'>


  Ran 3 tests with 1 failures and 0 errors in 0.831 seconds.
Tearing down left over layers:
  Tear down Testing.ZopeTestCase.layer.ZopeLite in 0.000 seconds.
Running Testing.ZopeTestCase.layer.ZopeLite tests:
  Set up Testing.ZopeTestCase.layer.ZopeLite in 0.042 seconds.


Failure in test /home/stefan/autotest/temp/python26-zope213-cmf22-plone41/eggs/five.formlib-1.0.3-py2.6.egg/five/formlib/tests/forms.txt
Traceback (most recent call last):
  File "/usr/local/python2.6/lib/python2.6/unittest.py", line 279, in run
    testMethod()
  File "/usr/local/python2.6/lib/python2.6/doctest.py", line 2152, in runTest
    raise self.failureException(self.format_failure(new.getvalue()))
AssertionError: Failed doctest test for forms.txt
  File "/home/stefan/autotest/temp/python26-zope213-cmf22-plone41/eggs/five.formlib-1.0.3-py2.6.egg/five/formlib/tests/forms.txt", line 0

----------------------------------------------------------------------
File "/home/stefan/autotest/temp/python26-zope213-cmf22-plone41/eggs/five.formlib-1.0.3-py2.6.egg/five/formlib/tests/forms.txt", line 8, in forms.txt
Failed example:
    uf._doAddUser('manager', 'r00t', ['Manager'], [])
Differences (ndiff with -expected +actual):
    + <User 'manager'>




Failure in test /home/stefan/autotest/temp/python26-zope213-cmf22-plone41/eggs/five.formlib-1.0.3-py2.6.egg/five/formlib/tests/formlib.txt
Traceback (most recent call last):
  File "/usr/local/python2.6/lib/python2.6/unittest.py", line 279, in run
    testMethod()
  File "/usr/local/python2.6/lib/python2.6/doctest.py", line 2152, in runTest
    raise self.failureException(self.format_failure(new.getvalue()))
AssertionError: Failed doctest test for formlib.txt
  File "/home/stefan/autotest/temp/python26-zope213-cmf22-plone41/eggs/five.formlib-1.0.3-py2.6.egg/five/formlib/tests/formlib.txt", line 0

----------------------------------------------------------------------
File "/home/stefan/autotest/temp/python26-zope213-cmf22-plone41/eggs/five.formlib-1.0.3-py2.6.egg/five/formlib/tests/formlib.txt", line 14, in formlib.txt
Failed example:
    uf._doAddUser('manager', 'r00t', ['Manager'], [])
Differences (ndiff with -expected +actual):
    + <User 'manager'>


  Ran 2 tests with 2 failures and 0 errors in 1.074 seconds.
Running zope.testing.testrunner.layer.UnitTests tests:
  Tear down Testing.ZopeTestCase.layer.ZopeLite in 0.000 seconds.
  Set up zope.testing.testrunner.layer.UnitTests in 0.000 seconds.
  Ran 1 tests with 0 failures and 0 errors in 0.132 seconds.
Tearing down left over layers:
  Tear down zope.testing.testrunner.layer.UnitTests in 0.000 seconds.
Total: 3 tests, 2 failures, 0 errors in 1.434 seconds.
Running Testing.ZopeTestCase.layer.ZopeLite tests:
  Set up Testing.ZopeTestCase.layer.ZopeLite in 0.046 seconds.
  Ran 1 tests with 0 failures and 0 errors in 0.218 seconds.
Running kss.core.tests.base.KSSLayer tests:
  Tear down Testing.ZopeTestCase.layer.ZopeLite in 0.000 seconds.
  Set up kss.core.tests.base.KSSCoreLayer in 0.026 seconds.
  Set up kss.core.tests.base.KSSLayer in 0.062 seconds.
  Ran 15 tests with 0 failures and 0 errors in 0.154 seconds.
Running kss.core.tests.test_ttwapi.layer tests:
  Set up kss.core.tests.test_ttwapi.layer in 0.001 seconds.
  Ran 3 tests with 0 failures and 0 errors in 0.026 seconds.
Running zope.testing.testrunner.layer.UnitTests tests:
  Tear down kss.core.tests.test_ttwapi.layer in 0.000 seconds.
  Tear down kss.core.tests.base.KSSLayer in 0.000 seconds.
  Tear down kss.core.tests.base.KSSCoreLayer in 0.000 seconds.
  Set up zope.testing.testrunner.layer.UnitTests in 0.000 seconds.
  Ran 2 tests with 0 failures and 0 errors in 0.009 seconds.
Tearing down left over layers:
  Tear down zope.testing.testrunner.layer.UnitTests in 0.000 seconds.
Total: 21 tests, 0 failures, 0 errors in 0.843 seconds.
/home/stefan/autotest/temp/python26-zope213-cmf22-plone41/eggs/Products.CMFCore-2.2.2-py2.6.egg/Products/CMFCore/FSObject.py:21: DeprecationWarning: RoleManager is deprecated. RoleManager is no longer part of AccessControl, please depend on Zope2 and import from OFS.role or use the new minimal RoleManager class from AccessControl.rolemanager.
  from AccessControl.Role import RoleManager
/home/stefan/autotest/temp/python26-zope213-cmf22-plone41/eggs/plone.app.imaging-1.0.1-py2.6.egg/plone/app/imaging/tests/base.py:1: DeprecationWarning: Browser is deprecated. Please import from Testing.testbrowser
  from Products.Five.testbrowser import Browser
***********************************************
WARNING: LinguaPlone not found. Skipping tests.
***********************************************
***********************************************
WARNING: LinguaPlone not found. Skipping tests.
***********************************************
Running plone.app.blob.tests.layer.BlobLayer tests:
  Set up Testing.ZopeTestCase.layer.ZopeLite in 0.818 seconds.
  Set up Products.PloneTestCase.layer.ZCML/home/stefan/autotest/temp/python26-zope213-cmf22-plone41/eggs/zope.configuration-3.7.2-py2.6.egg/zope/configuration/fields.py:419: UserWarning: You did not specify an i18n translation domain for the 'title' field in /home/stefan/autotest/temp/python26-zope213-cmf22-plone41/eggs/Products.kupu-1.5.0b1-py2.6.egg/Products/kupu/plone/configure.zcml
  "'%s' field in %s" % (self.getName(), context.info.file )
/home/stefan/autotest/temp/python26-zope213-cmf22-plone41/eggs/zope.configuration-3.7.2-py2.6.egg/zope/configuration/fields.py:419: UserWarning: You did not specify an i18n translation domain for the 'description' field in /home/stefan/autotest/temp/python26-zope213-cmf22-plone41/eggs/Products.kupu-1.5.0b1-py2.6.egg/Products/kupu/plone/configure.zcml
  "'%s' field in %s" % (self.getName(), context.info.file )
 in 3.620 seconds.
  Set up Products.PloneTestCase.layer.PloneSite in 4.366 seconds.
  Set up plone.app.blob.tests.layer.BlobLayer in 0.094 seconds.
/home/stefan/autotest/temp/python26-zope213-cmf22-plone41/eggs/Products.PortalTransforms-2.0.3-py2.6.egg/Products/PortalTransforms/libtransforms/commandtransform.py:103: DeprecationWarning: os.popen4 is deprecated.  Use the subprocess module.
  cin, couterr = os.popen4(command, 'b')
  Ran 24 tests with 0 failures and 0 errors in 7.127 seconds.
Running plone.app.blob.tests.layer.BlobReplacementLayer tests:
  Set up plone.app.blob.tests.layer.BlobReplacementLayer in 0.198 seconds.
  Ran 59 tests with 0 failures and 0 errors in 14.925 seconds.
Running zope.testing.testrunner.layer.UnitTests tests:
  Tear down plone.app.blob.tests.layer.BlobReplacementLayer in 0.000 seconds.
  Tear down plone.app.blob.tests.layer.BlobLayer in 0.000 seconds.
  Tear down Products.PloneTestCase.layer.PloneSite in 0.194 seconds.
  Tear down Products.PloneTestCase.layer.ZCML in 0.009 seconds.
  Tear down Testing.ZopeTestCase.layer.ZopeLite in 0.000 seconds.
  Set up zope.testing.testrunner.layer.UnitTests in 0.000 seconds.
  Ran 2 tests with 0 failures and 0 errors in 0.001 seconds.
Tearing down left over layers:
  Tear down zope.testing.testrunner.layer.UnitTests in 0.000 seconds.
Total: 85 tests, 0 failures, 0 errors in 32.185 seconds.
/home/stefan/autotest/temp/python26-zope213-cmf22-plone41/eggs/Products.CMFCore-2.2.2-py2.6.egg/Products/CMFCore/FSObject.py:21: DeprecationWarning: RoleManager is deprecated. RoleManager is no longer part of AccessControl, please depend on Zope2 and import from OFS.role or use the new minimal RoleManager class from AccessControl.rolemanager.
  from AccessControl.Role import RoleManager
/home/stefan/autotest/temp/python26-zope213-cmf22-plone41/eggs/plone.testing-4.0a4-py2.6.egg/plone/testing/z2.py:19: DeprecationWarning: Zope2VocabularyRegistry is deprecated. Please import from Zope2.App.schema
  from Products.Five.schema import Zope2VocabularyRegistry
Running plone.app.caching.testing.PloneAppCaching:Functional tests:
  Set up plone.testing.zca.LayerCleanup in 0.000 seconds.
  Set up plone.testing.z2.Startup/home/stefan/autotest/temp/python26-zope213-cmf22-plone41/eggs/zope.configuration-3.7.2-py2.6.egg/zope/configuration/config.py:195: DeprecationWarning: FiveSecurityPolicy is deprecated. Please import from AccessControl.security
  obj = getattr(mod, oname)
 in 0.215 seconds.
  Set up plone.app.testing.layers.PloneFixture in 7.700 seconds.
  Set up plone.app.caching.testing.PloneAppCaching in 0.643 seconds.
  Set up plone.app.caching.testing.PloneAppCaching:Functional in 0.000 seconds.


Error in test test_auto_purge_content_types (plone.app.caching.tests.test_integration.TestOperations)
Traceback (most recent call last):
  File "/home/stefan/autotest/temp/python26-zope213-cmf22-plone41/eggs/unittest2-0.5.1-py2.6.egg/unittest2/case.py", line 340, in run
    testMethod()
  File "/home/stefan/autotest/temp/python26-zope213-cmf22-plone41/src/plone.app.caching/plone/app/caching/tests/test_integration.py", line 218, in test_auto_purge_content_types
    setRoles(self.portal, TEST_USER_NAME, ('Manager',))
  File "/home/stefan/autotest/temp/python26-zope213-cmf22-plone41/eggs/plone.app.testing-4.0a4-py2.6.egg/plone/app/testing/helpers.py", line 36, in setRoles
    z2.setRoles(userFolder, userId, roles)
  File "/home/stefan/autotest/temp/python26-zope213-cmf22-plone41/eggs/plone.testing-4.0a4-py2.6.egg/plone/testing/z2.py", line 183, in setRoles
    userName = userFolder.getUserById(userId).getUserName()
AttributeError: 'NoneType' object has no attribute 'getUserName'



Error in test test_disabled (plone.app.caching.tests.test_integration.TestOperations)
Traceback (most recent call last):
  File "/home/stefan/autotest/temp/python26-zope213-cmf22-plone41/eggs/unittest2-0.5.1-py2.6.egg/unittest2/case.py", line 340, in run
    testMethod()
  File "/home/stefan/autotest/temp/python26-zope213-cmf22-plone41/src/plone.app.caching/plone/app/caching/tests/test_integration.py", line 79, in test_disabled
    setRoles(self.portal, TEST_USER_NAME, ('Manager',))
  File "/home/stefan/autotest/temp/python26-zope213-cmf22-plone41/eggs/plone.app.testing-4.0a4-py2.6.egg/plone/app/testing/helpers.py", line 36, in setRoles
    z2.setRoles(userFolder, userId, roles)
  File "/home/stefan/autotest/temp/python26-zope213-cmf22-plone41/eggs/plone.testing-4.0a4-py2.6.egg/plone/testing/z2.py", line 183, in setRoles
    userName = userFolder.getUserById(userId).getUserName()
AttributeError: 'NoneType' object has no attribute 'getUserName'



Error in test test_gzip_setting (plone.app.caching.tests.test_integration.TestOperations)
Traceback (most recent call last):
  File "/home/stefan/autotest/temp/python26-zope213-cmf22-plone41/eggs/unittest2-0.5.1-py2.6.egg/unittest2/case.py", line 340, in run
    testMethod()
  File "/home/stefan/autotest/temp/python26-zope213-cmf22-plone41/src/plone.app.caching/plone/app/caching/tests/test_integration.py", line 149, in test_gzip_setting
    setRoles(self.portal, TEST_USER_NAME, ('Manager',))
  File "/home/stefan/autotest/temp/python26-zope213-cmf22-plone41/eggs/plone.app.testing-4.0a4-py2.6.egg/plone/app/testing/helpers.py", line 36, in setRoles
    z2.setRoles(userFolder, userId, roles)
  File "/home/stefan/autotest/temp/python26-zope213-cmf22-plone41/eggs/plone.testing-4.0a4-py2.6.egg/plone/testing/z2.py", line 183, in setRoles
    userName = userFolder.getUserById(userId).getUserName()
AttributeError: 'NoneType' object has no attribute 'getUserName'



Error in test test_anon_only (plone.app.caching.tests.test_operation_parameters.TestOperationParameters)
Traceback (most recent call last):
  File "/home/stefan/autotest/temp/python26-zope213-cmf22-plone41/eggs/unittest2-0.5.1-py2.6.egg/unittest2/case.py", line 340, in run
    testMethod()
  File "/home/stefan/autotest/temp/python26-zope213-cmf22-plone41/src/plone.app.caching/plone/app/caching/tests/test_operation_parameters.py", line 40, in test_anon_only
    setRoles(self.portal, TEST_USER_NAME, ('Manager',))
  File "/home/stefan/autotest/temp/python26-zope213-cmf22-plone41/eggs/plone.app.testing-4.0a4-py2.6.egg/plone/app/testing/helpers.py", line 36, in setRoles
    z2.setRoles(userFolder, userId, roles)
  File "/home/stefan/autotest/temp/python26-zope213-cmf22-plone41/eggs/plone.testing-4.0a4-py2.6.egg/plone/testing/z2.py", line 183, in setRoles
    userName = userFolder.getUserById(userId).getUserName()
AttributeError: 'NoneType' object has no attribute 'getUserName'



Error in test test_composite_views (plone.app.caching.tests.test_profile_with_caching_proxy.TestProfileWithCaching)
Traceback (most recent call last):
  File "/home/stefan/autotest/temp/python26-zope213-cmf22-plone41/eggs/unittest2-0.5.1-py2.6.egg/unittest2/case.py", line 340, in run
    testMethod()
  File "/home/stefan/autotest/temp/python26-zope213-cmf22-plone41/src/plone.app.caching/plone/app/caching/tests/test_profile_with_caching_proxy.py", line 76, in test_composite_views
    setRoles(self.portal, TEST_USER_NAME, ('Manager',))
  File "/home/stefan/autotest/temp/python26-zope213-cmf22-plone41/eggs/plone.app.testing-4.0a4-py2.6.egg/plone/app/testing/helpers.py", line 36, in setRoles
    z2.setRoles(userFolder, userId, roles)
  File "/home/stefan/autotest/temp/python26-zope213-cmf22-plone41/eggs/plone.testing-4.0a4-py2.6.egg/plone/testing/z2.py", line 183, in setRoles
    userName = userFolder.getUserById(userId).getUserName()
AttributeError: 'NoneType' object has no attribute 'getUserName'



Error in test test_content_feeds (plone.app.caching.tests.test_profile_with_caching_proxy.TestProfileWithCaching)
Traceback (most recent call last):
  File "/home/stefan/autotest/temp/python26-zope213-cmf22-plone41/eggs/unittest2-0.5.1-py2.6.egg/unittest2/case.py", line 340, in run
    testMethod()
  File "/home/stefan/autotest/temp/python26-zope213-cmf22-plone41/src/plone.app.caching/plone/app/caching/tests/test_profile_with_caching_proxy.py", line 241, in test_content_feeds
    setRoles(self.portal, TEST_USER_NAME, ('Manager',))
  File "/home/stefan/autotest/temp/python26-zope213-cmf22-plone41/eggs/plone.app.testing-4.0a4-py2.6.egg/plone/app/testing/helpers.py", line 36, in setRoles
    z2.setRoles(userFolder, userId, roles)
  File "/home/stefan/autotest/temp/python26-zope213-cmf22-plone41/eggs/plone.testing-4.0a4-py2.6.egg/plone/testing/z2.py", line 183, in setRoles
    userName = userFolder.getUserById(userId).getUserName()
AttributeError: 'NoneType' object has no attribute 'getUserName'



Error in test test_content_files (plone.app.caching.tests.test_profile_with_caching_proxy.TestProfileWithCaching)
Traceback (most recent call last):
  File "/home/stefan/autotest/temp/python26-zope213-cmf22-plone41/eggs/unittest2-0.5.1-py2.6.egg/unittest2/case.py", line 340, in run
    testMethod()
  File "/home/stefan/autotest/temp/python26-zope213-cmf22-plone41/src/plone.app.caching/plone/app/caching/tests/test_profile_with_caching_proxy.py", line 309, in test_content_files
    setRoles(self.portal, TEST_USER_NAME, ('Manager',))
  File "/home/stefan/autotest/temp/python26-zope213-cmf22-plone41/eggs/plone.app.testing-4.0a4-py2.6.egg/plone/app/testing/helpers.py", line 36, in setRoles
    z2.setRoles(userFolder, userId, roles)
  File "/home/stefan/autotest/temp/python26-zope213-cmf22-plone41/eggs/plone.testing-4.0a4-py2.6.egg/plone/testing/z2.py", line 183, in setRoles
    userName = userFolder.getUserById(userId).getUserName()
AttributeError: 'NoneType' object has no attribute 'getUserName'



Error in test test_composite_views (plone.app.caching.tests.test_profile_without_caching_proxy.TestProfileWithoutCaching)
Traceback (most recent call last):
  File "/home/stefan/autotest/temp/python26-zope213-cmf22-plone41/eggs/unittest2-0.5.1-py2.6.egg/unittest2/case.py", line 340, in run
    testMethod()
  File "/home/stefan/autotest/temp/python26-zope213-cmf22-plone41/src/plone.app.caching/plone/app/caching/tests/test_profile_without_caching_proxy.py", line 69, in test_composite_views
    setRoles(self.portal, TEST_USER_NAME, ('Manager',))
  File "/home/stefan/autotest/temp/python26-zope213-cmf22-plone41/eggs/plone.app.testing-4.0a4-py2.6.egg/plone/app/testing/helpers.py", line 36, in setRoles
    z2.setRoles(userFolder, userId, roles)
  File "/home/stefan/autotest/temp/python26-zope213-cmf22-plone41/eggs/plone.testing-4.0a4-py2.6.egg/plone/testing/z2.py", line 183, in setRoles
    userName = userFolder.getUserById(userId).getUserName()
AttributeError: 'NoneType' object has no attribute 'getUserName'



Error in test test_content_feeds (plone.app.caching.tests.test_profile_without_caching_proxy.TestProfileWithoutCaching)
Traceback (most recent call last):
  File "/home/stefan/autotest/temp/python26-zope213-cmf22-plone41/eggs/unittest2-0.5.1-py2.6.egg/unittest2/case.py", line 340, in run
    testMethod()
  File "/home/stefan/autotest/temp/python26-zope213-cmf22-plone41/src/plone.app.caching/plone/app/caching/tests/test_profile_without_caching_proxy.py", line 234, in test_content_feeds
    setRoles(self.portal, TEST_USER_NAME, ('Manager',))
  File "/home/stefan/autotest/temp/python26-zope213-cmf22-plone41/eggs/plone.app.testing-4.0a4-py2.6.egg/plone/app/testing/helpers.py", line 36, in setRoles
    z2.setRoles(userFolder, userId, roles)
  File "/home/stefan/autotest/temp/python26-zope213-cmf22-plone41/eggs/plone.testing-4.0a4-py2.6.egg/plone/testing/z2.py", line 183, in setRoles
    userName = userFolder.getUserById(userId).getUserName()
AttributeError: 'NoneType' object has no attribute 'getUserName'



Error in test test_content_files (plone.app.caching.tests.test_profile_without_caching_proxy.TestProfileWithoutCaching)
Traceback (most recent call last):
  File "/home/stefan/autotest/temp/python26-zope213-cmf22-plone41/eggs/unittest2-0.5.1-py2.6.egg/unittest2/case.py", line 340, in run
    testMethod()
  File "/home/stefan/autotest/temp/python26-zope213-cmf22-plone41/src/plone.app.caching/plone/app/caching/tests/test_profile_without_caching_proxy.py", line 302, in test_content_files
    setRoles(self.portal, TEST_USER_NAME, ('Manager',))
  File "/home/stefan/autotest/temp/python26-zope213-cmf22-plone41/eggs/plone.app.testing-4.0a4-py2.6.egg/plone/app/testing/helpers.py", line 36, in setRoles
    z2.setRoles(userFolder, userId, roles)
  File "/home/stefan/autotest/temp/python26-zope213-cmf22-plone41/eggs/plone.testing-4.0a4-py2.6.egg/plone/testing/z2.py", line 183, in setRoles
    userName = userFolder.getUserById(userId).getUserName()
AttributeError: 'NoneType' object has no attribute 'getUserName'

  Ran 16 tests with 0 failures and 10 errors in 4.027 seconds.
Running plone.testing.zca.UnitTesting tests:
  Tear down plone.app.caching.testing.PloneAppCaching:Functional in 0.000 seconds.
  Tear down plone.app.caching.testing.PloneAppCaching in 0.004 seconds.
  Tear down plone.app.testing.layers.PloneFixture in 0.103 seconds.
  Tear down plone.testing.z2.Startup in 0.008 seconds.
  Tear down plone.testing.zca.LayerCleanup in 0.003 seconds.
  Set up plone.testing.zca.UnitTesting in 0.000 seconds.


Failure in test test_storeResponseInRAMCache_custom_keys (plone.app.caching.tests.test_operation_utils.RAMCacheTest)
Traceback (most recent call last):
  File "/home/stefan/autotest/temp/python26-zope213-cmf22-plone41/eggs/unittest2-0.5.1-py2.6.egg/unittest2/case.py", line 340, in run
    testMethod()
  File "/home/stefan/autotest/temp/python26-zope213-cmf22-plone41/src/plone.app.caching/plone/app/caching/tests/test_operation_utils.py", line 1338, in test_storeResponseInRAMCache_custom_keys
    self.assertEquals((200, {'status': '200 OK', 'x-foo': 'bar'}, u'Body', 0), cache['foo'])
  File "/home/stefan/autotest/temp/python26-zope213-cmf22-plone41/eggs/unittest2-0.5.1-py2.6.egg/unittest2/case.py", line 521, in assertEqual
    assertion_func(first, second, msg=msg)
  File "/home/stefan/autotest/temp/python26-zope213-cmf22-plone41/eggs/unittest2-0.5.1-py2.6.egg/unittest2/case.py", line 763, in assertTupleEqual
    self.assertSequenceEqual(tuple1, tuple2, msg, seq_type=tuple)
  File "/home/stefan/autotest/temp/python26-zope213-cmf22-plone41/eggs/unittest2-0.5.1-py2.6.egg/unittest2/case.py", line 734, in assertSequenceEqual
    self.fail(msg)
  File "/home/stefan/autotest/temp/python26-zope213-cmf22-plone41/eggs/unittest2-0.5.1-py2.6.egg/unittest2/case.py", line 415, in fail
    raise self.failureException(msg)
AssertionError: Tuples differ: (200, {'status': '200 OK', 'x-... != (200, {'x-foo': 'bar'}, u'Body...

First differing element 1:
{'status': '200 OK', 'x-foo': 'bar'}
{'x-foo': 'bar'}

- (200, {'status': '200 OK', 'x-foo': 'bar'}, u'Body', 0)
?        --------------------

+ (200, {'x-foo': 'bar'}, u'Body', 0)



Failure in test test_storeResponseInRAMCache_gzip (plone.app.caching.tests.test_operation_utils.RAMCacheTest)
Traceback (most recent call last):
  File "/home/stefan/autotest/temp/python26-zope213-cmf22-plone41/eggs/unittest2-0.5.1-py2.6.egg/unittest2/case.py", line 340, in run
    testMethod()
  File "/home/stefan/autotest/temp/python26-zope213-cmf22-plone41/src/plone.app.caching/plone/app/caching/tests/test_operation_utils.py", line 1307, in test_storeResponseInRAMCache_gzip
    self.assertEquals((200, {'status': '200 OK', 'x-foo': 'bar'}, u'Body', 1), cache['foo'])
  File "/home/stefan/autotest/temp/python26-zope213-cmf22-plone41/eggs/unittest2-0.5.1-py2.6.egg/unittest2/case.py", line 521, in assertEqual
    assertion_func(first, second, msg=msg)
  File "/home/stefan/autotest/temp/python26-zope213-cmf22-plone41/eggs/unittest2-0.5.1-py2.6.egg/unittest2/case.py", line 763, in assertTupleEqual
    self.assertSequenceEqual(tuple1, tuple2, msg, seq_type=tuple)
  File "/home/stefan/autotest/temp/python26-zope213-cmf22-plone41/eggs/unittest2-0.5.1-py2.6.egg/unittest2/case.py", line 734, in assertSequenceEqual
    self.fail(msg)
  File "/home/stefan/autotest/temp/python26-zope213-cmf22-plone41/eggs/unittest2-0.5.1-py2.6.egg/unittest2/case.py", line 415, in fail
    raise self.failureException(msg)
AssertionError: Tuples differ: (200, {'status': '200 OK', 'x-... != (200, {'x-foo': 'bar'}, u'Body...

First differing element 1:
{'status': '200 OK', 'x-foo': 'bar'}
{'x-foo': 'bar'}

- (200, {'status': '200 OK', 'x-foo': 'bar'}, u'Body', 1)
?        --------------------

+ (200, {'x-foo': 'bar'}, u'Body', 1)



Failure in test test_storeResponseInRAMCache_normal (plone.app.caching.tests.test_operation_utils.RAMCacheTest)
Traceback (most recent call last):
  File "/home/stefan/autotest/temp/python26-zope213-cmf22-plone41/eggs/unittest2-0.5.1-py2.6.egg/unittest2/case.py", line 340, in run
    testMethod()
  File "/home/stefan/autotest/temp/python26-zope213-cmf22-plone41/src/plone.app.caching/plone/app/caching/tests/test_operation_utils.py", line 1273, in test_storeResponseInRAMCache_normal
    self.assertEquals((200, {'status': '200 OK', 'x-foo': 'bar'}, u'Body', 0), cache['foo'])
  File "/home/stefan/autotest/temp/python26-zope213-cmf22-plone41/eggs/unittest2-0.5.1-py2.6.egg/unittest2/case.py", line 521, in assertEqual
    assertion_func(first, second, msg=msg)
  File "/home/stefan/autotest/temp/python26-zope213-cmf22-plone41/eggs/unittest2-0.5.1-py2.6.egg/unittest2/case.py", line 763, in assertTupleEqual
    self.assertSequenceEqual(tuple1, tuple2, msg, seq_type=tuple)
  File "/home/stefan/autotest/temp/python26-zope213-cmf22-plone41/eggs/unittest2-0.5.1-py2.6.egg/unittest2/case.py", line 734, in assertSequenceEqual
    self.fail(msg)
  File "/home/stefan/autotest/temp/python26-zope213-cmf22-plone41/eggs/unittest2-0.5.1-py2.6.egg/unittest2/case.py", line 415, in fail
    raise self.failureException(msg)
AssertionError: Tuples differ: (200, {'status': '200 OK', 'x-... != (200, {'x-foo': 'bar'}, u'Body...

First differing element 1:
{'status': '200 OK', 'x-foo': 'bar'}
{'x-foo': 'bar'}

- (200, {'status': '200 OK', 'x-foo': 'bar'}, u'Body', 0)
?        --------------------

+ (200, {'x-foo': 'bar'}, u'Body', 0)

  Ran 161 tests with 3 failures and 0 errors in 0.179 seconds.
Tearing down left over layers:
  Tear down plone.testing.zca.UnitTesting in 0.000 seconds.
Total: 177 tests, 3 failures, 10 errors in 13.351 seconds.
/home/stefan/autotest/temp/python26-zope213-cmf22-plone41/eggs/Products.CMFCore-2.2.2-py2.6.egg/Products/CMFCore/FSObject.py:21: DeprecationWarning: RoleManager is deprecated. RoleManager is no longer part of AccessControl, please depend on Zope2 and import from OFS.role or use the new minimal RoleManager class from AccessControl.rolemanager.
  from AccessControl.Role import RoleManager
Running plone.app.discussion.tests.layer.DiscussionLayer tests:
  Set up Testing.ZopeTestCase.layer.ZopeLite in 1.281 seconds.
  Set up Products.PloneTestCase.layer.ZCML/home/stefan/autotest/temp/python26-zope213-cmf22-plone41/eggs/zope.configuration-3.7.2-py2.6.egg/zope/configuration/fields.py:419: UserWarning: You did not specify an i18n translation domain for the 'title' field in /home/stefan/autotest/temp/python26-zope213-cmf22-plone41/eggs/Products.kupu-1.5.0b1-py2.6.egg/Products/kupu/plone/configure.zcml
  "'%s' field in %s" % (self.getName(), context.info.file )
/home/stefan/autotest/temp/python26-zope213-cmf22-plone41/eggs/zope.configuration-3.7.2-py2.6.egg/zope/configuration/fields.py:419: UserWarning: You did not specify an i18n translation domain for the 'description' field in /home/stefan/autotest/temp/python26-zope213-cmf22-plone41/eggs/Products.kupu-1.5.0b1-py2.6.egg/Products/kupu/plone/configure.zcml
  "'%s' field in %s" % (self.getName(), context.info.file )
 in 3.510 seconds.
  Set up Products.PloneTestCase.layer.PloneSite in 4.670 seconds.
  Set up plone.app.discussion.tests.layer.DiscussionLayer/home/stefan/autotest/temp/python26-zope213-cmf22-plone41/src/plone.app.discussion/plone/app/discussion/tests/layer.py:19: DeprecationWarning: load_config is deprecated. Please import from Zope2.App.zcml
  zcml.load_config("configure.zcml", plone.app.discussion)
 in 0.000 seconds.
  Ran 143 tests with 0 failures and 0 errors in 8.798 seconds.
Tearing down left over layers:
  Tear down plone.app.discussion.tests.layer.DiscussionLayer in 0.000 seconds.
  Tear down Products.PloneTestCase.layer.PloneSite in 0.191 seconds.
  Tear down Products.PloneTestCase.layer.ZCML in 0.005 seconds.
  Tear down Testing.ZopeTestCase.layer.ZopeLite in 0.000 seconds.
/home/stefan/autotest/temp/python26-zope213-cmf22-plone41/eggs/Products.CMFCore-2.2.2-py2.6.egg/Products/CMFCore/FSObject.py:21: DeprecationWarning: RoleManager is deprecated. RoleManager is no longer part of AccessControl, please depend on Zope2 and import from OFS.role or use the new minimal RoleManager class from AccessControl.rolemanager.
  from AccessControl.Role import RoleManager
Running Testing.ZopeTestCase.layer.ZopeLite tests:
  Set up Testing.ZopeTestCase.layer.ZopeLite in 0.830 seconds.
  Ran 2 tests with 0 failures and 0 errors in 0.008 seconds.
Running plone.app.folder.tests.layer.IntegrationLayer tests:
  Set up Products.PloneTestCase.layer.ZCML/home/stefan/autotest/temp/python26-zope213-cmf22-plone41/eggs/zope.configuration-3.7.2-py2.6.egg/zope/configuration/fields.py:419: UserWarning: You did not specify an i18n translation domain for the 'title' field in /home/stefan/autotest/temp/python26-zope213-cmf22-plone41/eggs/Products.kupu-1.5.0b1-py2.6.egg/Products/kupu/plone/configure.zcml
  "'%s' field in %s" % (self.getName(), context.info.file )
/home/stefan/autotest/temp/python26-zope213-cmf22-plone41/eggs/zope.configuration-3.7.2-py2.6.egg/zope/configuration/fields.py:419: UserWarning: You did not specify an i18n translation domain for the 'description' field in /home/stefan/autotest/temp/python26-zope213-cmf22-plone41/eggs/Products.kupu-1.5.0b1-py2.6.egg/Products/kupu/plone/configure.zcml
  "'%s' field in %s" % (self.getName(), context.info.file )
 in 3.457 seconds.
  Set up Products.PloneTestCase.layer.PloneSite in 4.507 seconds.
  Set up plone.app.folder.tests.layer.IntegrationLayer in 0.082 seconds.
  Ran 27 tests with 0 failures and 0 errors in 6.866 seconds.
Running plone.app.folder.tests.layer.PartialOrderingIntegrationLayer tests:
  Set up plone.app.folder.tests.layer.PartialOrderingIntegrationLayer in 0.000 seconds.
  Ran 3 tests with 0 failures and 0 errors in 0.331 seconds.
Tearing down left over layers:
  Tear down plone.app.folder.tests.layer.PartialOrderingIntegrationLayer in 0.000 seconds.
  Tear down plone.app.folder.tests.layer.IntegrationLayer in 0.000 seconds.
  Tear down Products.PloneTestCase.layer.PloneSite in 0.198 seconds.
  Tear down Products.PloneTestCase.layer.ZCML in 0.004 seconds.
  Tear down Testing.ZopeTestCase.layer.ZopeLite in 0.000 seconds.
Total: 32 tests, 0 failures, 0 errors in 16.900 seconds.
/home/stefan/autotest/temp/python26-zope213-cmf22-plone41/eggs/Products.CMFCore-2.2.2-py2.6.egg/Products/CMFCore/FSObject.py:21: DeprecationWarning: RoleManager is deprecated. RoleManager is no longer part of AccessControl, please depend on Zope2 and import from OFS.role or use the new minimal RoleManager class from AccessControl.rolemanager.
  from AccessControl.Role import RoleManager
/home/stefan/autotest/temp/python26-zope213-cmf22-plone41/eggs/plone.app.controlpanel-2.1b1-py2.6.egg/plone/app/controlpanel/tests/cptc.py:10: DeprecationWarning: Browser is deprecated. Please import from Testing.testbrowser
  from Products.Five.testbrowser import Browser
Running plone.app.imaging.testing.ImagingLayer tests:
  Set up Testing.ZopeTestCase.layer.ZopeLite in 0.817 seconds.
  Set up Products.PloneTestCase.layer.ZCML/home/stefan/autotest/temp/python26-zope213-cmf22-plone41/eggs/zope.configuration-3.7.2-py2.6.egg/zope/configuration/fields.py:419: UserWarning: You did not specify an i18n translation domain for the 'title' field in /home/stefan/autotest/temp/python26-zope213-cmf22-plone41/eggs/Products.kupu-1.5.0b1-py2.6.egg/Products/kupu/plone/configure.zcml
  "'%s' field in %s" % (self.getName(), context.info.file )
/home/stefan/autotest/temp/python26-zope213-cmf22-plone41/eggs/zope.configuration-3.7.2-py2.6.egg/zope/configuration/fields.py:419: UserWarning: You did not specify an i18n translation domain for the 'description' field in /home/stefan/autotest/temp/python26-zope213-cmf22-plone41/eggs/Products.kupu-1.5.0b1-py2.6.egg/Products/kupu/plone/configure.zcml
  "'%s' field in %s" % (self.getName(), context.info.file )
 in 3.546 seconds.
  Set up Products.PloneTestCase.layer.PloneSite in 4.397 seconds.
  Set up collective.testcaselayer.ptc.PTCLayer in 0.023 seconds.
  Set up plone.app.imaging.testing.ImagingLayer/home/stefan/autotest/temp/python26-zope213-cmf22-plone41/eggs/plone.app.imaging-1.0.1-py2.6.egg/plone/app/imaging/testing.py:14: DeprecationWarning: load_config is deprecated. Please import from Zope2.App.zcml
  zcml.load_config('testing.zcml', imaging)
 in 0.118 seconds.
  Ran 41 tests with 0 failures and 0 errors in 7.397 seconds.
Running zope.testing.testrunner.layer.UnitTests tests:
  Tear down plone.app.imaging.testing.ImagingLayer in 0.000 seconds.
  Tear down collective.testcaselayer.ptc.PTCLayer in 0.000 seconds.
  Tear down Products.PloneTestCase.layer.PloneSite in 0.191 seconds.
  Tear down Products.PloneTestCase.layer.ZCML in 0.006 seconds.
  Tear down Testing.ZopeTestCase.layer.ZopeLite in 0.000 seconds.
  Set up zope.testing.testrunner.layer.UnitTests in 0.000 seconds.
  Ran 7 tests with 0 failures and 0 errors in 0.001 seconds.
Tearing down left over layers:
  Tear down zope.testing.testrunner.layer.UnitTests in 0.000 seconds.
Total: 48 tests, 0 failures, 0 errors in 17.011 seconds.
/home/stefan/autotest/temp/python26-zope213-cmf22-plone41/eggs/Products.CMFCore-2.2.2-py2.6.egg/Products/CMFCore/FSObject.py:21: DeprecationWarning: RoleManager is deprecated. RoleManager is no longer part of AccessControl, please depend on Zope2 and import from OFS.role or use the new minimal RoleManager class from AccessControl.rolemanager.
  from AccessControl.Role import RoleManager
Running Products.PloneTestCase.layer.PloneSite tests:
  Set up Testing.ZopeTestCase.layer.ZopeLite in 1.401 seconds.
  Set up Products.PloneTestCase.layer.ZCML/home/stefan/autotest/temp/python26-zope213-cmf22-plone41/eggs/zope.configuration-3.7.2-py2.6.egg/zope/configuration/fields.py:419: UserWarning: You did not specify an i18n translation domain for the 'title' field in /home/stefan/autotest/temp/python26-zope213-cmf22-plone41/eggs/Products.kupu-1.5.0b1-py2.6.egg/Products/kupu/plone/configure.zcml
  "'%s' field in %s" % (self.getName(), context.info.file )
/home/stefan/autotest/temp/python26-zope213-cmf22-plone41/eggs/zope.configuration-3.7.2-py2.6.egg/zope/configuration/fields.py:419: UserWarning: You did not specify an i18n translation domain for the 'description' field in /home/stefan/autotest/temp/python26-zope213-cmf22-plone41/eggs/Products.kupu-1.5.0b1-py2.6.egg/Products/kupu/plone/configure.zcml
  "'%s' field in %s" % (self.getName(), context.info.file )
 in 3.551 seconds.
  Set up Products.PloneTestCase.layer.PloneSite in 4.367 seconds.
  Ran 1 tests with 0 failures and 0 errors in 0.292 seconds.
Tearing down left over layers:
  Tear down Products.PloneTestCase.layer.PloneSite in 0.191 seconds.
  Tear down Products.PloneTestCase.layer.ZCML in 0.005 seconds.
  Tear down Testing.ZopeTestCase.layer.ZopeLite in 0.000 seconds.
Running plone.app.linkintegrity.tests.layer.PloneLinkintegrity tests:
  Set up Testing.ZopeTestCase.layer.ZopeLite in 1.401 seconds.
  Set up Products.PloneTestCase.layer.ZCML/home/stefan/autotest/temp/python26-zope213-cmf22-plone41/eggs/zope.configuration-3.7.2-py2.6.egg/zope/configuration/fields.py:419: UserWarning: You did not specify an i18n translation domain for the 'title' field in /home/stefan/autotest/temp/python26-zope213-cmf22-plone41/eggs/Products.kupu-1.5.0b1-py2.6.egg/Products/kupu/plone/configure.zcml
  "'%s' field in %s" % (self.getName(), context.info.file )
/home/stefan/autotest/temp/python26-zope213-cmf22-plone41/eggs/zope.configuration-3.7.2-py2.6.egg/zope/configuration/fields.py:419: UserWarning: You did not specify an i18n translation domain for the 'description' field in /home/stefan/autotest/temp/python26-zope213-cmf22-plone41/eggs/Products.kupu-1.5.0b1-py2.6.egg/Products/kupu/plone/configure.zcml
  "'%s' field in %s" % (self.getName(), context.info.file )
 in 3.537 seconds.
  Set up Products.PloneTestCase.layer.PloneSite in 4.372 seconds.
  Set up collective.testcaselayer.ptc.PTCLayer in 0.024 seconds.
  Set up plone.app.linkintegrity.tests.layer.PloneLinkintegrity in 0.619 seconds.
  Ran 27 tests with 0 failures and 0 errors in 32.749 seconds.
Running zope.testing.testrunner.layer.UnitTests tests:
  Tear down plone.app.linkintegrity.tests.layer.PloneLinkintegrity in 0.000 seconds.
  Tear down collective.testcaselayer.ptc.PTCLayer in 0.000 seconds.
  Tear down Products.PloneTestCase.layer.PloneSite in 0.190 seconds.
  Tear down Products.PloneTestCase.layer.ZCML in 0.006 seconds.
  Tear down Testing.ZopeTestCase.layer.ZopeLite in 0.000 seconds.
  Set up zope.testing.testrunner.layer.UnitTests in 0.000 seconds.
  Ran 1 tests with 0 failures and 0 errors in 0.001 seconds.
Tearing down left over layers:
  Tear down zope.testing.testrunner.layer.UnitTests in 0.000 seconds.
Total: 28 tests, 0 failures, 0 errors in 43.529 seconds.
Total: 0 tests, 0 failures, 0 errors in 0.000 seconds.
/home/stefan/autotest/temp/python26-zope213-cmf22-plone41/eggs/plone.testing-4.0a4-py2.6.egg/plone/testing/z2.py:19: DeprecationWarning: Zope2VocabularyRegistry is deprecated. Please import from Zope2.App.schema
  from Products.Five.schema import Zope2VocabularyRegistry
Running plone.app.registry.testing.plone.app.registry:Integration tests:
  Set up plone.testing.zca.LayerCleanup in 0.000 seconds.
  Set up plone.testing.z2.Startup/home/stefan/autotest/temp/python26-zope213-cmf22-plone41/eggs/zope.configuration-3.7.2-py2.6.egg/zope/configuration/config.py:195: DeprecationWarning: FiveSecurityPolicy is deprecated. Please import from AccessControl.security
  obj = getattr(mod, oname)
 in 0.204 seconds.
  Set up plone.app.testing.layers.PloneFixture/home/stefan/autotest/temp/python26-zope213-cmf22-plone41/eggs/Products.CMFCore-2.2.2-py2.6.egg/Products/CMFCore/FSObject.py:21: DeprecationWarning: RoleManager is deprecated. RoleManager is no longer part of AccessControl, please depend on Zope2 and import from OFS.role or use the new minimal RoleManager class from AccessControl.rolemanager.
  from AccessControl.Role import RoleManager
 in 7.420 seconds.
  Set up plone.app.registry.testing.PloneAppRegistry in 0.308 seconds.
  Set up plone.app.registry.testing.plone.app.registry:Integration in 0.000 seconds.
  Ran 2 tests with 0 failures and 0 errors in 0.004 seconds.
Running plone.testing.zca.UnitTesting tests:
  Tear down plone.app.registry.testing.plone.app.registry:Integration in 0.000 seconds.
  Tear down plone.app.registry.testing.PloneAppRegistry in 0.003 seconds.
  Tear down plone.app.testing.layers.PloneFixture in 0.102 seconds.
  Tear down plone.testing.z2.Startup in 0.008 seconds.
  Tear down plone.testing.zca.LayerCleanup in 0.003 seconds.
  Set up plone.testing.zca.UnitTesting in 0.000 seconds.
  Ran 37 tests with 0 failures and 0 errors in 0.957 seconds.
Tearing down left over layers:
  Tear down plone.testing.zca.UnitTesting in 0.000 seconds.
Total: 39 tests, 0 failures, 0 errors in 9.459 seconds.
/home/stefan/autotest/temp/python26-zope213-cmf22-plone41/eggs/plone.testing-4.0a4-py2.6.egg/plone/testing/z2.py:19: DeprecationWarning: Zope2VocabularyRegistry is deprecated. Please import from Zope2.App.schema
  from Products.Five.schema import Zope2VocabularyRegistry
Running zope.testing.testrunner.layer.UnitTests tests:
  Set up zope.testing.testrunner.layer.UnitTests in 0.000 seconds.
/home/stefan/autotest/temp/python26-zope213-cmf22-plone41/eggs/zope.configuration-3.7.2-py2.6.egg/zope/configuration/config.py:195: DeprecationWarning: FiveSecurityPolicy is deprecated. Please import from AccessControl.security
  obj = getattr(mod, oname)
/home/stefan/autotest/temp/python26-zope213-cmf22-plone41/eggs/Products.CMFCore-2.2.2-py2.6.egg/Products/CMFCore/FSObject.py:21: DeprecationWarning: RoleManager is deprecated. RoleManager is no longer part of AccessControl, please depend on Zope2 and import from OFS.role or use the new minimal RoleManager class from AccessControl.rolemanager.
  from AccessControl.Role import RoleManager
  Ran 3 tests with 0 failures and 0 errors in 57.055 seconds.
Tearing down left over layers:
  Tear down zope.testing.testrunner.layer.UnitTests in 0.000 seconds.
/home/stefan/autotest/temp/python26-zope213-cmf22-plone41/eggs/Products.CMFCore-2.2.2-py2.6.egg/Products/CMFCore/FSObject.py:21: DeprecationWarning: RoleManager is deprecated. RoleManager is no longer part of AccessControl, please depend on Zope2 and import from OFS.role or use the new minimal RoleManager class from AccessControl.rolemanager.
  from AccessControl.Role import RoleManager
Running Products.PloneTestCase.layer.PloneSite tests:
  Set up Testing.ZopeTestCase.layer.ZopeLite in 1.317 seconds.
  Set up Products.PloneTestCase.layer.ZCML/home/stefan/autotest/temp/python26-zope213-cmf22-plone41/eggs/zope.configuration-3.7.2-py2.6.egg/zope/configuration/fields.py:419: UserWarning: You did not specify an i18n translation domain for the 'title' field in /home/stefan/autotest/temp/python26-zope213-cmf22-plone41/eggs/Products.kupu-1.5.0b1-py2.6.egg/Products/kupu/plone/configure.zcml
  "'%s' field in %s" % (self.getName(), context.info.file )
/home/stefan/autotest/temp/python26-zope213-cmf22-plone41/eggs/zope.configuration-3.7.2-py2.6.egg/zope/configuration/fields.py:419: UserWarning: You did not specify an i18n translation domain for the 'description' field in /home/stefan/autotest/temp/python26-zope213-cmf22-plone41/eggs/Products.kupu-1.5.0b1-py2.6.egg/Products/kupu/plone/configure.zcml
  "'%s' field in %s" % (self.getName(), context.info.file )
 in 3.622 seconds.
  Set up Products.PloneTestCase.layer.PloneSite in 4.371 seconds.
  Ran 7 tests with 0 failures and 0 errors in 7.880 seconds.
Tearing down left over layers:
  Tear down Products.PloneTestCase.layer.PloneSite in 0.189 seconds.
  Tear down Products.PloneTestCase.layer.ZCML in 0.006 seconds.
  Tear down Testing.ZopeTestCase.layer.ZopeLite in 0.000 seconds.
/home/stefan/autotest/temp/python26-zope213-cmf22-plone41/eggs/plone.testing-4.0a4-py2.6.egg/plone/testing/z2.py:19: DeprecationWarning: Zope2VocabularyRegistry is deprecated. Please import from Zope2.App.schema
  from Products.Five.schema import Zope2VocabularyRegistry
Running plone.app.uuid.testing.plone.app.uuid:Functional tests:
  Set up plone.testing.zca.LayerCleanup in 0.000 seconds.
  Set up plone.testing.z2.Startup/home/stefan/autotest/temp/python26-zope213-cmf22-plone41/eggs/zope.configuration-3.7.2-py2.6.egg/zope/configuration/config.py:195: DeprecationWarning: FiveSecurityPolicy is deprecated. Please import from AccessControl.security
  obj = getattr(mod, oname)
 in 0.270 seconds.
  Set up plone.app.testing.layers.PloneFixture/home/stefan/autotest/temp/python26-zope213-cmf22-plone41/eggs/Products.CMFCore-2.2.2-py2.6.egg/Products/CMFCore/FSObject.py:21: DeprecationWarning: RoleManager is deprecated. RoleManager is no longer part of AccessControl, please depend on Zope2 and import from OFS.role or use the new minimal RoleManager class from AccessControl.rolemanager.
  from AccessControl.Role import RoleManager
 in 7.422 seconds.
  Set up plone.app.uuid.testing.PloneAppUUID in 0.025 seconds.
  Set up plone.app.uuid.testing.plone.app.uuid:Functional in 0.000 seconds.
  Ran 3 tests with 0 failures and 0 errors in 1.036 seconds.
Running plone.app.uuid.testing.plone.app.uuid:Integration tests:
  Tear down plone.app.uuid.testing.plone.app.uuid:Functional in 0.000 seconds.
  Set up plone.app.uuid.testing.plone.app.uuid:Integration in 0.000 seconds.
  Ran 5 tests with 0 failures and 0 errors in 0.296 seconds.
Tearing down left over layers:
  Tear down plone.app.uuid.testing.plone.app.uuid:Integration in 0.000 seconds.
  Tear down plone.app.uuid.testing.PloneAppUUID in 0.003 seconds.
  Tear down plone.app.testing.layers.PloneFixture in 0.103 seconds.
  Tear down plone.testing.z2.Startup in 0.008 seconds.
  Tear down plone.testing.zca.LayerCleanup in 0.004 seconds.
Total: 8 tests, 0 failures, 0 errors in 9.656 seconds.
/home/stefan/autotest/temp/python26-zope213-cmf22-plone41/eggs/Products.CMFCore-2.2.2-py2.6.egg/Products/CMFCore/FSObject.py:21: DeprecationWarning: RoleManager is deprecated. RoleManager is no longer part of AccessControl, please depend on Zope2 and import from OFS.role or use the new minimal RoleManager class from AccessControl.rolemanager.
  from AccessControl.Role import RoleManager
/home/stefan/autotest/temp/python26-zope213-cmf22-plone41/eggs/plone.app.z3cform-0.5.3-py2.6.egg/plone/app/z3cform/tests/test_kss_attr.py:3: DeprecationWarning: Browser is deprecated. Please import from Testing.testbrowser
  from Products.Five.testbrowser import Browser
/home/stefan/autotest/temp/python26-zope213-cmf22-plone41/eggs/plone.app.z3cform-0.5.3-py2.6.egg/plone/app/z3cform/tests/tests.py:3: DeprecationWarning: zope.testing.doctest is deprecated in favour of the Python standard library doctest module
  import zope.testing.doctest
Running Products.PloneTestCase.layer.PloneSite tests:
  Set up Testing.ZopeTestCase.layer.ZopeLite in 1.449 seconds.
  Set up Products.PloneTestCase.layer.ZCML/home/stefan/autotest/temp/python26-zope213-cmf22-plone41/eggs/zope.configuration-3.7.2-py2.6.egg/zope/configuration/fields.py:419: UserWarning: You did not specify an i18n translation domain for the 'title' field in /home/stefan/autotest/temp/python26-zope213-cmf22-plone41/eggs/Products.kupu-1.5.0b1-py2.6.egg/Products/kupu/plone/configure.zcml
  "'%s' field in %s" % (self.getName(), context.info.file )
/home/stefan/autotest/temp/python26-zope213-cmf22-plone41/eggs/zope.configuration-3.7.2-py2.6.egg/zope/configuration/fields.py:419: UserWarning: You did not specify an i18n translation domain for the 'description' field in /home/stefan/autotest/temp/python26-zope213-cmf22-plone41/eggs/Products.kupu-1.5.0b1-py2.6.egg/Products/kupu/plone/configure.zcml
  "'%s' field in %s" % (self.getName(), context.info.file )
 in 3.485 seconds.
  Set up Products.PloneTestCase.layer.PloneSite/home/stefan/autotest/temp/python26-zope213-cmf22-plone41/eggs/plone.app.z3cform-0.5.3-py2.6.egg/plone/app/z3cform/tests/tests.py:21: DeprecationWarning: load_config is deprecated. Please import from Zope2.App.zcml
  zcml.load_config('testing.zcml', plone.app.z3cform.tests)
 in 4.650 seconds.
  Ran 5 tests with 0 failures and 0 errors in 0.758 seconds.
Running plone.app.z3cform.tests.layer.KSSUnitTestLayer tests:
  Tear down Products.PloneTestCase.layer.PloneSite in 0.188 seconds.
  Tear down Products.PloneTestCase.layer.ZCML in 0.005 seconds.
  Tear down Testing.ZopeTestCase.layer.ZopeLite in 0.000 seconds.
  Set up plone.app.z3cform.tests.layer.KSSUnitTestLayer in 0.368 seconds.
  Ran 9 tests with 0 failures and 0 errors in 0.137 seconds.
Running zope.testing.testrunner.layer.UnitTests tests:
  Tear down plone.app.z3cform.tests.layer.KSSUnitTestLayer in 0.001 seconds.
  Set up zope.testing.testrunner.layer.UnitTests in 0.000 seconds.
  Ran 3 tests with 0 failures and 0 errors in 0.004 seconds.
Tearing down left over layers:
  Tear down zope.testing.testrunner.layer.UnitTests in 0.000 seconds.
Total: 17 tests, 0 failures, 0 errors in 11.775 seconds.
/home/stefan/autotest/temp/python26-zope213-cmf22-plone41/eggs/plone.autoform-1.0b5-py2.6.egg/plone/autoform/tests/test_doctests.py:5: DeprecationWarning: zope.testing.doctest is deprecated in favour of the Python standard library doctest module
  import zope.testing.doctest
Running zope.testing.testrunner.layer.UnitTests tests:
  Set up zope.testing.testrunner.layer.UnitTests in 0.000 seconds.
  Ran 52 tests with 0 failures and 0 errors in 1.132 seconds.
Tearing down left over layers:
  Tear down zope.testing.testrunner.layer.UnitTests in 0.000 seconds.
Running zope.testing.testrunner.layer.UnitTests tests:
  Set up zope.testing.testrunner.layer.UnitTests in 0.000 seconds.
  Ran 61 tests with 0 failures and 0 errors in 5.161 seconds.
Tearing down left over layers:
  Tear down zope.testing.testrunner.layer.UnitTests in 0.000 seconds.
#### Running tests for group ATCT ####
#### Finished tests for group ATCT ####

#### Running tests for group Add-ons ####
#### Finished tests for group Add-ons ####

#### Running tests for group Archetypes ####
#### Finished tests for group Archetypes ####

#### Running tests for group CMF ####
#### Finished tests for group CMF ####

#### Running tests for group CMFEditions ####
#### Finished tests for group CMFEditions ####

#### Running tests for group Plone ####
#### Finished tests for group Plone ####

#### Running tests for group PlonePAS ####
#### Finished tests for group PlonePAS ####

#### Running tests for group plone ####
#### Finished tests for group plone ####

#### Running tests for group portlets ####
#### Finished tests for group portlets ####

#### Running tests for group z3c.autoinclude ####
#### Finished tests for group z3c.autoinclude ####

#### Running tests for AccessControl ####
#### Finished tests for AccessControl ####

#### Running tests for Plone ####
#### Finished tests for Plone ####

#### Running tests for Products.CMFTestCase ####
#### Finished tests for Products.CMFTestCase ####

#### Running tests for Products.ExtendedPathIndex ####
#### Finished tests for Products.ExtendedPathIndex ####

#### Running tests for Products.PasswordResetTool ####
#### Finished tests for Products.PasswordResetTool ####

#### Running tests for Products.PloneTestCase ####
#### Finished tests for Products.PloneTestCase ####

#### Running tests for Products.ResourceRegistries ####
#### Finished tests for Products.ResourceRegistries ####

#### Running tests for Products.TinyMCE ####
#### Finished tests for Products.TinyMCE ####

#### Running tests for Products.ZCatalog ####
#### Finished tests for Products.ZCatalog ####

#### Running tests for Products.contentmigration ####
#### Finished tests for Products.contentmigration ####

#### Running tests for Products.i18ntestcase ####
#### Finished tests for Products.i18ntestcase ####

#### Running tests for archetypes.referencebrowserwidget ####
#### Finished tests for archetypes.referencebrowserwidget ####

#### Running tests for archetypes.schemaextender ####
#### Finished tests for archetypes.schemaextender ####

#### Running tests for collective.monkeypatcher ####
#### Finished tests for collective.monkeypatcher ####

#### Running tests for collective.z3cform.datetimewidget ####
#### Finished tests for collective.z3cform.datetimewidget ####

#### Running tests for five.customerize ####
#### Finished tests for five.customerize ####

#### Running tests for five.formlib ####
#### Finished tests for five.formlib ####

#### Running tests for kss.core ####
#### Finished tests for kss.core ####

#### Running tests for plone.app.blob ####
#### Finished tests for plone.app.blob ####

#### Running tests for plone.app.caching ####
#### Finished tests for plone.app.caching ####

#### Running tests for plone.app.discussion ####
#### Finished tests for plone.app.discussion ####

#### Running tests for plone.app.folder ####
#### Finished tests for plone.app.folder ####

#### Running tests for plone.app.imaging ####
#### Finished tests for plone.app.imaging ####

#### Running tests for plone.app.jquerytools ####
#### Finished tests for plone.app.jquerytools ####

#### Running tests for plone.app.linkintegrity ####
#### Finished tests for plone.app.linkintegrity ####

#### Running tests for plone.app.locales ####
#### Finished tests for plone.app.locales ####

#### Running tests for plone.app.registry ####
#### Finished tests for plone.app.registry ####

#### Running tests for plone.app.testing ####
#### Finished tests for plone.app.testing ####

#### Running tests for plone.app.users ####
#### Finished tests for plone.app.users ####

#### Running tests for plone.app.uuid ####
#### Finished tests for plone.app.uuid ####

#### Running tests for plone.app.z3cform ####
#### Finished tests for plone.app.z3cform ####

#### Running tests for plone.autoform ####
#### Finished tests for plone.autoform ####

#### Running tests for plone.cachepurging ####
#### Finished tests for plone.cachepurgRunning zope.testing.testrunner.layer.UnitTests tests:
  Set up zope.testing.testrunner.layer.UnitTests in 0.000 seconds.
  Ran 57 tests with 0 failures and 0 errors in 0.050 seconds.
Tearing down left over layers:
  Tear down zope.testing.testrunner.layer.UnitTests in 0.000 seconds.
/home/stefan/autotest/temp/python26-zope213-cmf22-plone41/eggs/Products.CMFCore-2.2.2-py2.6.egg/Products/CMFCore/FSObject.py:21: DeprecationWarning: RoleManager is deprecated. RoleManager is no longer part of AccessControl, please depend on Zope2 and import from OFS.role or use the new minimal RoleManager class from AccessControl.rolemanager.
  from AccessControl.Role import RoleManager
/home/stefan/autotest/temp/python26-zope213-cmf22-plone41/eggs/plone.folder-1.0.1-py2.6.egg/plone/folder/tests/layer.py:2: DeprecationWarning: load_config is deprecated. Please import from Zope2.App.zcml
  from Products.Five.zcml import load_config
Running plone.folder.tests.layer.PloneFolderLayer tests:
  Set up plone.folder.tests.layer.PloneFolderLayer in 0.007 seconds.
/home/stefan/autotest/temp/python26-zope213-cmf22-plone41/eggs/zope.configuration-3.7.2-py2.6.egg/zope/configuration/fields.py:419: UserWarning: You did not specify an i18n translation domain for the 'title' field in /home/stefan/autotest/temp/python26-zope213-cmf22-plone41/eggs/Products.kupu-1.5.0b1-py2.6.egg/Products/kupu/plone/configure.zcml
  "'%s' field in %s" % (self.getName(), context.info.file )
/home/stefan/autotest/temp/python26-zope213-cmf22-plone41/eggs/zope.configuration-3.7.2-py2.6.egg/zope/configuration/fields.py:419: UserWarning: You did not specify an i18n translation domain for the 'description' field in /home/stefan/autotest/temp/python26-zope213-cmf22-plone41/eggs/Products.kupu-1.5.0b1-py2.6.egg/Products/kupu/plone/configure.zcml
  "'%s' field in %s" % (self.getName(), context.info.file )
  Ran 67 tests with 0 failures and 0 errors in 5.139 seconds.
Tearing down left over layers:
  Tear down plone.folder.tests.layer.PloneFolderLayer in 0.000 seconds.
/home/stefan/autotest/temp/python26-zope213-cmf22-plone41/eggs/Products.CMFCore-2.2.2-py2.6.egg/Products/CMFCore/FSObject.py:21: DeprecationWarning: RoleManager is deprecated. RoleManager is no longer part of AccessControl, please depend on Zope2 and import from OFS.role or use the new minimal RoleManager class from AccessControl.rolemanager.
  from AccessControl.Role import RoleManager
Running plone.outputfilters.tests.base.layer tests:
  Set up Testing.ZopeTestCase.layer.ZopeLite in 1.201 seconds.
  Set up Products.PloneTestCase.layer.ZCML/home/stefan/autotest/temp/python26-zope213-cmf22-plone41/eggs/zope.configuration-3.7.2-py2.6.egg/zope/configuration/fields.py:419: UserWarning: You did not specify an i18n translation domain for the 'title' field in /home/stefan/autotest/temp/python26-zope213-cmf22-plone41/eggs/Products.kupu-1.5.0b1-py2.6.egg/Products/kupu/plone/configure.zcml
  "'%s' field in %s" % (self.getName(), context.info.file )
/home/stefan/autotest/temp/python26-zope213-cmf22-plone41/eggs/zope.configuration-3.7.2-py2.6.egg/zope/configuration/fields.py:419: UserWarning: You did not specify an i18n translation domain for the 'description' field in /home/stefan/autotest/temp/python26-zope213-cmf22-plone41/eggs/Products.kupu-1.5.0b1-py2.6.egg/Products/kupu/plone/configure.zcml
  "'%s' field in %s" % (self.getName(), context.info.file )
 in 3.661 seconds.
  Set up Products.PloneTestCase.layer.PloneSite in 4.471 seconds.
  Set up plone.outputfilters.tests.base.layer in 0.000 seconds.
/home/stefan/autotest/temp/python26-zope213-cmf22-plone41/eggs/plone.outputfilters-1.0b1-py2.6.egg/plone/outputfilters/README.txt:1: DeprecationWarning: load_string is deprecated. Please import from Zope2.App.zcml
  Introduction
  Ran 33 tests with 0 failures and 0 errors in 5.190 seconds.
Running zope.testing.testrunner.layer.UnitTests tests:
  Tear down plone.outputfilters.tests.base.layer in 0.000 seconds.
  Tear down Products.PloneTestCase.layer.PloneSite in 0.192 seconds.
  Tear down Products.PloneTestCase.layer.ZCML in 0.005 seconds.
  Tear down Testing.ZopeTestCase.layer.ZopeLite in 0.000 seconds.
  Set up zope.testing.testrunner.layer.UnitTests in 0.000 seconds.
  Ran 4 tests with 0 failures and 0 errors in 0.000 seconds.
Tearing down left over layers:
  Tear down zope.testing.testrunner.layer.UnitTests in 0.000 seconds.
Total: 37 tests, 0 failures, 0 errors in 15.219 seconds.
/home/stefan/autotest/temp/python26-zope213-cmf22-plone41/src/plone.registry/plone/registry/tests.py:4: DeprecationWarning: zope.testing.doctestunit is deprecated in favour of the Python standard library doctest module
  from zope.testing import doctestunit
/home/stefan/autotest/temp/python26-zope213-cmf22-plone41/eggs/zope.testing-3.9.4-py2.6.egg/zope/testing/doctestunit.py:27: DeprecationWarning: zope.testing.doctest is deprecated in favour of the Python standard library doctest module
  from doctest import DocFileSuite, DocTestSuite
Running zope.testing.testrunner.layer.UnitTests tests:
  Set up zope.testing.testrunner.layer.UnitTests in 0.000 seconds.
/home/stefan/autotest/temp/python26-zope213-cmf22-plone41/src/plone.registry/plone/registry/registry.py:256: DeprecationWarning: The Records persistent class is deprecated and should not be used.
  warnings.warn("The Records persistent class is deprecated and should not be used.", DeprecationWarning)
  Ran 105 tests with 0 failures and 0 errors in 0.054 seconds.
Tearing down left over layers:
  Tear down zope.testing.testrunner.layer.UnitTests in 0.000 seconds.
Total: 0 tests, 0 failures, 0 errors in 0.000 seconds.
/home/stefan/autotest/temp/python26-zope213-cmf22-plone41/eggs/Products.CMFCore-2.2.2-py2.6.egg/Products/CMFCore/FSObject.py:21: DeprecationWarning: RoleManager is deprecated. RoleManager is no longer part of AccessControl, please depend on Zope2 and import from OFS.role or use the new minimal RoleManager class from AccessControl.rolemanager.
  from AccessControl.Role import RoleManager
/home/stefan/autotest/temp/python26-zope213-cmf22-plone41/eggs/plone.stringinterp-1.0.3-py2.6.egg/plone/stringinterp/tests/stringinterpTestCase.py:5: DeprecationWarning: Browser is deprecated. Please import from Testing.testbrowser
  from Products.Five.testbrowser import Browser
Running Products.PloneTestCase.layer.PloneSite tests:
  Set up Testing.ZopeTestCase.layer.ZopeLite in 1.402 seconds.
  Set up Products.PloneTestCase.layer.ZCML/home/stefan/autotest/temp/python26-zope213-cmf22-plone41/eggs/zope.configuration-3.7.2-py2.6.egg/zope/configuration/fields.py:419: UserWarning: You did not specify an i18n translation domain for the 'title' field in /home/stefan/autotest/temp/python26-zope213-cmf22-plone41/eggs/Products.kupu-1.5.0b1-py2.6.egg/Products/kupu/plone/configure.zcml
  "'%s' field in %s" % (self.getName(), context.info.file )
/home/stefan/autotest/temp/python26-zope213-cmf22-plone41/eggs/zope.configuration-3.7.2-py2.6.egg/zope/configuration/fields.py:419: UserWarning: You did not specify an i18n translation domain for the 'description' field in /home/stefan/autotest/temp/python26-zope213-cmf22-plone41/eggs/Products.kupu-1.5.0b1-py2.6.egg/Products/kupu/plone/configure.zcml
  "'%s' field in %s" % (self.getName(), context.info.file )
 in 3.553 seconds.
  Set up Products.PloneTestCase.layer.PloneSite/home/stefan/autotest/temp/python26-zope213-cmf22-plone41/eggs/plone.stringinterp-1.0.3-py2.6.egg/plone/stringinterp/tests/stringinterpTestCase.py:19: DeprecationWarning: load_config is deprecated. Please import from Zope2.App.zcml
  zcml.load_config('configure.zcml', plone.stringinterp)
 in 4.531 seconds.
  Ran 2 tests with 0 failures and 0 errors in 0.413 seconds.
Tearing down left over layers:
  Tear down Products.PloneTestCase.layer.PloneSite in 0.187 seconds.
  Tear down Products.PloneTestCase.layer.ZCML in 0.004 seconds.
  Tear down Testing.ZopeTestCase.layer.ZopeLite in 0.000 seconds.
/home/stefan/autotest/temp/python26-zope213-cmf22-plone41/eggs/plone.supermodel-1.0b6-py2.6.egg/plone/supermodel/tests.py:7: DeprecationWarning: zope.testing.doctest is deprecated in favour of the Python standard library doctest module
  from zope.testing import doctest
Running zope.testing.testrunner.layer.UnitTests tests:
  Set up zope.testing.testrunner.layer.UnitTests in 0.000 seconds.
  Ran 67 tests with 0 failures and 0 errors in 0.219 seconds.
Tearing down left over layers:
  Tear down zope.testing.testrunner.layer.UnitTests in 0.000 seconds.
Test-module import failures:

Module: plone.testing.tests

IOError: [Errno 2] No such file or directory: '/home/stefan/autotest/temp/python26-zope213-cmf22-plone41/eggs/plone.testing-4.0a4-py2.6.egg/plone/testing/../../../README.txt'



Test-modules with import problems:
  plone.testing.tests
Total: 0 tests, 0 failures, 0 errors in 0.000 seconds.
Running zope.testing.testrunner.layer.UnitTests tests:
  Set up zope.testing.testrunner.layer.UnitTests in 0.000 seconds.
  Ran 23 tests with 0 failures and 0 errors in 0.028 seconds.
Tearing down left over layers:
  Tear down zope.testing.testrunner.layer.UnitTests in 0.000 seconds.
Running zope.testing.testrunner.layer.UnitTests tests:
  Set up zope.testing.testrunner.layer.UnitTests in 0.000 seconds.
  Ran 6 tests with 0 failures and 0 errors in 0.759 seconds.
Tearing down left over layers:
  Tear down zope.testing.testrunner.layer.UnitTests in 0.000 seconds.
/home/stefan/autotest/temp/python26-zope213-cmf22-plone41/eggs/plone.z3cform-0.7.1-py2.6.egg/plone/z3cform/tests.py:4: DeprecationWarning: zope.testing.doctest is deprecated in favour of the Python standard library doctest module
  from zope.testing import doctest
Running plone.z3cform.testing_zcml_layer tests:
  Set up plone.z3cform.testing_zcml_layer in 0.314 seconds.
  Ran 33 tests with 0 failures and 0 errors in 0.199 seconds.
Running zope.testing.testrunner.layer.UnitTests tests:
  Tear down plone.z3cform.testing_zcml_layer ... not supported
  Running in a subprocess.
  Set up zope.testing.testrunner.layer.UnitTests in 0.000 seconds.
  Ran 39 tests with 0 failures and 0 errors in 0.740 seconds.
  Tear down zope.testing.testrunner.layer.UnitTests in 0.000 seconds.
Total: 72 tests, 0 failures, 0 errors in 3.876 seconds.
Total: 0 tests, 0 failures, 0 errors in 0.000 seconds.
/home/stefan/autotest/temp/python26-zope213-cmf22-plone41/eggs/Products.CMFCore-2.2.2-py2.6.egg/Products/CMFCore/FSObject.py:21: DeprecationWarning: RoleManager is deprecated. RoleManager is no longer part of AccessControl, please depend on Zope2 and import from OFS.role or use the new minimal RoleManager class from AccessControl.rolemanager.
  from AccessControl.Role import RoleManager
/home/stefan/autotest/temp/python26-zope213-cmf22-plone41/src/plonetheme.sunburst/plonetheme/sunburst/tests/base.py:6: DeprecationWarning: Browser is deprecated. Please import from Testing.testbrowser
  from Products.Five.testbrowser import Browser
Running plonetheme.sunburst.tests.base.Layer tests:
  Set up Testing.ZopeTestCase.layer.ZopeLite in 1.401 seconds.
  Set up Products.PloneTestCase.layer.ZCML/home/stefan/autotest/temp/python26-zope213-cmf22-plone41/eggs/zope.configuration-3.7.2-py2.6.egg/zope/configuration/fields.py:419: UserWarning: You did not specify an i18n translation domain for the 'title' field in /home/stefan/autotest/temp/python26-zope213-cmf22-plone41/eggs/Products.kupu-1.5.0b1-py2.6.egg/Products/kupu/plone/configure.zcml
  "'%s' field in %s" % (self.getName(), context.info.file )
/home/stefan/autotest/temp/python26-zope213-cmf22-plone41/eggs/zope.configuration-3.7.2-py2.6.egg/zope/configuration/fields.py:419: UserWarning: You did not specify an i18n translation domain for the 'description' field in /home/stefan/autotest/temp/python26-zope213-cmf22-plone41/eggs/Products.kupu-1.5.0b1-py2.6.egg/Products/kupu/plone/configure.zcml
  "'%s' field in %s" % (self.getName(), context.info.file )
 in 3.554 seconds.
  Set up Products.PloneTestCase.layer.PloneSite in 4.366 seconds.
  Set up collective.testcaselayer.ptc.PTCLayer in 0.023 seconds.
  Set up plonetheme.sunburst.tests.base.Layer/home/stefan/autotest/temp/python26-zope213-cmf22-plone41/src/plonetheme.sunburst/plonetheme/sunburst/tests/base.py:18: DeprecationWarning: load_config is deprecated. Please import from Zope2.App.zcml
  zcml.load_config('configure.zcml', package=sunburst)
 in 0.006 seconds.
/home/stefan/autotest/temp/python26-zope213-cmf22-plone41/src/plonetheme.sunburst/plonetheme/sunburst/README.txt:1: DeprecationWarning: load_string is deprecated. Please import from Zope2.App.zcml
  plonetheme.sunburst
  Ran 3 tests with 0 failures and 0 errors in 1.166 seconds.
Tearing down left over layers:
  Tear down plonetheme.sunburst.tests.base.Layer in 0.000 seconds.
  Tear down collective.testcaselayer.ptc.PTCLayer in 0.000 seconds.
  Tear down Products.PloneTestCase.layer.PloneSite in 0.189 seconds.
  Tear down Products.PloneTestCase.layer.ZCML in 0.005 seconds.
  Tear down Testing.ZopeTestCase.layer.ZopeLite in 0.000 seconds.
/home/stefan/autotest/temp/python26-zope213-cmf22-plone41/eggs/Products.CMFCore-2.2.2-py2.6.egg/Products/CMFCore/FSObject.py:21: DeprecationWarning: RoleManager is deprecated. RoleManager is no longer part of AccessControl, please depend on Zope2 and import from OFS.role or use the new minimal RoleManager class from AccessControl.rolemanager.
  from AccessControl.Role import RoleManager
/home/stefan/autotest/temp/python26-zope213-cmf22-plone41/eggs/wicked-1.1.9-py2.6.egg/wicked/utils.py:223: DeprecationWarning: zope.testing.doctest is deprecated in favour of the Python standard library doctest module
  from zope.testing import doctest
Running Products.PloneTestCase.layer.ZCML tests:
  Set up Testing.ZopeTestCase.layer.ZopeLite in 0.827 seconds.
  Set up Products.PloneTestCase.layer.ZCML/home/stefan/autotest/temp/python26-zope213-cmf22-plone41/eggs/zope.configuration-3.7.2-py2.6.egg/zope/configuration/fields.py:419: UserWarning: You did not specify an i18n translation domain for the 'title' field in /home/stefan/autotest/temp/python26-zope213-cmf22-plone41/eggs/Products.kupu-1.5.0b1-py2.6.egg/Products/kupu/plone/configure.zcml
  "'%s' field in %s" % (self.getName(), context.info.file )
/home/stefan/autotest/temp/python26-zope213-cmf22-plone41/eggs/zope.configuration-3.7.2-py2.6.egg/zope/configuration/fields.py:419: UserWarning: You did not specify an i18n translation domain for the 'description' field in /home/stefan/autotest/temp/python26-zope213-cmf22-plone41/eggs/Products.kupu-1.5.0b1-py2.6.egg/Products/kupu/plone/configure.zcml
  "'%s' field in %s" % (self.getName(), context.info.file )
 in 3.573 seconds.
  Ran 3 tests with 0 failures and 0 errors in 0.037 seconds.
Running wicked.at.tests.wickedtestcase.WickedSite tests:
  Set up Products.PloneTestCase.layer.PloneSite/home/stefan/autotest/temp/python26-zope213-cmf22-plone41/eggs/wicked-1.1.9-py2.6.egg/wicked/at/tests/wickedtestcase.py:19: DeprecationWarning: load_config is deprecated. Please import from Zope2.App.zcml
  zcml.load_config("configure.zcml", package=wicked.atcontent)
 in 5.281 seconds.
  Set up wicked.at.tests.wickedtestcase.WickedSite in 0.002 seconds.
  Ran 23 tests with 0 failures and 0 errors in 5.429 seconds.
Running wicked.at.tests.test_scope.Scoped tests:
  Set up wicked.at.tests.test_scope.Scoped in 0.001 seconds.
  Ran 3 tests with 0 failures and 0 errors in 0.604 seconds.
Running wicked.plone.tests.SelectiveATCT tests:
  Tear down wicked.at.tests.test_scope.Scoped in 0.000 seconds.
  Tear down wicked.at.tests.wickedtestcase.WickedSite in 0.002 seconds.
  Set up wicked.plone.tests.SelectiveATCT in 0.003 seconds.
  Ran 22 tests with 0 failures and 0 errors in 6.654 seconds.
Running wicked.plone.tests.ZCMLLayer tests:
  Tear down wicked.plone.tests.SelectiveATCT in 0.004 seconds.
  Set up wicked.plone.tests.ZCMLLayer in 0.020 seconds.
  Ran 2 tests with 0 failures and 0 errors in 0.675 seconds.
Running zope.testing.testrunner.layer.UnitTests tests:
  Tear down wicked.plone.tests.ZCMLLayer in 0.208 seconds.
  Tear down Products.PloneTestCase.layer.PloneSite in 0.001 seconds.
  Tear down Products.PloneTestCase.layer.ZCML in 0.004 seconds.
  Tear down Testing.ZopeTestCase.layer.ZopeLite in 0.000 seconds.
  Set up zope.testing.testrunner.layer.UnitTests in 0.000 seconds.
  Ran 34 tests with 0 failures and 0 errors in 0.017 seconds.
Tearing down left over layers:
  Tear down zope.testing.testrunner.layer.UnitTests in 0.000 seconds.
Total: 87 tests, 0 failures, 0 errors in 24.699 seconds.
Running zope.testing.testrunner.layer.UnitTests tests:
  Set up zope.testing.testrunner.layer.UnitTests in 0.000 seconds.
  Ran 2 tests with 0 failures and 0 errors in 0.014 seconds.
Tearing down left over layers:
  Tear down zope.testing.testrunner.layer.UnitTests in 0.000 seconds.
Running zope.testing.testrunner.layer.UnitTests tests:
  Set up zope.testing.testrunner.layer.UnitTests in 0.000 seconds.
  Ran 38 tests with 0 failures and 0 errors in 3.776 seconds.
Tearing down left over layers:
  Tear down zope.testing.testrunner.layer.UnitTests in 0.000 seconds.
/home/stefan/autotest/temp/python26-zope213-cmf22-plone41/eggs/z3c.formwidget.query-0.5-py2.6.egg/z3c/formwidget/query/tests.py:4: DeprecationWarning: zope.testing.doctestunit is deprecated in favour of the Python standard library doctest module
  from zope.testing import doctestunit
/home/stefan/autotest/temp/python26-zope213-cmf22-plone41/eggs/zope.testing-3.9.4-py2.6.egg/zope/testing/doctestunit.py:27: DeprecationWarning: zope.testing.doctest is deprecated in favour of the Python standard library doctest module
  from doctest import DocFileSuite, DocTestSuite
Running zope.testing.testrunner.layer.UnitTests tests:
  Set up zope.testing.testrunner.layer.UnitTests in 0.000 seconds.
  Ran 25 tests with 0 failures and 0 errors in 0.392 seconds.
Tearing down left over layers:
  Tear down zope.testing.testrunner.layer.UnitTests in 0.000 seconds.
ing ####

#### Running tests for plone.caching ####
#### Finished tests for plone.caching ####

#### Running tests for plone.folder ####
#### Finished tests for plone.folder ####

#### Running tests for plone.outputfilters ####
#### Finished tests for plone.outputfilters ####

#### Running tests for plone.registry ####
#### Finished tests for plone.registry ####

#### Running tests for plone.scale ####
#### Finished tests for plone.scale ####

#### Running tests for plone.stringinterp ####
#### Finished tests for plone.stringinterp ####

#### Running tests for plone.supermodel ####
#### Finished tests for plone.supermodel ####

#### Running tests for plone.testing ####
#### Finished tests for plone.testing ####

#### Running tests for plone.transformchain ####
#### Finished tests for plone.transformchain ####

#### Running tests for plone.uuid ####
#### Finished tests for plone.uuid ####

#### Running tests for plone.z3cform ####
#### Finished tests for plone.z3cform ####

#### Running tests for plonetheme.classic ####
#### Finished tests for plonetheme.classic ####

#### Running tests for plonetheme.sunburst ####
#### Finished tests for plonetheme.sunburst ####

#### Running tests for wicked ####
#### Finished tests for wicked ####

#### Running tests for z3c.batching ####
#### Finished tests for z3c.batching ####

#### Running tests for z3c.form ####
#### Finished tests for z3c.form ####

#### Running tests for z3c.formwidget.query ####
#### Finished tests for z3c.formwidget.query ####

Packages with test failures:

Failing tests in group Add-ons
Failing tests in group CMF
Failing tests in group Plone
Failing tests in Plone
Failing tests in five.customerize
Failing tests in five.formlib
Failing tests in plone.app.caching
Failing tests in plone.testing

Total time elapsed: 1356.600 seconds

Grand total: 113 packages, 8 failures


FAILED (113 packages, 8 failures)



More information about the Testbot mailing list