[Testbot] FAILED (99 packages, 1 failures) : Plone-4.0 Zope-2.12 Python-2.6.6

Plone Tests plone-tests at epy.co.at
Tue Aug 30 07:35:06 UTC 2011


Plone Tests : FAILED (99 packages, 1 failures)
Plone-4.0 Zope-2.12 Python-2.6.6

Running ./bin/alltests -q --no-color --no-progress
Running Products.CMFTestCase.layer.CMFSite tests:
  Set up Testing.ZopeTestCase.layer.ZopeLite in 0.952 seconds.
  Set up Products.CMFTestCase.layer.ZCML in 2.727 seconds.
  Set up Products.CMFTestCase.layer.CMFSite in 1.475 seconds.
  Ran 31 tests with 0 failures and 0 errors in 0.553 seconds.
Running Products.PloneTestCase.layer.PloneSite tests:
  Tear down Products.CMFTestCase.layer.CMFSite in 0.032 seconds.
  Tear down Products.CMFTestCase.layer.ZCML in 0.003 seconds.
  Set up Products.PloneTestCase.layer.ZCML in 1.747 seconds.
  Set up Products.PloneTestCase.layer.PloneSite in 3.806 seconds.
  Ran 614 tests with 0 failures and 0 errors in 1 minutes 17.244 seconds.
Tearing down left over layers:
  Tear down Products.PloneTestCase.layer.PloneSite in 0.210 seconds.
  Tear down Products.PloneTestCase.layer.ZCML in 0.010 seconds.
  Tear down Testing.ZopeTestCase.layer.ZopeLite in 0.000 seconds.
Total: 645 tests, 0 failures, 0 errors in 1 minutes 29.248 seconds.
Running Testing.ZopeTestCase.layer.ZopeLite tests:
  Set up Testing.ZopeTestCase.layer.ZopeLite in 0.862 seconds.
  Ran 9 tests with 0 failures and 0 errors in 0.107 seconds.
Running Products.Archetypes.tests.layer.ZCML tests:
  Set up Products.CMFCore.testing.FunctionalZCMLLayer in 0.248 seconds.
  Set up Products.Archetypes.tests.layer.ZCML in 0.190 seconds.
  Ran 59 tests with 0 failures and 0 errors in 1.067 seconds.
Running Products.Archetypes.tests.layer.ArchetypesSite tests:
  Set up Products.Archetypes.tests.layer.ArchetypesSite in 1.373 seconds.
  Ran 447 tests with 0 failures and 0 errors in 35.461 seconds.
Running Products.PloneTestCase.layer.PloneSite tests:
  Tear down Products.Archetypes.tests.layer.ArchetypesSite in 0.040 seconds.
  Tear down Products.Archetypes.tests.layer.ZCML in 0.004 seconds.
  Tear down Products.CMFCore.testing.FunctionalZCMLLayer in 0.000 seconds.
  Set up Products.PloneTestCase.layer.ZCML in 2.387 seconds.
  Set up Products.PloneTestCase.layer.PloneSite in 3.677 seconds.
  Ran 10 tests with 0 failures and 0 errors in 1.409 seconds.
Running plone.app.kss.tests.kss_and_plone_layer.KSSAndPloneLayer tests:
  Set up plone.app.kss.tests.kss_and_plone_layer.KSSAndPloneLayer in 0.005 seconds.
  Ran 19 tests with 0 failures and 0 errors in 1.666 seconds.
Running zope.testing.testrunner.layer.UnitTests tests:
  Tear down plone.app.kss.tests.kss_and_plone_layer.KSSAndPloneLayer in 0.000 seconds.
  Tear down Products.PloneTestCase.layer.PloneSite in 0.199 seconds.
  Tear down Products.PloneTestCase.layer.ZCML in 0.005 seconds.
  Tear down Testing.ZopeTestCase.layer.ZopeLite in 0.000 seconds.
  Set up zope.testing.testrunner.layer.UnitTests in 0.000 seconds.
  Ran 25 tests with 0 failures and 0 errors in 0.126 seconds.
Tearing down left over layers:
  Tear down zope.testing.testrunner.layer.UnitTests in 0.000 seconds.
Total: 569 tests, 0 failures, 0 errors in 50.231 seconds.
Running Testing.ZopeTestCase.layer.ZopeLite tests:
  Set up Testing.ZopeTestCase.layer.ZopeLite in 0.096 seconds.
  Ran 229 tests with 0 failures and 0 errors in 1.332 seconds.
Running Products.CMFCalendar.testing.FunctionalLayer tests:
  Set up Products.CMFCore.testing.FunctionalZCMLLayer in 0.203 seconds.
  Set up Products.CMFCalendar.testing.FunctionalLayer in 0.330 seconds.
  Ran 20 tests with 0 failures and 0 errors in 1.425 seconds.
Running Products.CMFCore.testing.EventZCMLLayer tests:
  Tear down Products.CMFCalendar.testing.FunctionalLayer in 0.017 seconds.
  Tear down Products.CMFCore.testing.FunctionalZCMLLayer in 0.001 seconds.
  Set up Products.CMFCore.testing.EventZCMLLayer in 0.001 seconds.
  Ran 8 tests with 0 failures and 0 errors in 0.205 seconds.
Running Products.CMFCore.testing.ExportImportZCMLLayer tests:
  Tear down Products.CMFCore.testing.EventZCMLLayer in 0.000 seconds.
  Set up Products.CMFCore.testing.ExportImportZCMLLayer in 0.001 seconds.
  Ran 10 tests with 0 failures and 0 errors in 0.663 seconds.
Running Products.CMFCore.testing.TraversingEventZCMLLayer tests:
  Tear down Products.CMFCore.testing.ExportImportZCMLLayer in 0.000 seconds.
  Set up Products.CMFCore.testing.TraversingEventZCMLLayer in 0.001 seconds.
  Ran 5 tests with 0 failures and 0 errors in 0.163 seconds.
Running Products.CMFDefault.testing.FunctionalLayer tests:
  Tear down Products.CMFCore.testing.TraversingEventZCMLLayer in 0.000 seconds.
  Set up Products.CMFCore.testing.FunctionalZCMLLayer in 0.189 seconds.
  Set up Products.CMFDefault.testing.FunctionalLayer in 0.246 seconds.
  Ran 32 tests with 0 failures and 0 errors in 4.155 seconds.
Running Products.CMFUid.testing.UidEventZCMLLayer tests:
  Tear down Products.CMFDefault.testing.FunctionalLayer in 0.015 seconds.
  Tear down Products.CMFCore.testing.FunctionalZCMLLayer in 0.002 seconds.
  Set up Products.CMFUid.testing.UidEventZCMLLayer in 0.001 seconds.
  Ran 12 tests with 0 failures and 0 errors in 0.314 seconds.
Running Products.DCWorkflow.testing.ExportImportZCMLLayer tests:
  Tear down Products.CMFUid.testing.UidEventZCMLLayer in 0.000 seconds.
  Set up Products.DCWorkflow.testing.ExportImportZCMLLayer in 0.177 seconds.
  Ran 38 tests with 0 failures and 0 errors in 0.720 seconds.
Running Products.GenericSetup.testing.ExportImportZCMLLayer tests:
  Tear down Products.DCWorkflow.testing.ExportImportZCMLLayer in 0.000 seconds.
  Set up Products.GenericSetup.testing.ExportImportZCMLLayer in 0.052 seconds.
  Ran 192 tests with 0 failures and 0 errors in 0.608 seconds.
Running zope.testing.testrunner.layer.UnitTests tests:
  Tear down Products.GenericSetup.testing.ExportImportZCMLLayer in 0.000 seconds.
  Tear down Testing.ZopeTestCase.layer.ZopeLite in 0.000 seconds.
  Set up zope.testing.testrunner.layer.UnitTests in 0.000 seconds.
  Ran 261 tests with 0 failures and 0 errors in 0.264 seconds.
Tearing down left over layers:
  Tear down zope.testing.testrunner.layer.UnitTests in 0.000 seconds.
Total: 807 tests, 0 failures, 0 errors in 12.470 seconds.
Running Testing.ZopeTestCase.layer.ZopeLite tests:
  Set up Testing.ZopeTestCase.layer.ZopeLite in 0.928 seconds.
  Ran 27 tests with 0 failures and 0 errors in 0.055 seconds.
Running Products.PloneTestCase.layer.PloneSite tests:
  Set up Products.PloneTestCase.layer.ZCML in 2.443 seconds.
  Set up Products.PloneTestCase.layer.PloneSite in 4.766 seconds.
  Ran 135 tests with 0 failures and 0 errors in 21.416 seconds.
Running Products.CMFDiffTool.tests.BaseTestCase.CMFDiffToolLayer tests:
  Set up Products.CMFDiffTool.tests.BaseTestCase.CMFDiffToolLayer in 0.013 seconds.
  Ran 2 tests with 0 failures and 0 errors in 0.226 seconds.
Running Products.CMFTestCase.layer.CMFSite tests:
  Tear down Products.CMFDiffTool.tests.BaseTestCase.CMFDiffToolLayer in 0.212 seconds.
  Tear down Products.PloneTestCase.layer.PloneSite in 0.006 seconds.
  Tear down Products.PloneTestCase.layer.ZCML in 0.003 seconds.
  Set up Products.CMFTestCase.layer.ZCML in 1.759 seconds.
  Set up Products.CMFTestCase.layer.CMFSite in 1.347 seconds.
  Ran 20 tests with 0 failures and 0 errors in 0.395 seconds.
Running plone.app.blob.tests.layer.BlobReplacementLayer tests:
  Tear down Products.CMFTestCase.layer.CMFSite in 0.032 seconds.
  Tear down Products.CMFTestCase.layer.ZCML in 0.003 seconds.
  Set up Products.PloneTestCase.layer.ZCML in 1.763 seconds.
  Set up Products.PloneTestCase.layer.PloneSite in 3.839 seconds.
  Set up plone.app.blob.tests.layer.BlobLayer in 0.091 seconds.
  Set up plone.app.blob.tests.layer.BlobReplacementLayer in 0.197 seconds.
  Ran 6 tests with 0 failures and 0 errors in 1.828 seconds.
Running zope.testing.testrunner.layer.UnitTests tests:
  Tear down plone.app.blob.tests.layer.BlobReplacementLayer in 0.000 seconds.
  Tear down plone.app.blob.tests.layer.BlobLayer in 0.000 seconds.
  Tear down Products.PloneTestCase.layer.PloneSite in 0.223 seconds.
  Tear down Products.PloneTestCase.layer.ZCML in 0.004 seconds.
  Tear down Testing.ZopeTestCase.layer.ZopeLite in 0.000 seconds.
  Set up zope.testing.testrunner.layer.UnitTests in 0.000 seconds.
  Ran 1 tests with 0 failures and 0 errors in 0.005 seconds.
Tearing down left over layers:
  Tear down zope.testing.testrunner.layer.UnitTests in 0.000 seconds.
Total: 191 tests, 0 failures, 0 errors in 42.821 seconds.
/home/stefan/autotest/temp/python26-zope212-cmf22-plone40/eggs/plone.app.content-2.0.7-py2.6.egg/plone/app/content/browser/tests/test_doctests.py:1: DeprecationWarning: zope.testing.doctest is deprecated in favour of the Python standard library doctest module
  from zope.testing import doctest
/home/stefan/autotest/temp/python26-zope212-cmf22-plone40/eggs/plone.app.i18n-2.0.1-py2.6.egg/plone/app/i18n/locales/browser/tests.py:7: DeprecationWarning: zope.testing.doctestunit is deprecated in favour of the Python standard library doctest module
  from zope.testing.doctestunit import DocTestSuite
Running Testing.ZopeTestCase.layer.ZopeLite tests:
  Set up Testing.ZopeTestCase.layer.ZopeLite in 0.562 seconds.
  Ran 120 tests with 0 failures and 0 errors in 0.747 seconds.
Running Products.CMFTestCase.layer.CMFSite tests:
  Set up Products.CMFTestCase.layer.ZCML in 2.336 seconds.
  Set up Products.CMFTestCase.layer.CMFSite in 0.230 seconds.
  Ran 31 tests with 0 failures and 0 errors in 3.022 seconds.
Running Products.PloneTestCase.layer.ZCML tests:
  Tear down Products.CMFTestCase.layer.CMFSite in 0.018 seconds.
  Tear down Products.CMFTestCase.layer.ZCML in 0.003 seconds.
  Set up Products.PloneTestCase.layer.ZCML in 1.754 seconds.
  Ran 12 tests with 0 failures and 0 errors in 0.016 seconds.
Running Products.PloneTestCase.layer.PloneSite tests:
  Set up Products.PloneTestCase.layer.PloneSite in 3.955 seconds.
/home/stefan/autotest/temp/python26-zope212-cmf22-plone40/eggs/Products.PortalTransforms-2.0.7-py2.6.egg/Products/PortalTransforms/libtransforms/commandtransform.py:103: DeprecationWarning: os.popen4 is deprecated.  Use the subprocess module.
  cin, couterr = os.popen4(command, 'b')
  Ran 1476 tests with 0 failures and 0 errors in 3 minutes 51.644 seconds.
Running plone.app.contentrules.tests.test_configuration.TestContentrulesGSLayer tests:
  Set up plone.app.contentrules.tests.test_configuration.TestContentrulesGSLayer in 0.003 seconds.
  Ran 6 tests with 0 failures and 0 errors in 2.441 seconds.
Running plone.app.customerize.tests.layer.PloneCustomerize tests:
  Tear down plone.app.contentrules.tests.test_configuration.TestContentrulesGSLayer in 0.000 seconds.
  Set up plone.app.customerize.tests.layer.PloneCustomerize in 0.015 seconds.
  Ran 2 tests with 0 failures and 0 errors in 2.691 seconds.
Running plone.app.kss.tests.kss_and_plone_layer.KSSAndPloneLayer tests:
  Tear down plone.app.customerize.tests.layer.PloneCustomerize in 0.000 seconds.
  Set up plone.app.kss.tests.kss_and_plone_layer.KSSAndPloneLayer in 0.005 seconds.
  Ran 15 tests with 0 failures and 0 errors in 1.261 seconds.
Running plone.app.upgrade.tests.base.FunctionalUpgradeLayer tests:
  Tear down plone.app.kss.tests.kss_and_plone_layer.KSSAndPloneLayer in 0.000 seconds.
  Set up plone.app.upgrade.tests.base.FunctionalUpgradeLayer in 0.000 seconds.
  Ran 11 tests with 0 failures and 0 errors in 1 minutes 8.148 seconds.
Running plone.app.viewletmanager.tests.test_exportimport.Layer tests:
  Tear down plone.app.upgrade.tests.base.FunctionalUpgradeLayer in 0.000 seconds.
  Tear down Products.PloneTestCase.layer.PloneSite in 0.212 seconds.
  Tear down Products.PloneTestCase.layer.ZCML in 0.015 seconds.
  Tear down Testing.ZopeTestCase.layer.ZopeLite in 0.000 seconds.
  Set up plone.app.viewletmanager.tests.test_exportimport.Layer in 0.000 seconds.
  Ran 16 tests with 0 failures and 0 errors in 0.050 seconds.
Running zope.testing.testrunner.layer.UnitTests tests:
  Tear down plone.app.viewletmanager.tests.test_exportimport.Layer in 0.000 seconds.
  Set up zope.testing.testrunner.layer.UnitTests in 0.000 seconds.
  Ran 128 tests with 0 failures and 0 errors in 0.988 seconds.
Tearing down left over layers:
  Tear down zope.testing.testrunner.layer.UnitTests in 0.000 seconds.
Total: 1817 tests, 0 failures, 0 errors in 5 minutes 23.876 seconds.
Running Testing.ZopeTestCase.layer.ZopeLite tests:
  Set up Testing.ZopeTestCase.layer.ZopeLite in 1.538 seconds.
  Ran 150 tests with 0 failures and 0 errors in 0.810 seconds.
Running Products.PlonePAS.tests.layer.PlonePASLayer tests:
  Set up Products.PloneTestCase.layer.ZCML in 2.317 seconds.
  Set up Products.PloneTestCase.layer.PloneSite in 3.638 seconds.
  Set up Products.PlonePAS.tests.layer.PlonePASLayer in 0.000 seconds.
  Ran 149 tests with 0 failures and 0 errors in 2.161 seconds.
Running zope.testing.testrunner.layer.UnitTests tests:
  Tear down Products.PlonePAS.tests.layer.PlonePASLayer in 0.000 seconds.
  Tear down Products.PloneTestCase.layer.PloneSite in 0.196 seconds.
  Tear down Products.PloneTestCase.layer.ZCML in 0.003 seconds.
  Tear down Testing.ZopeTestCase.layer.ZopeLite in 0.000 seconds.
  Set up zope.testing.testrunner.layer.UnitTests in 0.000 seconds.
Generated checkid_setup request to http://www.myopenid.com/server with assocication {HMAC-SHA1}{4e5c7acf}{Zfekug==}
Generated checkid_setup request to http://www.myopenid.com/server with assocication {HMAC-SHA1}{4e5c7ad0}{t1aOyw==}
  Ran 360 tests with 0 failures and 0 errors in 1.980 seconds.
Tearing down left over layers:
  Tear down zope.testing.testrunner.layer.UnitTests in 0.000 seconds.
Total: 659 tests, 0 failures, 0 errors in 13.236 seconds.
/home/stefan/autotest/temp/python26-zope212-cmf22-plone40/eggs/plone.fieldsets-2.0-py2.6.egg/plone/fieldsets/tests.py:6: DeprecationWarning: zope.testing.doctest is deprecated in favour of the Python standard library doctest module
  from zope.testing import doctest
/home/stefan/autotest/temp/python26-zope212-cmf22-plone40/eggs/plone.indexer-1.0-py2.6.egg/plone/indexer/tests.py:3: DeprecationWarning: zope.testing.doctestunit is deprecated in favour of the Python standard library doctest module
  from zope.testing import doctestunit
Running Products.PloneTestCase.layer.PloneSite tests:
  Set up Testing.ZopeTestCase.layer.ZopeLite in 1.434 seconds.
  Set up Products.PloneTestCase.layer.ZCML in 2.429 seconds.
  Set up Products.PloneTestCase.layer.PloneSite in 4.124 seconds.
  Ran 5 tests with 0 failures and 0 errors in 0.157 seconds.
Running plone.browserlayer.tests.test_doctest.PloneBrowserLayerLayer tests:
  Set up plone.browserlayer.tests.test_doctest.PloneBrowserLayerLayer in 0.004 seconds.
  Ran 1 tests with 0 failures and 0 errors in 0.679 seconds.
Running plone.theme.tests.test_doctest.PloneThemeLayer tests:
  Tear down plone.browserlayer.tests.test_doctest.PloneBrowserLayerLayer in 0.000 seconds.
  Set up plone.theme.tests.test_doctest.PloneThemeLayer in 0.003 seconds.
  Ran 1 tests with 0 failures and 0 errors in 0.044 seconds.
Running zope.testing.testrunner.layer.UnitTests tests:
  Tear down plone.theme.tests.test_doctest.PloneThemeLayer in 0.000 seconds.
  Tear down Products.PloneTestCase.layer.PloneSite in 0.194 seconds.
  Tear down Products.PloneTestCase.layer.ZCML in 0.004 seconds.
  Tear down Testing.ZopeTestCase.layer.ZopeLite in 0.000 seconds.
  Set up zope.testing.testrunner.layer.UnitTests in 0.000 seconds.
  Ran 178 tests with 0 failures and 0 errors in 0.478 seconds.
Tearing down left over layers:
  Tear down zope.testing.testrunner.layer.UnitTests in 0.000 seconds.
Total: 185 tests, 0 failures, 0 errors in 10.455 seconds.
Running Products.PloneTestCase.layer.PloneSite tests:
  Set up Testing.ZopeTestCase.layer.ZopeLite in 1.442 seconds.
  Set up Products.PloneTestCase.layer.ZCML in 2.344 seconds.
  Set up Products.PloneTestCase.layer.PloneSite in 3.956 seconds.
  Ran 174 tests with 0 failures and 0 errors in 19.456 seconds.
Running plone.app.portlets.tests.test_configuration.TestPortletZCMLLayer tests:
  Set up plone.app.portlets.tests.test_configuration.TestPortletZCMLLayer in 0.008 seconds.
  Ran 18 tests with 0 failures and 0 errors in 10.599 seconds.
Running zope.testing.testrunner.layer.UnitTests tests:
  Tear down plone.app.portlets.tests.test_configuration.TestPortletZCMLLayer in 0.000 seconds.
  Tear down Products.PloneTestCase.layer.PloneSite in 0.203 seconds.
  Tear down Products.PloneTestCase.layer.ZCML in 0.007 seconds.
  Tear down Testing.ZopeTestCase.layer.ZopeLite in 0.000 seconds.
  Set up zope.testing.testrunner.layer.UnitTests in 0.000 seconds.
  Ran 5 tests with 0 failures and 0 errors in 0.159 seconds.
Tearing down left over layers:
  Tear down zope.testing.testrunner.layer.UnitTests in 0.000 seconds.
Total: 197 tests, 0 failures, 0 errors in 38.883 seconds.
Running zope.testing.testrunner.layer.UnitTests tests:
  Set up zope.testing.testrunner.layer.UnitTests in 0.000 seconds.
  Ran 3 tests with 0 failures and 0 errors in 14.259 seconds.
Tearing down left over layers:
  Tear down zope.testing.testrunner.layer.UnitTests in 0.000 seconds.
Running zope.testing.testrunner.layer.UnitTests tests:
  Set up zope.testing.testrunner.layer.UnitTests in 0.000 seconds.
  Ran 1 tests with 0 failures and 0 errors in 0.007 seconds.
Tearing down left over layers:
  Tear down zope.testing.testrunner.layer.UnitTests in 0.000 seconds.
Running zope.testing.testrunner.layer.UnitTests tests:
  Set up zope.testing.testrunner.layer.UnitTests in 0.000 seconds.
  Ran 1 tests with 0 failures and 0 errors in 0.007 seconds.
Tearing down left over layers:
  Tear down zope.testing.testrunner.layer.UnitTests in 0.000 seconds.
Running Products.PloneTestCase.layer.PloneSite tests:
  Set up Testing.ZopeTestCase.layer.ZopeLite in 0.000 seconds.
  Set up Products.PloneTestCase.layer.ZCML in 1.859 seconds.
  Set up Products.PloneTestCase.layer.PloneSite in 4.601 seconds.


Failure in test test_local_mapping_select_acquisition_chain (Products.CMFPlacefulWorkflow.tests.test_configlet.TestConfiglet)
Traceback (most recent call last):
  File "/usr/local/python2.6/lib/python2.6/unittest.py", line 279, in run
    testMethod()
  File "/home/stefan/autotest/temp/python26-zope212-cmf22-plone40/eggs/Products.CMFPlacefulWorkflow-1.5.5-py2.6.egg/Products/CMFPlacefulWorkflow/tests/test_configlet.py", line 86, in test_local_mapping_select_acquisition_chain
    ['acquisition', ])
  File "/usr/local/python2.6/lib/python2.6/unittest.py", line 350, in failUnlessEqual
    (msg or '%r != %r' % (first, second))
AssertionError: ['folder_workflow'] != ['acquisition']

  Ran 24 tests with 1 failures and 0 errors in 3.512 seconds.
Running Products.CMFPlacefulWorkflow.tests.test_exportimport.ExportImportLayer tests:
  Set up Products.CMFPlacefulWorkflow.tests.test_exportimport.ExportImportLayer in 0.002 seconds.
  Ran 1 tests with 0 failures and 0 errors in 0.891 seconds.
Tearing down left over layers:
  Tear down Products.CMFPlacefulWorkflow.tests.test_exportimport.ExportImportLayer in 0.000 seconds.
  Tear down Products.PloneTestCase.layer.PloneSite in 0.206 seconds.
  Tear down Products.PloneTestCase.layer.ZCML in 0.004 seconds.
  Tear down Testing.ZopeTestCase.layer.ZopeLite in 0.000 seconds.
Total: 25 tests, 1 failures, 0 errors in 11.546 seconds.
Running Testing.ZopeTestCase.layer.ZopeLite tests:
  Set up Testing.ZopeTestCase.layer.ZopeLite in 0.659 seconds.
  Ran 120 tests with 0 failures and 0 errors in 0.737 seconds.
Running Products.PloneTestCase.layer.ZCML tests:
  Set up Products.PloneTestCase.layer.ZCML in 2.450 seconds.
  Ran 12 tests with 0 failures and 0 errors in 0.016 seconds.
Running Products.PloneTestCase.layer.PloneSite tests:
  Set up Products.PloneTestCase.layer.PloneSite in 3.896 seconds.
/home/stefan/autotest/temp/python26-zope212-cmf22-plone40/eggs/Products.PortalTransforms-2.0.7-py2.6.egg/Products/PortalTransforms/libtransforms/commandtransform.py:103: DeprecationWarning: os.popen4 is deprecated.  Use the subprocess module.
  cin, couterr = os.popen4(command, 'b')
  Ran 931 tests with 0 failures and 0 errors in 2 minutes 11.265 seconds.
Running zope.testing.testrunner.layer.UnitTests tests:
  Tear down Products.PloneTestCase.layer.PloneSite in 0.200 seconds.
  Tear down Products.PloneTestCase.layer.ZCML in 0.014 seconds.
  Tear down Testing.ZopeTestCase.layer.ZopeLite in 0.000 seconds.
  Set up zope.testing.testrunner.layer.UnitTests in 0.000 seconds.
  Ran 36 tests with 0 failures and 0 errors in 0.014 seconds.
Tearing down left over layers:
  Tear down zope.testing.testrunner.layer.UnitTests in 0.000 seconds.
Total: 1099 tests, 0 failures, 0 errors in 2 minutes 20.189 seconds.
Running Products.CMFTestCase.layer.CMFSite tests:
  Set up Testing.ZopeTestCase.layer.ZopeLite in 0.232 seconds.
  Set up Products.CMFTestCase.layer.ZCML in 0.414 seconds.
  Set up Products.CMFTestCase.layer.CMFSite in 0.209 seconds.
  Ran 58 tests with 0 failures and 0 errors in 0.228 seconds.
Tearing down left over layers:
  Tear down Products.CMFTestCase.layer.CMFSite in 0.018 seconds.
  Tear down Products.CMFTestCase.layer.ZCML in 0.000 seconds.
  Tear down Testing.ZopeTestCase.layer.ZopeLite in 0.000 seconds.
Running zope.testing.testrunner.layer.UnitTests tests:
  Set up zope.testing.testrunner.layer.UnitTests in 0.000 seconds.
  Ran 25 tests with 0 failures and 0 errors in 0.077 seconds.
Tearing down left over layers:
  Tear down zope.testing.testrunner.layer.UnitTests in 0.000 seconds.
Running Products.PloneTestCase.layer.PloneSite tests:
  Set up Testing.ZopeTestCase.layer.ZopeLite in 1.438 seconds.
  Set up Products.PloneTestCase.layer.ZCML in 2.562 seconds.
  Set up Products.PloneTestCase.layer.PloneSite in 3.996 seconds.
  Ran 2 tests with 0 failures and 0 errors in 3.818 seconds.
Tearing down left over layers:
  Tear down Products.PloneTestCase.layer.PloneSite in 0.197 seconds.
  Tear down Products.PloneTestCase.layer.ZCML in 0.005 seconds.
  Tear down Testing.ZopeTestCase.layer.ZopeLite in 0.000 seconds.
Running Products.PloneTestCase.layer.PloneSite tests:
  Set up Testing.ZopeTestCase.layer.ZopeLite in 1.554 seconds.
  Set up Products.PloneTestCase.layer.ZCML in 2.516 seconds.
  Set up Products.PloneTestCase.layer.PloneSite in 4.015 seconds.
  Ran 63 tests with 0 failures and 0 errors in 1.304 seconds.
Tearing down left over layers:
  Tear down Products.PloneTestCase.layer.PloneSite in 0.210 seconds.
  Tear down Products.PloneTestCase.layer.ZCML in 0.003 seconds.
  Tear down Testing.ZopeTestCase.layer.ZopeLite in 0.000 seconds.
Running Products.PloneTestCase.layer.PloneSite tests:
  Set up Testing.ZopeTestCase.layer.ZopeLite in 1.460 seconds.
  Set up Products.PloneTestCase.layer.ZCML in 2.420 seconds.
  Set up Products.PloneTestCase.layer.PloneSite in 4.015 seconds.
  Ran 248 tests with 0 failures and 0 errors in 15.635 seconds.
Running zope.testing.testrunner.layer.UnitTests tests:
  Tear down Products.PloneTestCase.layer.PloneSite in 0.210 seconds.
  Tear down Products.PloneTestCase.layer.ZCML in 0.005 seconds.
  Tear down Testing.ZopeTestCase.layer.ZopeLite in 0.000 seconds.
  Set up zope.testing.testrunner.layer.UnitTests in 0.000 seconds.
  Ran 62 tests with 0 failures and 0 errors in 0.013 seconds.
Tearing down left over layers:
  Tear down zope.testing.testrunner.layer.UnitTests in 0.000 seconds.
Total: 310 tests, 0 failures, 0 errors in 24.203 seconds.
Running Products.PloneTestCase.layer.PloneSite tests:
  Set up Testing.ZopeTestCase.layer.ZopeLite in 0.906 seconds.
  Set up Products.PloneTestCase.layer.ZCML in 2.512 seconds.
  Set up Products.PloneTestCase.layer.PloneSite in 4.013 seconds.
  Ran 8 tests with 0 failures and 0 errors in 5.673 seconds.
Tearing down left over layers:
  Tear down Products.PloneTestCase.layer.PloneSite in 0.195 seconds.
  Tear down Products.PloneTestCase.layer.ZCML in 0.007 seconds.
  Tear down Testing.ZopeTestCase.layer.ZopeLite in 0.000 seconds.
Running zope.testing.testrunner.layer.UnitTests tests:
  Set up zope.testing.testrunner.layer.UnitTests in 0.000 seconds.
  Ran 77 tests with 0 failures and 0 errors in 1.571 seconds.
Tearing down left over layers:
  Tear down zope.testing.testrunner.layer.UnitTests in 0.000 seconds.
Running Products.contentmigration.tests.layer.TestLayer tests:
  Set up Testing.ZopeTestCase.layer.ZopeLite in 1.444 seconds.
  Set up Products.PloneTestCase.layer.ZCML in 2.414 seconds.
  Set up Products.PloneTestCase.layer.PloneSite in 3.859 seconds.
  Set up Products.contentmigration.tests.layer.TestLayer in 0.003 seconds.
  Ran 13 tests with 0 failures and 0 errors in 4.340 seconds.
Tearing down left over layers:
  Tear down Products.contentmigration.tests.layer.TestLayer in 0.000 seconds.
  Tear down Products.PloneTestCase.layer.PloneSite in 0.196 seconds.
  Tear down Products.PloneTestCase.layer.ZCML in 0.003 seconds.
  Tear down Testing.ZopeTestCase.layer.ZopeLite in 0.000 seconds.
Total: 0 tests, 0 failures, 0 errors in 0.000 seconds.
Running zope.testing.testrunner.layer.UnitTests tests:
  Set up zope.testing.testrunner.layer.UnitTests in 0.000 seconds.
  Ran 2 tests with 0 failures and 0 errors in 0.048 seconds.
Tearing down left over layers:
  Tear down zope.testing.testrunner.layer.UnitTests in 0.000 seconds.
Running zope.testing.testrunner.layer.UnitTests tests:
  Set up zope.testing.testrunner.layer.UnitTests in 0.000 seconds.
  Ran 1 tests with 0 failures and 0 errors in 0.093 seconds.
Tearing down left over layers:
  Tear down zope.testing.testrunner.layer.UnitTests in 0.000 seconds.
Running zope.testing.testrunner.layer.UnitTests tests:
  Set up zope.testing.testrunner.layer.UnitTests in 0.000 seconds.
  Ran 2 tests with 0 failures and 0 errors in 0.000 seconds.
Tearing down left over layers:
  Tear down zope.testing.testrunner.layer.UnitTests in 0.000 seconds.
Running archetypes.referencebrowserwidget.tests.base.layer tests:
  Set up Testing.ZopeTestCase.layer.ZopeLite in 0.000 seconds.
  Set up Products.PloneTestCase.layer.ZCML in 1.943 seconds.
  Set up Products.PloneTestCase.layer.PloneSite in 4.218 seconds.
  Set up archetypes.referencebrowserwidget.tests.base.layer in 0.000 seconds.
  Ran 36 tests with 0 failures and 0 errors in 9.037 seconds.
Running zope.testing.testrunner.layer.UnitTests tests:
  Tear down archetypes.referencebrowserwidget.tests.base.layer in 0.000 seconds.
  Tear down Products.PloneTestCase.layer.PloneSite in 0.213 seconds.
  Tear down Products.PloneTestCase.layer.ZCML in 0.007 seconds.
  Tear down Testing.ZopeTestCase.layer.ZopeLite in 0.000 seconds.
  Set up zope.testing.testrunner.layer.UnitTests in 0.000 seconds.
  Ran 5 tests with 0 failures and 0 errors in 0.001 seconds.
Tearing down left over layers:
  Tear down zope.testing.testrunner.layer.UnitTests in 0.000 seconds.
Total: 41 tests, 0 failures, 0 errors in 15.922 seconds.
Running archetypes.schemaextender.tests.base.layer tests:
  Set up Testing.ZopeTestCase.layer.ZopeLite in 0.924 seconds.
  Set up Products.PloneTestCase.layer.ZCML in 2.414 seconds.
  Set up Products.PloneTestCase.layer.PloneSite in 3.871 seconds.
  Set up archetypes.schemaextender.tests.base.layer in 0.000 seconds.
  Ran 4 tests with 0 failures and 0 errors in 3.432 seconds.
Running zope.testing.testrunner.layer.UnitTests tests:
  Tear down archetypes.schemaextender.tests.base.layer in 0.000 seconds.
  Tear down Products.PloneTestCase.layer.PloneSite in 0.200 seconds.
  Tear down Products.PloneTestCase.layer.ZCML in 0.007 seconds.
  Tear down Testing.ZopeTestCase.layer.ZopeLite in 0.000 seconds.
  Set up zope.testing.testrunner.layer.UnitTests in 0.000 seconds.
  Ran 19 tests with 0 failures and 0 errors in 0.006 seconds.
Tearing down left over layers:
  Tear down zope.testing.testrunner.layer.UnitTests in 0.000 seconds.
Total: 23 tests, 0 failures, 0 errors in 11.306 seconds.
Running zope.testing.testrunner.layer.UnitTests tests:
  Set up zope.testing.testrunner.layer.UnitTests in 0.000 seconds.
  Ran 4 tests with 0 failures and 0 errors in 0.042 seconds.
Tearing down left over layers:
  Tear down zope.testing.testrunner.layer.UnitTests in 0.000 seconds.
Running Testing.ZopeTestCase.layer.ZopeLite tests:
  Set up Testing.ZopeTestCase.layer.ZopeLite in 0.070 seconds.
  Ran 3 tests with 0 failures and 0 errors in 1.007 seconds.
Tearing down left over layers:
  Tear down Testing.ZopeTestCase.layer.ZopeLite in 0.000 seconds.
Running Testing.ZopeTestCase.layer.ZopeLite tests:
  Set up Testing.ZopeTestCase.layer.ZopeLite in 0.041 seconds.
  Ran 2 tests with 0 failures and 0 errors in 1.061 seconds.
Running zope.testing.testrunner.layer.UnitTests tests:
  Tear down Testing.ZopeTestCase.layer.ZopeLite in 0.000 seconds.
  Set up zope.testing.testrunner.layer.UnitTests in 0.000 seconds.
  Ran 1 tests with 0 failures and 0 errors in 0.127 seconds.
Tearing down left over layers:
  Tear down zope.testing.testrunner.layer.UnitTests in 0.000 seconds.
Total: 3 tests, 0 failures, 0 errors in 1.407 seconds.
Total: 0 tests, 0 failures, 0 errors in 0.000 seconds.
Running Testing.ZopeTestCase.layer.ZopeLite tests:
  Set up Testing.ZopeTestCase.layer.ZopeLite in 0.052 seconds.
  Ran 1 tests with 0 failures and 0 errors in 0.318 seconds.
Running kss.core.tests.base.KSSLayer tests:
  Tear down Testing.ZopeTestCase.layer.ZopeLite in 0.000 seconds.
  Set up kss.core.tests.base.KSSCoreLayer in 0.030 seconds.
  Set up kss.core.tests.base.KSSLayer in 0.058 seconds.
  Ran 15 tests with 0 failures and 0 errors in 0.153 seconds.
Running kss.core.tests.test_ttwapi.layer tests:
  Set up kss.core.tests.test_ttwapi.layer in 0.001 seconds.
  Ran 3 tests with 0 failures and 0 errors in 0.026 seconds.
Running zope.testing.testrunner.layer.UnitTests tests:
  Tear down kss.core.tests.test_ttwapi.layer in 0.000 seconds.
  Tear down kss.core.tests.base.KSSLayer in 0.000 seconds.
  Tear down kss.core.tests.base.KSSCoreLayer in 0.000 seconds.
  Set up zope.testing.testrunner.layer.UnitTests in 0.000 seconds.
  Ran 2 tests with 0 failures and 0 errors in 0.009 seconds.
Tearing down left over layers:
  Tear down zope.testing.testrunner.layer.UnitTests in 0.000 seconds.
Total: 21 tests, 0 failures, 0 errors in 0.958 seconds.
***********************************************
WARNING: LinguaPlone not found. Skipping tests.
***********************************************
***********************************************
WARNING: LinguaPlone not found. Skipping tests.
***********************************************
Running plone.app.blob.tests.layer.BlobLayer tests:
  Set up Testing.ZopeTestCase.layer.ZopeLite in 0.927 seconds.
  Set up Products.PloneTestCase.layer.ZCML in 2.434 seconds.
  Set up Products.PloneTestCase.layer.PloneSite in 3.851 seconds.
  Set up plone.app.blob.tests.layer.BlobLayer in 0.087 seconds.
/home/stefan/autotest/temp/python26-zope212-cmf22-plone40/eggs/Products.PortalTransforms-2.0.7-py2.6.egg/Products/PortalTransforms/libtransforms/commandtransform.py:103: DeprecationWarning: os.popen4 is deprecated.  Use the subprocess module.
  cin, couterr = os.popen4(command, 'b')
  Ran 24 tests with 0 failures and 0 errors in 7.125 seconds.
Running plone.app.blob.tests.layer.BlobReplacementLayer tests:
  Set up plone.app.blob.tests.layer.BlobReplacementLayer in 0.194 seconds.
  Ran 59 tests with 0 failures and 0 errors in 14.980 seconds.
Running zope.testing.testrunner.layer.UnitTests tests:
  Tear down plone.app.blob.tests.layer.BlobReplacementLayer in 0.000 seconds.
  Tear down plone.app.blob.tests.layer.BlobLayer in 0.000 seconds.
  Tear down Products.PloneTestCase.layer.PloneSite in 0.207 seconds.
  Tear down Products.PloneTestCase.layer.ZCML in 0.008 seconds.
  Tear down Testing.ZopeTestCase.layer.ZopeLite in 0.000 seconds.
  Set up zope.testing.testrunner.layer.UnitTests in 0.000 seconds.
  Ran 2 tests with 0 failures and 0 errors in 0.001 seconds.
Tearing down left over layers:
  Tear down zope.testing.testrunner.layer.UnitTests in 0.000 seconds.
Total: 85 tests, 0 failures, 0 errors in 30.594 seconds.
Running Testing.ZopeTestCase.layer.ZopeLite tests:
  Set up Testing.ZopeTestCase.layer.ZopeLite in 0.933 seconds.
  Ran 2 tests with 0 failures and 0 errors in 0.008 seconds.
Running plone.app.folder.tests.layer.IntegrationLayer tests:
  Set up Products.PloneTestCase.layer.ZCML in 2.455 seconds.
  Set up Products.PloneTestCase.layer.PloneSite in 3.721 seconds.
  Set up plone.app.folder.tests.layer.IntegrationLayer in 0.083 seconds.
  Ran 27 tests with 0 failures and 0 errors in 6.708 seconds.
Running plone.app.folder.tests.layer.PartialOrderingIntegrationLayer tests:
  Set up plone.app.folder.tests.layer.PartialOrderingIntegrationLayer in 0.000 seconds.
  Ran 3 tests with 0 failures and 0 errors in 0.317 seconds.
Tearing down left over layers:
  Tear down plone.app.folder.tests.layer.PartialOrderingIntegrationLayer in 0.000 seconds.
  Tear down plone.app.folder.tests.layer.IntegrationLayer in 0.000 seconds.
  Tear down Products.PloneTestCase.layer.PloneSite in 0.199 seconds.
  Tear down Products.PloneTestCase.layer.ZCML in 0.003 seconds.
  Tear down Testing.ZopeTestCase.layer.ZopeLite in 0.000 seconds.
Total: 32 tests, 0 failures, 0 errors in 15.011 seconds.
Running plone.app.imaging.testing.ImagingLayer tests:
  Set up Testing.ZopeTestCase.layer.ZopeLite in 0.925 seconds.
  Set up Products.PloneTestCase.layer.ZCML in 2.425 seconds.
  Set up Products.PloneTestCase.layer.PloneSite in 3.849 seconds.
  Set up collective.testcaselayer.ptc.PTCLayer in 0.027 seconds.
  Set up plone.app.imaging.testing.ImagingLayer in 0.120 seconds.
  Ran 44 tests with 0 failures and 0 errors in 7.610 seconds.
Running zope.testing.testrunner.layer.UnitTests tests:
  Tear down plone.app.imaging.testing.ImagingLayer in 0.000 seconds.
  Tear down collective.testcaselayer.ptc.PTCLayer in 0.000 seconds.
  Tear down Products.PloneTestCase.layer.PloneSite in 0.197 seconds.
  Tear down Products.PloneTestCase.layer.ZCML in 0.005 seconds.
  Tear down Testing.ZopeTestCase.layer.ZopeLite in 0.000 seconds.
  Set up zope.testing.testrunner.layer.UnitTests in 0.000 seconds.
  Ran 7 tests with 0 failures and 0 errors in 0.001 seconds.
Tearing down left over layers:
  Tear down zope.testing.testrunner.layer.UnitTests in 0.000 seconds.
Total: 51 tests, 0 failures, 0 errors in 15.627 seconds.
Running Products.PloneTestCase.layer.PloneSite tests:
  Set up Testing.ZopeTestCase.layer.ZopeLite in 1.476 seconds.
  Set up Products.PloneTestCase.layer.ZCML in 2.448 seconds.
  Set up Products.PloneTestCase.layer.PloneSite in 3.888 seconds.
  Ran 1 tests with 0 failures and 0 errors in 0.122 seconds.
Tearing down left over layers:
  Tear down Products.PloneTestCase.layer.PloneSite in 0.198 seconds.
  Tear down Products.PloneTestCase.layer.ZCML in 0.004 seconds.
  Tear down Testing.ZopeTestCase.layer.ZopeLite in 0.000 seconds.
Running plone.app.linkintegrity.tests.layer.PloneLinkintegrity tests:
  Set up Testing.ZopeTestCase.layer.ZopeLite in 1.531 seconds.
  Set up Products.PloneTestCase.layer.ZCML in 2.529 seconds.
  Set up Products.PloneTestCase.layer.PloneSite in 4.020 seconds.
  Set up collective.testcaselayer.ptc.PTCLayer in 0.028 seconds.
  Set up plone.app.linkintegrity.tests.layer.PloneLinkintegrity in 0.516 seconds.
  Ran 28 tests with 0 failures and 0 errors in 28.167 seconds.
Running zope.testing.testrunner.layer.UnitTests tests:
  Tear down plone.app.linkintegrity.tests.layer.PloneLinkintegrity in 0.000 seconds.
  Tear down collective.testcaselayer.ptc.PTCLayer in 0.000 seconds.
  Tear down Products.PloneTestCase.layer.PloneSite in 0.207 seconds.
  Tear down Products.PloneTestCase.layer.ZCML in 0.005 seconds.
  Tear down Testing.ZopeTestCase.layer.ZopeLite in 0.000 seconds.
  Set up zope.testing.testrunner.layer.UnitTests in 0.000 seconds.
  Ran 2 tests with 0 failures and 0 errors in 0.000 seconds.
Tearing down left over layers:
  Tear down zope.testing.testrunner.layer.UnitTests in 0.000 seconds.
Total: 30 tests, 0 failures, 0 errors in 37.628 seconds.
Total: 0 tests, 0 failures, 0 errors in 0.000 seconds.
Running Products.PloneTestCase.layer.PloneSite tests:
  Set up Testing.ZopeTestCase.layer.ZopeLite in 1.499 seconds.
  Set up Products.PloneTestCase.layer.ZCML in 2.470 seconds.
  Set up Products.PloneTestCase.layer.PloneSite in 4.030 seconds.
  Ran 3 tests with 0 failures and 0 errors in 0.729 seconds.
Tearing down left over layers:
  Tear down Products.PloneTestCase.layer.PloneSite in 0.255 seconds.
  Tear down Products.PloneTestCase.layer.ZCML in 0.003 seconds.
  Tear down Testing.ZopeTestCase.layer.ZopeLite in 0.000 seconds.
Running Products.PloneTestCase.layer.PloneSite tests:
  Set up Testing.ZopeTestCase.layer.ZopeLite in 1.384 seconds.
  Set up Products.PloneTestCase.layer.ZCML in 2.423 seconds.
  Set up Products.PloneTestCase.layer.PloneSite in 3.842 seconds.
  Ran 7 tests with 0 failures and 0 errors in 7.025 seconds.
Running zope.testing.testrunner.layer.UnitTests tests:
  Tear down Products.PloneTestCase.layer.PloneSite in 0.199 seconds.
  Tear down Products.PloneTestCase.layer.ZCML in 0.005 seconds.
  Tear down Testing.ZopeTestCase.layer.ZopeLite in 0.000 seconds.
  Set up zope.testing.testrunner.layer.UnitTests in 0.000 seconds.
  Ran 3 tests with 0 failures and 0 errors in 0.001 seconds.
Tearing down left over layers:
  Tear down zope.testing.testrunner.layer.UnitTests in 0.000 seconds.
Total: 10 tests, 0 failures, 0 errors in 15.369 seconds.
Running plone.folder.tests.layer.PloneFolderLayer tests:
  Set up plone.folder.tests.layer.PloneFolderLayer in 0.007 seconds.
  Ran 67 tests with 0 failures and 0 errors in 5.372 seconds.
Tearing down left over layers:
  Tear down plone.folder.tests.layer.PloneFolderLayer in 0.000 seconds.
Running zope.testing.testrunner.layer.UnitTests tests:
  Set up zope.testing.testrunner.layer.UnitTests in 0.000 seconds.
  Ran 32 tests with 0 failures and 0 errors in 0.086 seconds.
Tearing down left over layers:
  Tear down zope.testing.testrunner.layer.UnitTests in 0.000 seconds.
Running Products.PloneTestCase.layer.PloneSite tests:
  Set up Testing.ZopeTestCase.layer.ZopeLite in 1.463 seconds.
  Set up Products.PloneTestCase.layer.ZCML in 2.427 seconds.
  Set up Products.PloneTestCase.layer.PloneSite in 4.011 seconds.
  Ran 2 tests with 0 failures and 0 errors in 0.359 seconds.
Tearing down left over layers:
  Tear down Products.PloneTestCase.layer.PloneSite in 0.197 seconds.
  Tear down Products.PloneTestCase.layer.ZCML in 0.003 seconds.
  Tear down Testing.ZopeTestCase.layer.ZopeLite in 0.000 seconds.
Total: 0 tests, 0 failures, 0 errors in 0.000 seconds.
#### Running tests for group ATCT ####
#### Finished tests for group ATCT ####

#### Running tests for group Archetypes ####
#### Finished tests for group Archetypes ####

#### Running tests for group CMF ####
#### Finished tests for group CMF ####

#### Running tests for group CMFEditions ####
#### Finished tests for group CMFEditions ####

#### Running tests for group Plone ####
#### Finished tests for group Plone ####

#### Running tests for group PlonePAS ####
#### Finished tests for group PlonePAS ####

#### Running tests for group plone ####
#### Finished tests for group plone ####

#### Running tests for group portlets ####
#### Finished tests for group portlets ####

#### Running tests for group z3c.autoinclude ####
#### Finished tests for group z3c.autoinclude ####

#### Running tests for Missing ####
#### Finished tests for Missing ####

#### Running tests for MultiMapping ####
#### Finished tests for MultiMapping ####

#### Running tests for Products.CMFPlacefulWorkflow ####
#### Finished tests for Products.CMFPlacefulWorkflow ####

#### Running tests for Products.CMFPlone ####
#### Finished tests for Products.CMFPlone ####

#### Running tests for Products.CMFTestCase ####
#### Finished tests for Products.CMFTestCase ####

#### Running tests for Products.ExtendedPathIndex ####
#### Finished tests for Products.ExtendedPathIndex ####

#### Running tests for Products.PasswordResetTool ####
#### Finished tests for Products.PasswordResetTool ####

#### Running tests for Products.PloneTestCase ####
#### Finished tests for Products.PloneTestCase ####

#### Running tests for Products.ResourceRegistries ####
#### Finished tests for Products.ResourceRegistries ####

#### Running tests for Products.TinyMCE ####
#### Finished tests for Products.TinyMCE ####

#### Running tests for Products.ZopeVersionControl ####
#### Finished tests for Products.ZopeVersionControl ####

#### Running tests for Products.contentmigration ####
#### Finished tests for Products.contentmigration ####

#### Running tests for Products.i18ntestcase ####
#### Finished tests for Products.i18ntestcase ####

#### Running tests for Record ####
#### Finished tests for Record ####

#### Running tests for ThreadLock ####
#### Finished tests for ThreadLock ####

#### Running tests for ZopeUndo ####
#### Finished tests for ZopeUndo ####

#### Running tests for archetypes.referencebrowserwidget ####
#### Finished tests for archetypes.referencebrowserwidget ####

#### Running tests for archetypes.schemaextender ####
#### Finished tests for archetypes.schemaextender ####

#### Running tests for collective.monkeypatcher ####
#### Finished tests for collective.monkeypatcher ####

#### Running tests for five.customerize ####
#### Finished tests for five.customerize ####

#### Running tests for five.formlib ####
#### Finished tests for five.formlib ####

#### Running tests for initgroups ####
#### Finished tests for initgroups ####

#### Running tests for kss.core ####
#### Finished tests for kss.core ####

#### Running tests for plone.app.blob ####
#### Finished tests for plone.app.blob ####

#### Running tests for plone.app.folder ####
#### Finished tests for plone.app.folder ####

#### Running tests for plone.app.imaging ####
#### Finished tests for plone.app.imaging ####

#### Running tests for plone.app.jquerytools ####
#### Finished tests for plone.app.jquerytools ####

#### Running tests for plone.app.linkintegrity ####
#### Finished tests for plone.app.linkintegrity ####

#### Running tests for plone.app.locales ####
#### Finished tests for plone.app.locales ####

#### Running tests for plone.app.openid ####
#### Finished tests for plone.app.openid ####

#### Running tests for plone.app.users ####
#### Finished tests for plone.app.users ####

#### Running tests for plone.folder ####
#### Finished tests for plone.folder ####

#### Running tests for plone.scale ####
#### Finished tests for plone.scale ####

#### Running tests for plone.stringinterp ####
#### Finished tests for plone.stringinterp ####

#### Running tests for plonetheme.classic ####
#### FinishRunning plonetheme.sunburst.tests.base.Layer tests:
  Set up Testing.ZopeTestCase.layer.ZopeLite in 1.538 seconds.
  Set up Products.PloneTestCase.layer.ZCML in 2.510 seconds.
  Set up Products.PloneTestCase.layer.PloneSite in 3.981 seconds.
  Set up collective.testcaselayer.ptc.PTCLayer in 0.031 seconds.
  Set up plonetheme.sunburst.tests.base.Layer in 0.014 seconds.
  Ran 3 tests with 0 failures and 0 errors in 1.047 seconds.
Tearing down left over layers:
  Tear down plonetheme.sunburst.tests.base.Layer in 0.000 seconds.
  Tear down collective.testcaselayer.ptc.PTCLayer in 0.000 seconds.
  Tear down Products.PloneTestCase.layer.PloneSite in 0.206 seconds.
  Tear down Products.PloneTestCase.layer.ZCML in 0.004 seconds.
  Tear down Testing.ZopeTestCase.layer.ZopeLite in 0.000 seconds.
Total: 0 tests, 0 failures, 0 errors in 0.000 seconds.
/home/stefan/autotest/temp/python26-zope212-cmf22-plone40/eggs/wicked-1.1.9-py2.6.egg/wicked/utils.py:223: DeprecationWarning: zope.testing.doctest is deprecated in favour of the Python standard library doctest module
  from zope.testing import doctest
Running Products.PloneTestCase.layer.ZCML tests:
  Set up Testing.ZopeTestCase.layer.ZopeLite in 0.927 seconds.
  Set up Products.PloneTestCase.layer.ZCML in 2.453 seconds.
  Ran 3 tests with 0 failures and 0 errors in 0.035 seconds.
Running wicked.at.tests.wickedtestcase.WickedSite tests:
  Set up Products.PloneTestCase.layer.PloneSite in 4.623 seconds.
  Set up wicked.at.tests.wickedtestcase.WickedSite in 0.002 seconds.
  Ran 23 tests with 0 failures and 0 errors in 5.445 seconds.
Running wicked.at.tests.test_scope.Scoped tests:
  Set up wicked.at.tests.test_scope.Scoped in 0.001 seconds.
  Ran 3 tests with 0 failures and 0 errors in 0.599 seconds.
Running wicked.plone.tests.SelectiveATCT tests:
  Tear down wicked.at.tests.test_scope.Scoped in 0.000 seconds.
  Tear down wicked.at.tests.wickedtestcase.WickedSite in 0.002 seconds.
  Set up wicked.plone.tests.SelectiveATCT in 0.003 seconds.
  Ran 22 tests with 0 failures and 0 errors in 5.605 seconds.
Running wicked.plone.tests.ZCMLLayer tests:
  Tear down wicked.plone.tests.SelectiveATCT in 0.004 seconds.
  Set up wicked.plone.tests.ZCMLLayer in 0.019 seconds.
  Ran 2 tests with 0 failures and 0 errors in 0.665 seconds.
Running zope.testing.testrunner.layer.UnitTests tests:
  Tear down wicked.plone.tests.ZCMLLayer in 0.222 seconds.
  Tear down Products.PloneTestCase.layer.PloneSite in 0.001 seconds.
  Tear down Products.PloneTestCase.layer.ZCML in 0.003 seconds.
  Tear down Testing.ZopeTestCase.layer.ZopeLite in 0.000 seconds.
  Set up zope.testing.testrunner.layer.UnitTests in 0.000 seconds.
  Ran 34 tests with 0 failures and 0 errors in 0.016 seconds.
Tearing down left over layers:
  Tear down zope.testing.testrunner.layer.UnitTests in 0.000 seconds.
Total: 87 tests, 0 failures, 0 errors in 21.885 seconds.
ed tests for plonetheme.classic ####

#### Running tests for plonetheme.sunburst ####
#### Finished tests for plonetheme.sunburst ####

#### Running tests for unittest2 ####
#### Finished tests for unittest2 ####

#### Running tests for wicked ####
#### Finished tests for wicked ####

Packages with test failures:

Failing tests in Products.CMFPlacefulWorkflow

Total time elapsed: 1155.757 seconds

Grand total: 99 packages, 1 failures


FAILED (99 packages, 1 failures)


More information about the Testbot mailing list