[Testbot] FAILED (113 packages, 1 failures) : Plone-4.2 Zope-2.13 Python-2.6.6

Plone Tests plone-tests at epy.co.at
Mon Aug 8 07:45:49 UTC 2011


Plone Tests : FAILED (113 packages, 1 failures)
Plone-4.2 Zope-2.13 Python-2.6.6

Running ./bin/alltests -q --no-color --no-progress
/home/stefan/autotest/temp/python26-zope213-cmf22-plone42/bin/test:267: DeprecationWarning: zope.testing.testrunner is deprecated in favour of zope.testrunner.
  import zope.testing.testrunner
/home/stefan/autotest/temp/python26-zope213-cmf22-plone42/eggs/zope.testing-3.9.6-py2.6.egg/zope/testing/testrunner/formatter.py:28: DeprecationWarning: zope.testing.exceptions is deprecated in favour of zope.testrunner.exceptions
  from zope.testing.exceptions import DocTestFailureException
Running Products.CMFTestCase.layer.CMFSite tests:
  Set up Testing.ZopeTestCase.layer.ZopeLite in 0.907 seconds.
  Set up Products.CMFTestCase.layer.ZCML in 4.962 seconds.
  Set up Products.CMFTestCase.layer.CMFSite/home/stefan/autotest/temp/python26-zope213-cmf22-plone42/src/Products.GenericSetup/Products/GenericSetup/utils.py:122: DeprecationWarning: UserFolder is deprecated. User folders are no longer part of AccessControl, please depend on Zope2 and import from OFS.userfolder or use the new minimal user folder classes from AccessControl.userfolder.
  obj = getattr( obj, part )
 in 1.490 seconds.
  Ran 31 tests with 0 failures and 0 errors in 0.524 seconds.
Running Products.PloneTestCase.layer.PloneSite tests:
  Tear down Products.CMFTestCase.layer.CMFSite in 0.033 seconds.
  Tear down Products.CMFTestCase.layer.ZCML in 0.004 seconds.
  Set up Products.PloneTestCase.layer.ZCML in 3.829 seconds.
  Set up Products.PloneTestCase.layer.PloneSite in 4.379 seconds.
/home/stefan/autotest/temp/python26-zope213-cmf22-plone42/eggs/Products.ZCatalog-2.13.18-py2.6.egg/Products/ZCatalog/ZCatalog.py:604: DeprecationWarning: Your query None produced no query restriction. Currently the entire catalog content is returned. In Zope 2.14 this will result in an empty LazyCat to be returned.
  return self._catalog.searchResults(REQUEST, used, **kw)
  Ran 614 tests with 0 failures and 0 errors in 1 minutes 22.259 seconds.
Tearing down left over layers:
  Tear down Products.PloneTestCase.layer.PloneSite in 0.190 seconds.
  Tear down Products.PloneTestCase.layer.ZCML in 0.010 seconds.
  Tear down Testing.ZopeTestCase.layer.ZopeLite in 0.000 seconds.
Total: 645 tests, 0 failures, 0 errors in 1 minutes 39.138 seconds.
/home/stefan/autotest/temp/python26-zope213-cmf22-plone42/bin/test:267: DeprecationWarning: zope.testing.testrunner is deprecated in favour of zope.testrunner.
  import zope.testing.testrunner
/home/stefan/autotest/temp/python26-zope213-cmf22-plone42/eggs/zope.testing-3.9.6-py2.6.egg/zope/testing/testrunner/formatter.py:28: DeprecationWarning: zope.testing.exceptions is deprecated in favour of zope.testrunner.exceptions
  from zope.testing.exceptions import DocTestFailureException
/home/stefan/autotest/temp/python26-zope213-cmf22-plone42/eggs/Products.i18ntestcase-1.2-py2.6.egg/Products/i18ntestcase/PotTestCase.py:13: DeprecationWarning: The popen2 module is deprecated.  Use the subprocess module.
  from popen2 import popen4
/home/stefan/autotest/temp/python26-zope213-cmf22-plone42/eggs/Products.kupu-1.5.0-py2.6.egg/Products/kupu/plone/tests/TestContent.py:4: DeprecationWarning: Products.ATReferenceBrowserWidget.ATReferenceBrowserWidget has moved to archetypes.referencebrowserwidget.widget. Import of Products.ATReferenceBrowserWidget.ATReferenceBrowserWidget will become unsupported in Plone 5.0
  from Products.ATReferenceBrowserWidget.ATReferenceBrowserWidget import ReferenceBrowserWidget
Running Testing.ZopeTestCase.layer.ZopeLite tests:
  Set up Testing.ZopeTestCase.layer.ZopeLite in 0.000 seconds.
  Ran 3 tests with 0 failures and 0 errors in 0.010 seconds.
Running Products.PloneTestCase.layer.PloneSite tests:
  Set up Products.PloneTestCase.layer.ZCML in 3.836 seconds.
  Set up Products.PloneTestCase.layer.PloneSite/home/stefan/autotest/temp/python26-zope213-cmf22-plone42/eggs/Products.kupu-1.5.0-py2.6.egg/Products/kupu/plone/util.py:29: DeprecationWarning: minimalpath() is deprecated and will be removed in CMF 2.3.
  kupu_plone_skin_dir = minimalpath(os.path.join(kupu_package_dir, relpath))
/home/stefan/autotest/temp/python26-zope213-cmf22-plone42/eggs/Products.kupu-1.5.0-py2.6.egg/Products/kupu/plone/util.py:30: DeprecationWarning: createDirectoryView() called with deprecated reg_key format. Support for old key formats will be removed in CMF 2.3. Please use the new key format <product>:<subdir> instead.
  createDirectoryView(skinstool, kupu_plone_skin_dir, name)
<string>:207: DeprecationWarning: changeSkin should be called with 'REQUEST' as second argument. The BBB code will be removed in CMF 2.3.
/home/stefan/autotest/temp/python26-zope213-cmf22-plone42/eggs/Products.kupu-1.5.0-py2.6.egg/Products/kupu/plone/tests/kuputestcase.py:26: DeprecationWarning: load_config is deprecated. Please import from Zope2.App.zcml
  zcml.load_config('configure.zcml', Products.kupu.plone)
 in 5.600 seconds.
/home/stefan/autotest/temp/python26-zope213-cmf22-plone42/eggs/Products.CMFPlacefulWorkflow-1.5.4-py2.6.egg/Products/CMFPlacefulWorkflow/tests/policy_form.txt:1: DeprecationWarning: Browser is deprecated. Please import from Testing.testbrowser
  ;-*-Doctest-*-
/home/stefan/autotest/temp/python26-zope213-cmf22-plone42/eggs/Products.kupu-1.5.0-py2.6.egg/Products/kupu/plone/plonedrawers.py:224: DeprecationWarning: getIcon() is deprecated and provides only limited backwards compatibility. It will be removed in CMF 2.4. Please use getIconExprObject() instead.
  return "%s/%s" % (self.base, type.getIcon())
  Ran 390 tests with 0 failures and 0 errors in 23.157 seconds.
Running Products.CMFPlacefulWorkflow.tests.test_exportimport.ExportImportLayer tests:
  Set up Products.CMFPlacefulWorkflow.tests.test_exportimport.ExportImportLayer in 0.004 seconds.
  Ran 1 tests with 0 failures and 0 errors in 1.003 seconds.
Running zope.testing.testrunner.layer.UnitTests tests:
  Tear down Products.CMFPlacefulWorkflow.tests.test_exportimport.ExportImportLayer in 0.000 seconds.
  Tear down Products.PloneTestCase.layer.PloneSite in 0.202 seconds.
  Tear down Products.PloneTestCase.layer.ZCML in 0.008 seconds.
  Tear down Testing.ZopeTestCase.layer.ZopeLite in 0.000 seconds.
  Set up zope.testing.testrunner.layer.UnitTests in 0.000 seconds.
Generated checkid_setup request to http://www.myopenid.com/server with assocication {HMAC-SHA1}{4e3f883f}{lolzUg==}
Generated checkid_setup request to http://www.myopenid.com/server with assocication {HMAC-SHA1}{4e3f8840}{ngI3dA==}
  Ran 19 tests with 0 failures and 0 errors in 1.458 seconds.
Tearing down left over layers:
  Tear down zope.testing.testrunner.layer.UnitTests in 0.000 seconds.
Total: 413 tests, 0 failures, 0 errors in 36.308 seconds.
/home/stefan/autotest/temp/python26-zope213-cmf22-plone42/bin/test:267: DeprecationWarning: zope.testing.testrunner is deprecated in favour of zope.testrunner.
  import zope.testing.testrunner
/home/stefan/autotest/temp/python26-zope213-cmf22-plone42/eggs/zope.testing-3.9.6-py2.6.egg/zope/testing/testrunner/formatter.py:28: DeprecationWarning: zope.testing.exceptions is deprecated in favour of zope.testrunner.exceptions
  from zope.testing.exceptions import DocTestFailureException
Running Testing.ZopeTestCase.layer.ZopeLite tests:
  Set up Testing.ZopeTestCase.layer.ZopeLite in 0.739 seconds.
/home/stefan/autotest/temp/python26-zope213-cmf22-plone42/bin/test:1: DeprecationWarning: load_config is deprecated. Please import from Zope2.App.zcml
  #!/usr/local/python2.6/bin/python
  Ran 9 tests with 0 failures and 0 errors in 0.095 seconds.
Running Products.Archetypes.tests.layer.ZCML tests:
  Set up Products.CMFCore.testing.FunctionalZCMLLayer in 0.204 seconds.
  Set up Products.Archetypes.tests.layer.ZCML in 0.379 seconds.
  Ran 59 tests with 0 failures and 0 errors in 3.808 seconds.
Running Products.Archetypes.tests.layer.ArchetypesSite tests:
  Set up Products.Archetypes.tests.layer.ArchetypesSite/home/stefan/autotest/temp/python26-zope213-cmf22-plone42/src/Products.GenericSetup/Products/GenericSetup/utils.py:122: DeprecationWarning: UserFolder is deprecated. User folders are no longer part of AccessControl, please depend on Zope2 and import from OFS.userfolder or use the new minimal user folder classes from AccessControl.userfolder.
  obj = getattr( obj, part )
 in 1.469 seconds.
/home/stefan/autotest/temp/python26-zope213-cmf22-plone42/eggs/Products.ZCatalog-2.13.18-py2.6.egg/Products/ZCatalog/ZCatalog.py:604: DeprecationWarning: Your query None produced no query restriction. Currently the entire catalog content is returned. In Zope 2.14 this will result in an empty LazyCat to be returned.
  return self._catalog.searchResults(REQUEST, used, **kw)
  Ran 466 tests with 0 failures and 0 errors in 37.314 seconds.
Running Products.PloneTestCase.layer.PloneSite tests:
  Tear down Products.Archetypes.tests.layer.ArchetypesSite in 0.043 seconds.
  Tear down Products.Archetypes.tests.layer.ZCML in 0.005 seconds.
  Tear down Products.CMFCore.testing.FunctionalZCMLLayer in 0.000 seconds.
  Set up Products.PloneTestCase.layer.ZCML in 4.696 seconds.
  Set up Products.PloneTestCase.layer.PloneSite in 4.574 seconds.
  Ran 10 tests with 0 failures and 0 errors in 1.626 seconds.
Running plone.app.kss.tests.kss_and_plone_layer.KSSAndPloneLayer tests:
  Set up plone.app.kss.tests.kss_and_plone_layer.KSSAndPloneLayer in 0.008 seconds.
  Ran 19 tests with 0 failures and 0 errors in 1.891 seconds.
Running zope.testing.testrunner.layer.UnitTests tests:
  Tear down plone.app.kss.tests.kss_and_plone_layer.KSSAndPloneLayer in 0.000 seconds.
  Tear down Products.PloneTestCase.layer.PloneSite in 0.186 seconds.
  Tear down Products.PloneTestCase.layer.ZCML in 0.005 seconds.
  Tear down Testing.ZopeTestCase.layer.ZopeLite in 0.000 seconds.
  Set up zope.testing.testrunner.layer.UnitTests in 0.000 seconds.
  Ran 25 tests with 0 failures and 0 errors in 0.149 seconds.
Tearing down left over layers:
  Tear down zope.testing.testrunner.layer.UnitTests in 0.000 seconds.
Total: 588 tests, 0 failures, 0 errors in 58.663 seconds.
/home/stefan/autotest/temp/python26-zope213-cmf22-plone42/bin/test:267: DeprecationWarning: zope.testing.testrunner is deprecated in favour of zope.testrunner.
  import zope.testing.testrunner
/home/stefan/autotest/temp/python26-zope213-cmf22-plone42/eggs/zope.testing-3.9.6-py2.6.egg/zope/testing/testrunner/formatter.py:28: DeprecationWarning: zope.testing.exceptions is deprecated in favour of zope.testrunner.exceptions
  from zope.testing.exceptions import DocTestFailureException
Running Testing.ZopeTestCase.layer.ZopeLite tests:
  Set up Testing.ZopeTestCase.layer.ZopeLite in 0.089 seconds.
  Ran 229 tests with 0 failures and 0 errors in 1.138 seconds.
Running Products.CMFCalendar.testing.FunctionalLayer tests:
  Set up Products.CMFCore.testing.FunctionalZCMLLayer in 0.214 seconds.
  Set up Products.CMFCalendar.testing.FunctionalLayer/home/stefan/autotest/temp/python26-zope213-cmf22-plone42/src/Products.GenericSetup/Products/GenericSetup/utils.py:122: DeprecationWarning: UserFolder is deprecated. User folders are no longer part of AccessControl, please depend on Zope2 and import from OFS.userfolder or use the new minimal user folder classes from AccessControl.userfolder.
  obj = getattr( obj, part )
 in 0.427 seconds.
  Ran 20 tests with 0 failures and 0 errors in 1.408 seconds.
Running Products.CMFCore.testing.EventZCMLLayer tests:
  Tear down Products.CMFCalendar.testing.FunctionalLayer in 0.017 seconds.
  Tear down Products.CMFCore.testing.FunctionalZCMLLayer in 0.001 seconds.
  Set up Products.CMFCore.testing.EventZCMLLayer in 0.001 seconds.
  Ran 8 tests with 0 failures and 0 errors in 0.210 seconds.
Running Products.CMFCore.testing.ExportImportZCMLLayer tests:
  Tear down Products.CMFCore.testing.EventZCMLLayer in 0.000 seconds.
  Set up Products.CMFCore.testing.ExportImportZCMLLayer in 0.001 seconds.
  Ran 10 tests with 0 failures and 0 errors in 0.736 seconds.
Running Products.CMFCore.testing.TraversingEventZCMLLayer tests:
  Tear down Products.CMFCore.testing.ExportImportZCMLLayer in 0.000 seconds.
  Set up Products.CMFCore.testing.TraversingEventZCMLLayer in 0.001 seconds.
  Ran 5 tests with 0 failures and 0 errors in 0.171 seconds.
Running Products.CMFDefault.testing.FunctionalLayer tests:
  Tear down Products.CMFCore.testing.TraversingEventZCMLLayer in 0.000 seconds.
  Set up Products.CMFCore.testing.FunctionalZCMLLayer in 0.168 seconds.
  Set up Products.CMFDefault.testing.FunctionalLayer in 0.332 seconds.
  Ran 32 tests with 0 failures and 0 errors in 4.130 seconds.
Running Products.CMFUid.testing.UidEventZCMLLayer tests:
  Tear down Products.CMFDefault.testing.FunctionalLayer in 0.015 seconds.
  Tear down Products.CMFCore.testing.FunctionalZCMLLayer in 0.002 seconds.
  Set up Products.CMFUid.testing.UidEventZCMLLayer in 0.001 seconds.
  Ran 12 tests with 0 failures and 0 errors in 0.318 seconds.
Running Products.DCWorkflow.testing.ExportImportZCMLLayer tests:
  Tear down Products.CMFUid.testing.UidEventZCMLLayer in 0.000 seconds.
  Set up Products.DCWorkflow.testing.ExportImportZCMLLayer in 0.155 seconds.
  Ran 38 tests with 0 failures and 0 errors in 0.721 seconds.
Running Products.GenericSetup.testing.ExportImportZCMLLayer tests:
  Tear down Products.DCWorkflow.testing.ExportImportZCMLLayer in 0.000 seconds.
  Set up Products.GenericSetup.testing.ExportImportZCMLLayer in 0.049 seconds.
  Ran 193 tests with 0 failures and 0 errors in 0.640 seconds.
Running zope.testing.testrunner.layer.UnitTests tests:
  Tear down Products.GenericSetup.testing.ExportImportZCMLLayer in 0.000 seconds.
  Tear down Testing.ZopeTestCase.layer.ZopeLite in 0.000 seconds.
  Set up zope.testing.testrunner.layer.UnitTests in 0.000 seconds.
  Ran 261 tests with 0 failures and 0 errors in 0.276 seconds.
Tearing down left over layers:
  Tear down zope.testing.testrunner.layer.UnitTests in 0.000 seconds.
Total: 808 tests, 0 failures, 0 errors in 12.508 seconds.
/home/stefan/autotest/temp/python26-zope213-cmf22-plone42/bin/test:267: DeprecationWarning: zope.testing.testrunner is deprecated in favour of zope.testrunner.
  import zope.testing.testrunner
/home/stefan/autotest/temp/python26-zope213-cmf22-plone42/eggs/zope.testing-3.9.6-py2.6.egg/zope/testing/testrunner/formatter.py:28: DeprecationWarning: zope.testing.exceptions is deprecated in favour of zope.testrunner.exceptions
  from zope.testing.exceptions import DocTestFailureException
Running Testing.ZopeTestCase.layer.ZopeLite tests:
  Set up Testing.ZopeTestCase.layer.ZopeLite in 0.862 seconds.
  Ran 27 tests with 0 failures and 0 errors in 0.055 seconds.
Running Products.PloneTestCase.layer.PloneSite tests:
  Set up Products.PloneTestCase.layer.ZCML in 4.636 seconds.
  Set up Products.PloneTestCase.layer.PloneSite in 5.552 seconds.
  Ran 135 tests with 0 failures and 0 errors in 22.568 seconds.
Running Products.CMFDiffTool.tests.BaseTestCase.CMFDiffToolLayer tests:
  Set up Products.CMFDiffTool.tests.BaseTestCase.CMFDiffToolLayer/home/stefan/autotest/temp/python26-zope213-cmf22-plone42/eggs/Products.CMFDiffTool-2.0-py2.6.egg/Products/CMFDiffTool/tests/BaseTestCase.py:39: DeprecationWarning: load_config is deprecated. Please import from Zope2.App.zcml
  zcml.load_config('configure.zcml', schemaextender)
 in 0.015 seconds.
  Ran 2 tests with 0 failures and 0 errors in 0.305 seconds.
Running Products.CMFTestCase.layer.CMFSite tests:
  Tear down Products.CMFDiffTool.tests.BaseTestCase.CMFDiffToolLayer in 0.209 seconds.
  Tear down Products.PloneTestCase.layer.PloneSite in 0.006 seconds.
  Tear down Products.PloneTestCase.layer.ZCML in 0.004 seconds.
  Set up Products.CMFTestCase.layer.ZCML in 3.842 seconds.
  Set up Products.CMFTestCase.layer.CMFSite/home/stefan/autotest/temp/python26-zope213-cmf22-plone42/src/Products.GenericSetup/Products/GenericSetup/utils.py:122: DeprecationWarning: UserFolder is deprecated. User folders are no longer part of AccessControl, please depend on Zope2 and import from OFS.userfolder or use the new minimal user folder classes from AccessControl.userfolder.
  obj = getattr( obj, part )
 in 1.302 seconds.
  Ran 20 tests with 0 failures and 0 errors in 0.405 seconds.
Running plone.app.blob.tests.layer.BlobReplacementLayer tests:
  Tear down Products.CMFTestCase.layer.CMFSite in 0.033 seconds.
  Tear down Products.CMFTestCase.layer.ZCML in 0.003 seconds.
  Set up Products.PloneTestCase.layer.ZCML in 3.863 seconds.
  Set up Products.PloneTestCase.layer.PloneSite in 4.540 seconds.
  Set up plone.app.blob.tests.layer.BlobLayer in 0.094 seconds.
  Set up plone.app.blob.tests.layer.BlobReplacementLayer in 0.205 seconds.
  Ran 6 tests with 0 failures and 0 errors in 2.038 seconds.
Running zope.testing.testrunner.layer.UnitTests tests:
  Tear down plone.app.blob.tests.layer.BlobReplacementLayer in 0.000 seconds.
  Tear down plone.app.blob.tests.layer.BlobLayer in 0.000 seconds.
  Tear down Products.PloneTestCase.layer.PloneSite in 0.206 seconds.
  Tear down Products.PloneTestCase.layer.ZCML in 0.004 seconds.
  Tear down Testing.ZopeTestCase.layer.ZopeLite in 0.000 seconds.
  Set up zope.testing.testrunner.layer.UnitTests in 0.000 seconds.
  Ran 1 tests with 0 failures and 0 errors in 0.005 seconds.
Tearing down left over layers:
  Tear down zope.testing.testrunner.layer.UnitTests in 0.000 seconds.
Total: 191 tests, 0 failures, 0 errors in 52.140 seconds.
/home/stefan/autotest/temp/python26-zope213-cmf22-plone42/bin/test:267: DeprecationWarning: zope.testing.testrunner is deprecated in favour of zope.testrunner.
  import zope.testing.testrunner
/home/stefan/autotest/temp/python26-zope213-cmf22-plone42/eggs/zope.testing-3.9.6-py2.6.egg/zope/testing/testrunner/formatter.py:28: DeprecationWarning: zope.testing.exceptions is deprecated in favour of zope.testrunner.exceptions
  from zope.testing.exceptions import DocTestFailureException
/home/stefan/autotest/temp/python26-zope213-cmf22-plone42/eggs/plone.app.content-2.0.7-py2.6.egg/plone/app/content/browser/tests/test_doctests.py:1: DeprecationWarning: zope.testing.doctest is deprecated in favour of the Python standard library doctest module
  from zope.testing import doctest
/home/stefan/autotest/temp/python26-zope213-cmf22-plone42/eggs/plone.app.content-2.0.7-py2.6.egg/plone/app/content/browser/tests/test_reviewlist.py:8: DeprecationWarning: Browser is deprecated. Please import from Testing.testbrowser
  from Products.Five.testbrowser import Browser
/home/stefan/autotest/temp/python26-zope213-cmf22-plone42/eggs/plone.app.i18n-2.0.1-py2.6.egg/plone/app/i18n/locales/browser/tests.py:7: DeprecationWarning: zope.testing.doctestunit is deprecated in favour of the Python standard library doctest module
  from zope.testing.doctestunit import DocTestSuite
/home/stefan/autotest/temp/python26-zope213-cmf22-plone42/src/plone.testing/src/plone/testing/z2.py:19: DeprecationWarning: Zope2VocabularyRegistry is deprecated. Please import from Zope2.App.schema
  from Products.Five.schema import Zope2VocabularyRegistry
Running Testing.ZopeTestCase.layer.ZopeLite tests:
  Set up Testing.ZopeTestCase.layer.ZopeLite in 0.497 seconds.
  Ran 120 tests with 0 failures and 0 errors in 0.758 seconds.
Running Products.CMFTestCase.layer.CMFSite tests:
  Set up Products.CMFTestCase.layer.ZCML in 4.684 seconds.
  Set up Products.CMFTestCase.layer.CMFSite/home/stefan/autotest/temp/python26-zope213-cmf22-plone42/src/Products.GenericSetup/Products/GenericSetup/utils.py:122: DeprecationWarning: UserFolder is deprecated. User folders are no longer part of AccessControl, please depend on Zope2 and import from OFS.userfolder or use the new minimal user folder classes from AccessControl.userfolder.
  obj = getattr( obj, part )
 in 0.244 seconds.
  Ran 32 tests with 0 failures and 0 errors in 3.386 seconds.
Running Products.PloneTestCase.layer.ZCML tests:
  Tear down Products.CMFTestCase.layer.CMFSite in 0.018 seconds.
  Tear down Products.CMFTestCase.layer.ZCML in 0.004 seconds.
  Set up Products.PloneTestCase.layer.ZCML in 3.972 seconds.
  Ran 12 tests with 0 failures and 0 errors in 0.016 seconds.
Running Products.PloneTestCase.layer.PloneSite tests:
  Set up Products.PloneTestCase.layer.PloneSite in 11.824 seconds.
/home/stefan/autotest/temp/python26-zope213-cmf22-plone42/eggs/Products.PortalTransforms-2.0.7-py2.6.egg/Products/PortalTransforms/libtransforms/commandtransform.py:103: DeprecationWarning: os.popen4 is deprecated.  Use the subprocess module.
  cin, couterr = os.popen4(command, 'b')
  Ran 1506 tests with 0 failures and 0 errors in 4 minutes 31.491 seconds.
Running plone.app.contentrules.tests.test_configuration.TestContentrulesGSLayer tests:
  Set up plone.app.contentrules.tests.test_configuration.TestContentrulesGSLayer in 0.005 seconds.
  Ran 6 tests with 0 failures and 0 errors in 2.723 seconds.
Running plone.app.customerize.tests.layer.PloneCustomerize tests:
  Tear down plone.app.contentrules.tests.test_configuration.TestContentrulesGSLayer in 0.000 seconds.
  Set up plone.app.customerize.tests.layer.PloneCustomerize in 0.015 seconds.
  Ran 2 tests with 0 failures and 0 errors in 3.126 seconds.
Running plone.app.kss.tests.kss_and_plone_layer.KSSAndPloneLayer tests:
  Tear down plone.app.customerize.tests.layer.PloneCustomerize in 0.000 seconds.
  Set up plone.app.kss.tests.kss_and_plone_layer.KSSAndPloneLayer in 0.008 seconds.
  Ran 15 tests with 0 failures and 0 errors in 1.294 seconds.
Running plone.app.testing.layers.Plone:Functional tests:
  Tear down plone.app.kss.tests.kss_and_plone_layer.KSSAndPloneLayer in 0.000 seconds.
  Tear down Products.PloneTestCase.layer.PloneSite in 0.615 seconds.
  Tear down Products.PloneTestCase.layer.ZCML in 0.015 seconds.
  Tear down Testing.ZopeTestCase.layer.ZopeLite in 0.000 seconds.
  Set up plone.testing.zca.LayerCleanup in 0.001 seconds.
  Set up plone.testing.z2.Startup/home/stefan/autotest/temp/python26-zope213-cmf22-plone42/eggs/zope.configuration-3.7.4-py2.6.egg/zope/configuration/config.py:193: DeprecationWarning: FiveSecurityPolicy is deprecated. Please import from AccessControl.security
  obj = getattr(mod, oname)
 in 0.122 seconds.
  Set up plone.app.testing.layers.PloneFixture in 6.512 seconds.
  Set up plone.app.testing.layers.Plone:Functional in 0.000 seconds.
  Ran 1 tests with 0 failures and 0 errors in 2.710 seconds.
Running plone.app.upgrade.tests.base.FunctionalUpgradeLayer tests:
  Tear down plone.app.testing.layers.Plone:Functional in 0.000 seconds.
  Tear down plone.app.testing.layers.PloneFixture in 0.097 seconds.
  Tear down plone.testing.z2.Startup in 0.007 seconds.
  Tear down plone.testing.zca.LayerCleanup in 0.007 seconds.
  Set up Testing.ZopeTestCase.layer.ZopeLite in 0.013 seconds.
  Set up Products.PloneTestCase.layer.ZCML in 3.984 seconds.
  Set up Products.PloneTestCase.layer.PloneSite in 11.358 seconds.
  Set up plone.app.upgrade.tests.base.FunctionalUpgradeLayer in 0.000 seconds.
  Ran 13 tests with 0 failures and 0 errors in 1 minutes 28.422 seconds.
Running plone.app.viewletmanager.tests.test_exportimport.Layer tests:
  Tear down plone.app.upgrade.tests.base.FunctionalUpgradeLayer in 0.000 seconds.
  Tear down Products.PloneTestCase.layer.PloneSite in 0.639 seconds.
  Tear down Products.PloneTestCase.layer.ZCML in 0.005 seconds.
  Tear down Testing.ZopeTestCase.layer.ZopeLite in 0.000 seconds.
  Set up plone.app.viewletmanager.tests.test_exportimport.Layer in 0.000 seconds.
  Ran 16 tests with 0 failures and 0 errors in 0.054 seconds.
Running zope.testing.testrunner.layer.UnitTests tests:
  Tear down plone.app.viewletmanager.tests.test_exportimport.Layer in 0.000 seconds.
  Set up zope.testing.testrunner.layer.UnitTests in 0.000 seconds.
  Ran 130 tests with 0 failures and 0 errors in 1.000 seconds.
Tearing down left over layers:
  Tear down zope.testing.testrunner.layer.UnitTests in 0.000 seconds.
Total: 1853 tests, 0 failures, 0 errors in 7 minutes 4.174 seconds.
/home/stefan/autotest/temp/python26-zope213-cmf22-plone42/bin/test:267: DeprecationWarning: zope.testing.testrunner is deprecated in favour of zope.testrunner.
  import zope.testing.testrunner
/home/stefan/autotest/temp/python26-zope213-cmf22-plone42/eggs/zope.testing-3.9.6-py2.6.egg/zope/testing/testrunner/formatter.py:28: DeprecationWarning: zope.testing.exceptions is deprecated in favour of zope.testrunner.exceptions
  from zope.testing.exceptions import DocTestFailureException
Running Testing.ZopeTestCase.layer.ZopeLite tests:
  Set up Testing.ZopeTestCase.layer.ZopeLite in 1.495 seconds.
  Ran 151 tests with 0 failures and 0 errors in 0.794 seconds.
Running Products.PlonePAS.tests.layer.PlonePASLayer tests:
  Set up Products.PloneTestCase.layer.ZCML in 4.612 seconds.
  Set up Products.PloneTestCase.layer.PloneSite in 4.578 seconds.
  Set up Products.PlonePAS.tests.layer.PlonePASLayer in 0.000 seconds.
  Ran 150 tests with 0 failures and 0 errors in 2.167 seconds.
Running zope.testing.testrunner.layer.UnitTests tests:
  Tear down Products.PlonePAS.tests.layer.PlonePASLayer in 0.000 seconds.
  Tear down Products.PloneTestCase.layer.PloneSite in 0.178 seconds.
  Tear down Products.PloneTestCase.layer.ZCML in 0.004 seconds.
  Tear down Testing.ZopeTestCase.layer.ZopeLite in 0.000 seconds.
  Set up zope.testing.testrunner.layer.UnitTests in 0.000 seconds.
  Ran 349 tests with 0 failures and 0 errors in 0.103 seconds.
Tearing down left over layers:
  Tear down zope.testing.testrunner.layer.UnitTests in 0.000 seconds.
Total: 650 tests, 0 failures, 0 errors in 14.557 seconds.
/home/stefan/autotest/temp/python26-zope213-cmf22-plone42/bin/test:267: DeprecationWarning: zope.testing.testrunner is deprecated in favour of zope.testrunner.
  import zope.testing.testrunner
/home/stefan/autotest/temp/python26-zope213-cmf22-plone42/eggs/zope.testing-3.9.6-py2.6.egg/zope/testing/testrunner/formatter.py:28: DeprecationWarning: zope.testing.exceptions is deprecated in favour of zope.testrunner.exceptions
  from zope.testing.exceptions import DocTestFailureException
/home/stefan/autotest/temp/python26-zope213-cmf22-plone42/eggs/plone.fieldsets-2.0.1-py2.6.egg/plone/fieldsets/tests.py:6: DeprecationWarning: zope.testing.doctest is deprecated in favour of the Python standard library doctest module
  from zope.testing import doctest
/home/stefan/autotest/temp/python26-zope213-cmf22-plone42/eggs/plone.indexer-1.0-py2.6.egg/plone/indexer/tests.py:3: DeprecationWarning: zope.testing.doctestunit is deprecated in favour of the Python standard library doctest module
  from zope.testing import doctestunit
Running Products.PloneTestCase.layer.PloneSite tests:
  Set up Testing.ZopeTestCase.layer.ZopeLite in 1.398 seconds.
  Set up Products.PloneTestCase.layer.ZCML in 4.754 seconds.
  Set up Products.PloneTestCase.layer.PloneSite/home/stefan/autotest/temp/python26-zope213-cmf22-plone42/eggs/borg.localrole-3.0.2-py2.6.egg/borg/localrole/tests.py:52: DeprecationWarning: load_config is deprecated. Please import from Zope2.App.zcml
  zcml.load_config('configure.zcml', borg.localrole)
 in 4.697 seconds.
  Ran 5 tests with 0 failures and 0 errors in 0.157 seconds.
Running plone.browserlayer.tests.test_doctest.PloneBrowserLayerLayer tests:
  Set up plone.browserlayer.tests.test_doctest.PloneBrowserLayerLayer in 0.007 seconds.
/home/stefan/autotest/temp/python26-zope213-cmf22-plone42/eggs/plone.browserlayer-2.1-py2.6.egg/plone/browserlayer/README.txt:1: DeprecationWarning: Browser is deprecated. Please import from Testing.testbrowser
  plone.browserlayer tests
  Ran 1 tests with 0 failures and 0 errors in 0.731 seconds.
Running plone.theme.tests.test_doctest.PloneThemeLayer tests:
  Tear down plone.browserlayer.tests.test_doctest.PloneBrowserLayerLayer in 0.000 seconds.
  Set up plone.theme.tests.test_doctest.PloneThemeLayer in 0.005 seconds.
  Ran 1 tests with 0 failures and 0 errors in 0.044 seconds.
Running zope.testing.testrunner.layer.UnitTests tests:
  Tear down plone.theme.tests.test_doctest.PloneThemeLayer in 0.000 seconds.
  Tear down Products.PloneTestCase.layer.PloneSite in 0.176 seconds.
  Tear down Products.PloneTestCase.layer.ZCML in 0.004 seconds.
  Tear down Testing.ZopeTestCase.layer.ZopeLite in 0.000 seconds.
  Set up zope.testing.testrunner.layer.UnitTests in 0.000 seconds.
  Ran 178 tests with 0 failures and 0 errors in 0.500 seconds.
Tearing down left over layers:
  Tear down zope.testing.testrunner.layer.UnitTests in 0.000 seconds.
Total: 185 tests, 0 failures, 0 errors in 13.464 seconds.
/home/stefan/autotest/temp/python26-zope213-cmf22-plone42/bin/test:267: DeprecationWarning: zope.testing.testrunner is deprecated in favour of zope.testrunner.
  import zope.testing.testrunner
/home/stefan/autotest/temp/python26-zope213-cmf22-plone42/eggs/zope.testing-3.9.6-py2.6.egg/zope/testing/testrunner/formatter.py:28: DeprecationWarning: zope.testing.exceptions is deprecated in favour of zope.testrunner.exceptions
  from zope.testing.exceptions import DocTestFailureException
Running Products.PloneTestCase.layer.PloneSite tests:
  Set up Testing.ZopeTestCase.layer.ZopeLite in 1.390 seconds.
  Set up Products.PloneTestCase.layer.ZCML in 4.654 seconds.
  Set up Products.PloneTestCase.layer.PloneSite/home/stefan/autotest/temp/python26-zope213-cmf22-plone42/src/plone.portlet.collection/plone/portlet/collection/tests/base.py:21: DeprecationWarning: load_config is deprecated. Please import from Zope2.App.zcml
  zcml.load_config('configure.zcml', plone.portlet.collection)
 in 4.559 seconds.
/home/stefan/autotest/temp/python26-zope213-cmf22-plone42/src/plone.portlet.collection/plone/portlet/collection/tests/functional.txt:1: DeprecationWarning: Browser is deprecated. Please import from Testing.testbrowser
  ====================
  Ran 175 tests with 0 failures and 0 errors in 19.865 seconds.
Running plone.app.portlets.tests.layer.PlonePortlets tests:
  Set up plone.app.portlets.tests.layer.PlonePortlets in 0.000 seconds.
  Ran 1 tests with 0 failures and 0 errors in 1.180 seconds.
Running plone.app.portlets.tests.test_configuration.TestPortletZCMLLayer tests:
  Tear down plone.app.portlets.tests.layer.PlonePortlets in 0.000 seconds.
  Set up plone.app.portlets.tests.test_configuration.TestPortletZCMLLayer in 0.016 seconds.
  Ran 18 tests with 0 failures and 0 errors in 11.436 seconds.
Running zope.testing.testrunner.layer.UnitTests tests:
  Tear down plone.app.portlets.tests.test_configuration.TestPortletZCMLLayer in 0.000 seconds.
  Tear down Products.PloneTestCase.layer.PloneSite in 0.186 seconds.
  Tear down Products.PloneTestCase.layer.ZCML in 0.008 seconds.
  Tear down Testing.ZopeTestCase.layer.ZopeLite in 0.000 seconds.
  Set up zope.testing.testrunner.layer.UnitTests in 0.000 seconds.
  Ran 5 tests with 0 failures and 0 errors in 0.166 seconds.
Tearing down left over layers:
  Tear down zope.testing.testrunner.layer.UnitTests in 0.000 seconds.
Total: 199 tests, 0 failures, 0 errors in 44.539 seconds.
/home/stefan/autotest/temp/python26-zope213-cmf22-plone42/bin/test:267: DeprecationWarning: zope.testing.testrunner is deprecated in favour of zope.testrunner.
  import zope.testing.testrunner
/home/stefan/autotest/temp/python26-zope213-cmf22-plone42/eggs/zope.testing-3.9.6-py2.6.egg/zope/testing/testrunner/formatter.py:28: DeprecationWarning: zope.testing.exceptions is deprecated in favour of zope.testrunner.exceptions
  from zope.testing.exceptions import DocTestFailureException
Running zope.testing.testrunner.layer.UnitTests tests:
  Set up zope.testing.testrunner.layer.UnitTests in 0.000 seconds.
  Ran 3 tests with 0 failures and 0 errors in 14.274 seconds.
Tearing down left over layers:
  Tear down zope.testing.testrunner.layer.UnitTests in 0.000 seconds.
/home/stefan/autotest/temp/python26-zope213-cmf22-plone42/bin/test:267: DeprecationWarning: zope.testing.testrunner is deprecated in favour of zope.testrunner.
  import zope.testing.testrunner
/home/stefan/autotest/temp/python26-zope213-cmf22-plone42/eggs/zope.testing-3.9.6-py2.6.egg/zope/testing/testrunner/formatter.py:28: DeprecationWarning: zope.testing.exceptions is deprecated in favour of zope.testrunner.exceptions
  from zope.testing.exceptions import DocTestFailureException
Running zope.testing.testrunner.layer.UnitTests tests:
  Set up zope.testing.testrunner.layer.UnitTests in 0.000 seconds.
  Ran 214 tests with 0 failures and 0 errors in 0.574 seconds.
Tearing down left over layers:
  Tear down zope.testing.testrunner.layer.UnitTests in 0.000 seconds.
/home/stefan/autotest/temp/python26-zope213-cmf22-plone42/bin/test:267: DeprecationWarning: zope.testing.testrunner is deprecated in favour of zope.testrunner.
  import zope.testing.testrunner
/home/stefan/autotest/temp/python26-zope213-cmf22-plone42/eggs/zope.testing-3.9.6-py2.6.egg/zope/testing/testrunner/formatter.py:28: DeprecationWarning: zope.testing.exceptions is deprecated in favour of zope.testrunner.exceptions
  from zope.testing.exceptions import DocTestFailureException
Running Products.CMFTestCase.layer.CMFSite tests:
  Set up Testing.ZopeTestCase.layer.ZopeLite in 0.222 seconds.
  Set up Products.CMFTestCase.layer.ZCML in 0.485 seconds.
  Set up Products.CMFTestCase.layer.CMFSite/home/stefan/autotest/temp/python26-zope213-cmf22-plone42/src/Products.GenericSetup/Products/GenericSetup/utils.py:122: DeprecationWarning: UserFolder is deprecated. User folders are no longer part of AccessControl, please depend on Zope2 and import from OFS.userfolder or use the new minimal user folder classes from AccessControl.userfolder.
  obj = getattr( obj, part )
 in 0.212 seconds.
  Ran 58 tests with 0 failures and 0 errors in 0.228 seconds.
Tearing down left over layers:
  Tear down Products.CMFTestCase.layer.CMFSite in 0.018 seconds.
  Tear down Products.CMFTestCase.layer.ZCML in 0.001 seconds.
  Tear down Testing.ZopeTestCase.layer.ZopeLite in 0.000 seconds.
/home/stefan/autotest/temp/python26-zope213-cmf22-plone42/bin/test:267: DeprecationWarning: zope.testing.testrunner is deprecated in favour of zope.testrunner.
  import zope.testing.testrunner
/home/stefan/autotest/temp/python26-zope213-cmf22-plone42/eggs/zope.testing-3.9.6-py2.6.egg/zope/testing/testrunner/formatter.py:28: DeprecationWarning: zope.testing.exceptions is deprecated in favour of zope.testrunner.exceptions
  from zope.testing.exceptions import DocTestFailureException
Running zope.testing.testrunner.layer.UnitTests tests:
  Set up zope.testing.testrunner.layer.UnitTests in 0.000 seconds.
  Ran 25 tests with 0 failures and 0 errors in 0.192 seconds.
Tearing down left over layers:
  Tear down zope.testing.testrunner.layer.UnitTests in 0.000 seconds.
/home/stefan/autotest/temp/python26-zope213-cmf22-plone42/bin/test:267: DeprecationWarning: zope.testing.testrunner is deprecated in favour of zope.testrunner.
  import zope.testing.testrunner
/home/stefan/autotest/temp/python26-zope213-cmf22-plone42/eggs/zope.testing-3.9.6-py2.6.egg/zope/testing/testrunner/formatter.py:28: DeprecationWarning: zope.testing.exceptions is deprecated in favour of zope.testrunner.exceptions
  from zope.testing.exceptions import DocTestFailureException
Running Products.PloneTestCase.layer.PloneSite tests:
  Set up Testing.ZopeTestCase.layer.ZopeLite in 1.393 seconds.
  Set up Products.PloneTestCase.layer.ZCML in 4.719 seconds.
  Set up Products.PloneTestCase.layer.PloneSite in 4.451 seconds.
/home/stefan/autotest/temp/python26-zope213-cmf22-plone42/eggs/Products.PasswordResetTool-2.0.6-py2.6.egg/Products/PasswordResetTool/tests/browser.txt:1: DeprecationWarning: Browser is deprecated. Please import from Testing.testbrowser
  Functional tests for PasswordResetTool
  Ran 2 tests with 0 failures and 0 errors in 4.058 seconds.
Tearing down left over layers:
  Tear down Products.PloneTestCase.layer.PloneSite in 0.179 seconds.
  Tear down Products.PloneTestCase.layer.ZCML in 0.006 seconds.
  Tear down Testing.ZopeTestCase.layer.ZopeLite in 0.000 seconds.
/home/stefan/autotest/temp/python26-zope213-cmf22-plone42/bin/test:267: DeprecationWarning: zope.testing.testrunner is deprecated in favour of zope.testrunner.
  import zope.testing.testrunner
/home/stefan/autotest/temp/python26-zope213-cmf22-plone42/eggs/zope.testing-3.9.6-py2.6.egg/zope/testing/testrunner/formatter.py:28: DeprecationWarning: zope.testing.exceptions is deprecated in favour of zope.testrunner.exceptions
  from zope.testing.exceptions import DocTestFailureException
Running Products.PloneTestCase.layer.PloneSite tests:
  Set up Testing.ZopeTestCase.layer.ZopeLite in 1.431 seconds.
  Set up Products.PloneTestCase.layer.ZCML in 4.771 seconds.
  Set up Products.PloneTestCase.layer.PloneSite in 4.623 seconds.
  Ran 248 tests with 0 failures and 0 errors in 15.618 seconds.
Running zope.testing.testrunner.layer.UnitTests tests:
  Tear down Products.PloneTestCase.layer.PloneSite in 0.191 seconds.
  Tear down Products.PloneTestCase.layer.ZCML in 0.005 seconds.
  Tear down Testing.ZopeTestCase.layer.ZopeLite in 0.000 seconds.
  Set up zope.testing.testrunner.layer.UnitTests in 0.000 seconds.
  Ran 62 tests with 0 failures and 0 errors in 0.013 seconds.
Tearing down left over layers:
  Tear down zope.testing.testrunner.layer.UnitTests in 0.000 seconds.
Total: 310 tests, 0 failures, 0 errors in 27.151 seconds.
/home/stefan/autotest/temp/python26-zope213-cmf22-plone42/bin/test:267: DeprecationWarning: zope.testing.testrunner is deprecated in favour of zope.testrunner.
  import zope.testing.testrunner
/home/stefan/autotest/temp/python26-zope213-cmf22-plone42/eggs/zope.testing-3.9.6-py2.6.egg/zope/testing/testrunner/formatter.py:28: DeprecationWarning: zope.testing.exceptions is deprecated in favour of zope.testrunner.exceptions
  from zope.testing.exceptions import DocTestFailureException
/home/stefan/autotest/temp/python26-zope213-cmf22-plone42/src/plone.testing/src/plone/testing/z2.py:19: DeprecationWarning: Zope2VocabularyRegistry is deprecated. Please import from Zope2.App.schema
  from Products.Five.schema import Zope2VocabularyRegistry
Running Products.TinyMCE.tests.base.TinyMCELayer:Functional tests:
  Set up plone.testing.zca.LayerCleanup in 0.000 seconds.
  Set up plone.testing.z2.Startup/home/stefan/autotest/temp/python26-zope213-cmf22-plone42/eggs/zope.configuration-3.7.4-py2.6.egg/zope/configuration/config.py:193: DeprecationWarning: FiveSecurityPolicy is deprecated. Please import from AccessControl.security
  obj = getattr(mod, oname)
 in 0.325 seconds.
  Set up plone.app.testing.layers.PloneFixture in 8.506 seconds.
  Set up Products.TinyMCE.tests.base.TinyMCELayer in 0.424 seconds.
  Set up Products.TinyMCE.tests.base.TinyMCELayer:Functional in 0.000 seconds.
  Ran 20 tests with 0 failures and 0 errors in 2.935 seconds.
Running Products.TinyMCE.tests.base.TinyMCELayer:Integration tests:
  Tear down Products.TinyMCE.tests.base.TinyMCELayer:Functional in 0.000 seconds.
  Set up Products.TinyMCE.tests.base.TinyMCELayer:Integration in 0.000 seconds.
  Ran 3 tests with 0 failures and 0 errors in 4.431 seconds.
Tearing down left over layers:
  Tear down Products.TinyMCE.tests.base.TinyMCELayer:Integration in 0.000 seconds.
  Tear down Products.TinyMCE.tests.base.TinyMCELayer in 0.007 seconds.
  Tear down plone.app.testing.layers.PloneFixture in 0.095 seconds.
  Tear down plone.testing.z2.Startup in 0.008 seconds.
  Tear down plone.testing.zca.LayerCleanup in 0.006 seconds.
Total: 23 tests, 0 failures, 0 errors in 17.265 seconds.
/home/stefan/autotest/temp/python26-zope213-cmf22-plone42/bin/test:267: DeprecationWarning: zope.testing.testrunner is deprecated in favour of zope.testrunner.
  import zope.testing.testrunner
/home/stefan/autotest/temp/python26-zope213-cmf22-plone42/eggs/zope.testing-3.9.6-py2.6.egg/zope/testing/testrunner/formatter.py:28: DeprecationWarning: zope.testing.exceptions is deprecated in favour of zope.testrunner.exceptions
  from zope.testing.exceptions import DocTestFailureException
Running Products.contentmigration.tests.layer.TestLayer tests:
  Set up Testing.ZopeTestCase.layer.ZopeLite in 1.437 seconds.
  Set up Products.PloneTestCase.layer.ZCML in 4.744 seconds.
  Set up Products.PloneTestCase.layer.PloneSite in 4.485 seconds.
  Set up Products.contentmigration.tests.layer.TestLayer in 0.005 seconds.
  Ran 13 tests with 0 failures and 0 errors in 4.425 seconds.
Tearing down left over layers:
  Tear down Products.contentmigration.tests.layer.TestLayer in 0.000 seconds.
  Tear down Products.PloneTestCase.layer.PloneSite in 0.179 seconds.
  Tear down Products.PloneTestCase.layer.ZCML in 0.004 seconds.
  Tear down Testing.ZopeTestCase.layer.ZopeLite in 0.000 seconds.
/home/stefan/autotest/temp/python26-zope213-cmf22-plone42/bin/test:267: DeprecationWarning: zope.testing.testrunner is deprecated in favour of zope.testrunner.
  import zope.testing.testrunner
/home/stefan/autotest/temp/python26-zope213-cmf22-plone42/eggs/zope.testing-3.9.6-py2.6.egg/zope/testing/testrunner/formatter.py:28: DeprecationWarning: zope.testing.exceptions is deprecated in favour of zope.testrunner.exceptions
  from zope.testing.exceptions import DocTestFailureException
Total: 0 tests, 0 failures, 0 errors in 0.000 seconds.
/home/stefan/autotest/temp/python26-zope213-cmf22-plone42/bin/test:267: DeprecationWarning: zope.testing.testrunner is deprecated in favour of zope.testrunner.
  import zope.testing.testrunner
/home/stefan/autotest/temp/python26-zope213-cmf22-plone42/eggs/zope.testing-3.9.6-py2.6.egg/zope/testing/testrunner/formatter.py:28: DeprecationWarning: zope.testing.exceptions is deprecated in favour of zope.testrunner.exceptions
  from zope.testing.exceptions import DocTestFailureException
/home/stefan/autotest/temp/python26-zope213-cmf22-plone42/src/plone.testing/src/plone/testing/z2.py:19: DeprecationWarning: Zope2VocabularyRegistry is deprecated. Please import from Zope2.App.schema
  from Products.Five.schema import Zope2VocabularyRegistry
Running archetypes.querywidget.tests.base.ArchetypesQueryWidget:Integration tests:
  Set up plone.testing.zca.LayerCleanup in 0.000 seconds.
  Set up plone.testing.z2.Startup/home/stefan/autotest/temp/python26-zope213-cmf22-plone42/eggs/zope.configuration-3.7.4-py2.6.egg/zope/configuration/config.py:193: DeprecationWarning: FiveSecurityPolicy is deprecated. Please import from AccessControl.security
  obj = getattr(mod, oname)
 in 0.212 seconds.
  Set up plone.app.testing.layers.PloneFixture in 9.622 seconds.
  Set up archetypes.querywidget.tests.base.ArchetypesQueryWidgetLayer in 1.232 seconds.
  Set up archetypes.querywidget.tests.base.ArchetypesQueryWidget:Integration in 0.000 seconds.
  Ran 1 tests with 0 failures and 0 errors in 2.973 seconds.
Tearing down left over layers:
  Tear down archetypes.querywidget.tests.base.ArchetypesQueryWidget:Integration in 0.000 seconds.
  Tear down archetypes.querywidget.tests.base.ArchetypesQueryWidgetLayer in 0.004 seconds.
  Tear down plone.app.testing.layers.PloneFixture in 0.100 seconds.
  Tear down plone.testing.z2.Startup in 0.008 seconds.
  Tear down plone.testing.zca.LayerCleanup in 0.006 seconds.
/home/stefan/autotest/temp/python26-zope213-cmf22-plone42/bin/test:267: DeprecationWarning: zope.testing.testrunner is deprecated in favour of zope.testrunner.
  import zope.testing.testrunner
/home/stefan/autotest/temp/python26-zope213-cmf22-plone42/eggs/zope.testing-3.9.6-py2.6.egg/zope/testing/testrunner/formatter.py:28: DeprecationWarning: zope.testing.exceptions is deprecated in favour of zope.testrunner.exceptions
  from zope.testing.exceptions import DocTestFailureException
Running archetypes.referencebrowserwidget.tests.base.layer tests:
  Set up Testing.ZopeTestCase.layer.ZopeLite in 0.000 seconds.
  Set up Products.PloneTestCase.layer.ZCML in 3.829 seconds.
  Set up Products.PloneTestCase.layer.PloneSite in 4.622 seconds.
  Set up archetypes.referencebrowserwidget.tests.base.layer in 0.000 seconds.
  Ran 36 tests with 0 failures and 0 errors in 8.824 seconds.
Running zope.testing.testrunner.layer.UnitTests tests:
  Tear down archetypes.referencebrowserwidget.tests.base.layer in 0.000 seconds.
  Tear down Products.PloneTestCase.layer.PloneSite in 0.188 seconds.
  Tear down Products.PloneTestCase.layer.ZCML in 0.008 seconds.
  Tear down Testing.ZopeTestCase.layer.ZopeLite in 0.000 seconds.
  Set up zope.testing.testrunner.layer.UnitTests in 0.000 seconds.
  Ran 5 tests with 0 failures and 0 errors in 0.001 seconds.
Tearing down left over layers:
  Tear down zope.testing.testrunner.layer.UnitTests in 0.000 seconds.
Total: 41 tests, 0 failures, 0 errors in 18.001 seconds.
/home/stefan/autotest/temp/python26-zope213-cmf22-plone42/bin/test:267: DeprecationWarning: zope.testing.testrunner is deprecated in favour of zope.testrunner.
  import zope.testing.testrunner
/home/stefan/autotest/temp/python26-zope213-cmf22-plone42/eggs/zope.testing-3.9.6-py2.6.egg/zope/testing/testrunner/formatter.py:28: DeprecationWarning: zope.testing.exceptions is deprecated in favour of zope.testrunner.exceptions
  from zope.testing.exceptions import DocTestFailureException
Running archetypes.schemaextender.tests.base.layer tests:
  Set up Testing.ZopeTestCase.layer.ZopeLite in 0.869 seconds.
  Set up Products.PloneTestCase.layer.ZCML in 4.765 seconds.
  Set up Products.PloneTestCase.layer.PloneSite in 4.450 seconds.
  Set up archetypes.schemaextender.tests.base.layer in 0.000 seconds.
  Ran 4 tests with 0 failures and 0 errors in 3.482 seconds.
Running zope.testing.testrunner.layer.UnitTests tests:
  Tear down archetypes.schemaextender.tests.base.layer in 0.000 seconds.
  Tear down Products.PloneTestCase.layer.PloneSite in 0.179 seconds.
  Tear down Products.PloneTestCase.layer.ZCML in 0.007 seconds.
  Tear down Testing.ZopeTestCase.layer.ZopeLite in 0.000 seconds.
  Set up zope.testing.testrunner.layer.UnitTests in 0.000 seconds.
  Ran 19 tests with 0 failures and 0 errors in 0.007 seconds.
Tearing down left over layers:
  Tear down zope.testing.testrunner.layer.UnitTests in 0.000 seconds.
Total: 23 tests, 0 failures, 0 errors in 14.265 seconds.
/home/stefan/autotest/temp/python26-zope213-cmf22-plone42/bin/test:267: DeprecationWarning: zope.testing.testrunner is deprecated in favour of zope.testrunner.
  import zope.testing.testrunner
/home/stefan/autotest/temp/python26-zope213-cmf22-plone42/eggs/zope.testing-3.9.6-py2.6.egg/zope/testing/testrunner/formatter.py:28: DeprecationWarning: zope.testing.exceptions is deprecated in favour of zope.testrunner.exceptions
  from zope.testing.exceptions import DocTestFailureException
Running zope.testing.testrunner.layer.UnitTests tests:
  Set up zope.testing.testrunner.layer.UnitTests in 0.000 seconds.
  Ran 4 tests with 0 failures and 0 errors in 0.044 seconds.
Tearing down left over layers:
  Tear down zope.testing.testrunner.layer.UnitTests in 0.000 seconds.
/home/stefan/autotest/temp/python26-zope213-cmf22-plone42/bin/test:267: DeprecationWarning: zope.testing.testrunner is deprecated in favour of zope.testrunner.
  import zope.testing.testrunner
/home/stefan/autotest/temp/python26-zope213-cmf22-plone42/eggs/zope.testing-3.9.6-py2.6.egg/zope/testing/testrunner/formatter.py:28: DeprecationWarning: zope.testing.exceptions is deprecated in favour of zope.testrunner.exceptions
  from zope.testing.exceptions import DocTestFailureException
/home/stefan/autotest/temp/python26-zope213-cmf22-plone42/eggs/collective.z3cform.datetimewidget-1.0-py2.6.egg/collective/z3cform/datetimewidget/tests.py:25: DeprecationWarning: zope.testing.doctest is deprecated in favour of the Python standard library doctest module
  from zope.testing import doctest
Running zope.testing.testrunner.layer.UnitTests tests:
  Set up zope.testing.testrunner.layer.UnitTests in 0.000 seconds.
  Ran 5 tests with 0 failures and 0 errors in 1.097 seconds.
Tearing down left over layers:
  Tear down zope.testing.testrunner.layer.UnitTests in 0.000 seconds.
/home/stefan/autotest/temp/python26-zope213-cmf22-plone42/bin/test:267: DeprecationWarning: zope.testing.testrunner is deprecated in favour of zope.testrunner.
  import zope.testing.testrunner
/home/stefan/autotest/temp/python26-zope213-cmf22-plone42/eggs/zope.testing-3.9.6-py2.6.egg/zope/testing/testrunner/formatter.py:28: DeprecationWarning: zope.testing.exceptions is deprecated in favour of zope.testrunner.exceptions
  from zope.testing.exceptions import DocTestFailureException
Running Testing.ZopeTestCase.layer.ZopeLite tests:
  Set up Testing.ZopeTestCase.layer.ZopeLite in 0.071 seconds.
  Ran 3 tests with 0 failures and 0 errors in 0.814 seconds.
Tearing down left over layers:
  Tear down Testing.ZopeTestCase.layer.ZopeLite in 0.000 seconds.
/home/stefan/autotest/temp/python26-zope213-cmf22-plone42/bin/test:267: DeprecationWarning: zope.testing.testrunner is deprecated in favour of zope.testrunner.
  import zope.testing.testrunner
/home/stefan/autotest/temp/python26-zope213-cmf22-plone42/eggs/zope.testing-3.9.6-py2.6.egg/zope/testing/testrunner/formatter.py:28: DeprecationWarning: zope.testing.exceptions is deprecated in favour of zope.testrunner.exceptions
  from zope.testing.exceptions import DocTestFailureException
Running Testing.ZopeTestCase.layer.ZopeLite tests:
  Set up Testing.ZopeTestCase.layer.ZopeLite in 0.041 seconds.
  Ran 2 tests with 0 failures and 0 errors in 1.060 seconds.
Running zope.testing.testrunner.layer.UnitTests tests:
  Tear down Testing.ZopeTestCase.layer.ZopeLite in 0.000 seconds.
  Set up zope.testing.testrunner.layer.UnitTests in 0.000 seconds.
  Ran 1 tests with 0 failures and 0 errors in 0.139 seconds.
Tearing down left over layers:
  Tear down zope.testing.testrunner.layer.UnitTests in 0.000 seconds.
Total: 3 tests, 0 failures, 0 errors in 1.418 seconds.
/home/stefan/autotest/temp/python26-zope213-cmf22-plone42/bin/test:267: DeprecationWarning: zope.testing.testrunner is deprecated in favour of zope.testrunner.
  import zope.testing.testrunner
/home/stefan/autotest/temp/python26-zope213-cmf22-plone42/eggs/zope.testing-3.9.6-py2.6.egg/zope/testing/testrunner/formatter.py:28: DeprecationWarning: zope.testing.exceptions is deprecated in favour of zope.testrunner.exceptions
  from zope.testing.exceptions import DocTestFailureException
Running Testing.ZopeTestCase.layer.ZopeLite tests:
  Set up Testing.ZopeTestCase.layer.ZopeLite in 0.049 seconds.
  Ran 1 tests with 0 failures and 0 errors in 0.237 seconds.
Running kss.core.tests.base.KSSLayer tests:
  Tear down Testing.ZopeTestCase.layer.ZopeLite in 0.000 seconds.
  Set up kss.core.tests.base.KSSCoreLayer in 0.027 seconds.
  Set up kss.core.tests.base.KSSLayer in 0.076 seconds.
  Ran 15 tests with 0 failures and 0 errors in 0.158 seconds.
Running kss.core.tests.test_ttwapi.layer tests:
  Set up kss.core.tests.test_ttwapi.layer in 0.001 seconds.
  Ran 3 tests with 0 failures and 0 errors in 0.026 seconds.
Running zope.testing.testrunner.layer.UnitTests tests:
  Tear down kss.core.tests.test_ttwapi.layer in 0.000 seconds.
  Tear down kss.core.tests.base.KSSLayer in 0.000 seconds.
  Tear down kss.core.tests.base.KSSCoreLayer in 0.000 seconds.
  Set up zope.testing.testrunner.layer.UnitTests in 0.000 seconds.
  Ran 2 tests with 0 failures and 0 errors in 0.010 seconds.
Tearing down left over layers:
  Tear down zope.testing.testrunner.layer.UnitTests in 0.000 seconds.
Total: 21 tests, 0 failures, 0 errors in 0.899 seconds.
/home/stefan/autotest/temp/python26-zope213-cmf22-plone42/bin/test:267: DeprecationWarning: zope.testing.testrunner is deprecated in favour of zope.testrunner.
  import zope.testing.testrunner
/home/stefan/autotest/temp/python26-zope213-cmf22-plone42/eggs/zope.testing-3.9.6-py2.6.egg/zope/testing/testrunner/formatter.py:28: DeprecationWarning: zope.testing.exceptions is deprecated in favour of zope.testrunner.exceptions
  from zope.testing.exceptions import DocTestFailureException
/home/stefan/autotest/temp/python26-zope213-cmf22-plone42/eggs/plone.app.imaging-1.0.5-py2.6.egg/plone/app/imaging/tests/base.py:1: DeprecationWarning: Browser is deprecated. Please import from Testing.testbrowser
  from Products.Five.testbrowser import Browser
***********************************************
WARNING: LinguaPlone not found. Skipping tests.
***********************************************
***********************************************
WARNING: LinguaPlone not found. Skipping tests.
***********************************************
Running plone.app.blob.tests.layer.BlobLayer tests:
  Set up Testing.ZopeTestCase.layer.ZopeLite in 0.855 seconds.
  Set up Products.PloneTestCase.layer.ZCML in 4.698 seconds.
  Set up Products.PloneTestCase.layer.PloneSite in 4.470 seconds.
  Set up plone.app.blob.tests.layer.BlobLayer in 0.083 seconds.
/home/stefan/autotest/temp/python26-zope213-cmf22-plone42/eggs/Products.PortalTransforms-2.0.7-py2.6.egg/Products/PortalTransforms/libtransforms/commandtransform.py:103: DeprecationWarning: os.popen4 is deprecated.  Use the subprocess module.
  cin, couterr = os.popen4(command, 'b')
  Ran 24 tests with 0 failures and 0 errors in 7.134 seconds.
Running plone.app.blob.tests.layer.BlobReplacementLayer tests:
  Set up plone.app.blob.tests.layer.BlobReplacementLayer in 0.201 seconds.
  Ran 59 tests with 0 failures and 0 errors in 16.028 seconds.
Running zope.testing.testrunner.layer.UnitTests tests:
  Tear down plone.app.blob.tests.layer.BlobReplacementLayer in 0.000 seconds.
  Tear down plone.app.blob.tests.layer.BlobLayer in 0.000 seconds.
  Tear down Products.PloneTestCase.layer.PloneSite in 0.189 seconds.
  Tear down Products.PloneTestCase.layer.ZCML in 0.009 seconds.
  Tear down Testing.ZopeTestCase.layer.ZopeLite in 0.000 seconds.
  Set up zope.testing.testrunner.layer.UnitTests in 0.000 seconds.
  Ran 2 tests with 0 failures and 0 errors in 0.001 seconds.
Tearing down left over layers:
  Tear down zope.testing.testrunner.layer.UnitTests in 0.000 seconds.
Total: 85 tests, 0 failures, 0 errors in 34.517 seconds.
/home/stefan/autotest/temp/python26-zope213-cmf22-plone42/bin/test:267: DeprecationWarning: zope.testing.testrunner is deprecated in favour of zope.testrunner.
  import zope.testing.testrunner
/home/stefan/autotest/temp/python26-zope213-cmf22-plone42/eggs/zope.testing-3.9.6-py2.6.egg/zope/testing/testrunner/formatter.py:28: DeprecationWarning: zope.testing.exceptions is deprecated in favour of zope.testrunner.exceptions
  from zope.testing.exceptions import DocTestFailureException
/home/stefan/autotest/temp/python26-zope213-cmf22-plone42/src/plone.testing/src/plone/testing/z2.py:19: DeprecationWarning: Zope2VocabularyRegistry is deprecated. Please import from Zope2.App.schema
  from Products.Five.schema import Zope2VocabularyRegistry
Running plone.app.caching.testing.PloneAppCaching:Functional tests:
  Set up plone.testing.zca.LayerCleanup in 0.000 seconds.
  Set up plone.testing.z2.Startup/home/stefan/autotest/temp/python26-zope213-cmf22-plone42/eggs/zope.configuration-3.7.4-py2.6.egg/zope/configuration/config.py:193: DeprecationWarning: FiveSecurityPolicy is deprecated. Please import from AccessControl.security
  obj = getattr(mod, oname)
 in 0.237 seconds.
  Set up plone.app.testing.layers.PloneFixture in 9.583 seconds.
  Set up plone.app.caching.testing.PloneAppCaching in 0.567 seconds.
  Set up plone.app.caching.testing.PloneAppCaching:Functional in 0.000 seconds.
  Ran 16 tests with 0 failures and 0 errors in 15.492 seconds.
Running plone.testing.zca.UnitTesting tests:
  Tear down plone.app.caching.testing.PloneAppCaching:Functional in 0.000 seconds.
  Tear down plone.app.caching.testing.PloneAppCaching in 0.006 seconds.
  Tear down plone.app.testing.layers.PloneFixture in 0.102 seconds.
  Tear down plone.testing.z2.Startup in 0.008 seconds.
  Tear down plone.testing.zca.LayerCleanup in 0.007 seconds.
  Set up plone.testing.zca.UnitTesting in 0.000 seconds.
  Ran 162 tests with 0 failures and 0 errors in 0.185 seconds.
Tearing down left over layers:
  Tear down plone.testing.zca.UnitTesting in 0.000 seconds.
Total: 178 tests, 0 failures, 0 errors in 26.738 seconds.
/home/stefan/autotest/temp/python26-zope213-cmf22-plone42/bin/test:267: DeprecationWarning: zope.testing.testrunner is deprecated in favour of zope.testrunner.
  import zope.testing.testrunner
/home/stefan/autotest/temp/python26-zope213-cmf22-plone42/eggs/zope.testing-3.9.6-py2.6.egg/zope/testing/testrunner/formatter.py:28: DeprecationWarning: zope.testing.exceptions is deprecated in favour of zope.testrunner.exceptions
  from zope.testing.exceptions import DocTestFailureException
/home/stefan/autotest/temp/python26-zope213-cmf22-plone42/src/plone.testing/src/plone/testing/z2.py:19: DeprecationWarning: Zope2VocabularyRegistry is deprecated. Please import from Zope2.App.schema
  from Products.Five.schema import Zope2VocabularyRegistry
Running plone.app.collection.tests.base.PACollection:Functional tests:
  Set up plone.testing.zca.LayerCleanup in 0.000 seconds.
  Set up plone.testing.z2.Startup/home/stefan/autotest/temp/python26-zope213-cmf22-plone42/eggs/zope.configuration-3.7.4-py2.6.egg/zope/configuration/config.py:193: DeprecationWarning: FiveSecurityPolicy is deprecated. Please import from AccessControl.security
  obj = getattr(mod, oname)
 in 0.247 seconds.
  Set up plone.app.testing.layers.PloneFixture in 9.261 seconds.
  Set up plone.app.collection.tests.base.PACollection in 1.404 seconds.
  Set up plone.app.collection.tests.base.PACollection:Functional in 0.000 seconds.
  Ran 13 tests with 0 failures and 0 errors in 1.191 seconds.
Tearing down left over layers:
  Tear down plone.app.collection.tests.base.PACollection:Functional in 0.000 seconds.
  Tear down plone.app.collection.tests.base.PACollection in 0.005 seconds.
  Tear down plone.app.testing.layers.PloneFixture in 0.099 seconds.
  Tear down plone.testing.z2.Startup in 0.008 seconds.
  Tear down plone.testing.zca.LayerCleanup in 0.003 seconds.
/home/stefan/autotest/temp/python26-zope213-cmf22-plone42/bin/test:267: DeprecationWarning: zope.testing.testrunner is deprecated in favour of zope.testrunner.
  import zope.testing.testrunner
/home/stefan/autotest/temp/python26-zope213-cmf22-plone42/eggs/zope.testing-3.9.6-py2.6.egg/zope/testing/testrunner/formatter.py:28: DeprecationWarning: zope.testing.exceptions is deprecated in favour of zope.testrunner.exceptions
  from zope.testing.exceptions import DocTestFailureException
/home/stefan/autotest/temp/python26-zope213-cmf22-plone42/src/plone.testing/src/plone/testing/z2.py:19: DeprecationWarning: Zope2VocabularyRegistry is deprecated. Please import from Zope2.App.schema
  from Products.Five.schema import Zope2VocabularyRegistry
Running plone.app.contentlisting.tests.base.ContentListing:Functional tests:
  Set up plone.testing.zca.LayerCleanup in 0.000 seconds.
  Set up plone.testing.z2.Startup/home/stefan/autotest/temp/python26-zope213-cmf22-plone42/eggs/zope.configuration-3.7.4-py2.6.egg/zope/configuration/config.py:193: DeprecationWarning: FiveSecurityPolicy is deprecated. Please import from AccessControl.security
  obj = getattr(mod, oname)
 in 0.217 seconds.
  Set up plone.app.testing.layers.PloneFixture in 9.484 seconds.
  Set up plone.app.contentlisting.tests.base.ContentListingLayer in 0.163 seconds.
  Set up plone.app.contentlisting.tests.base.ContentListing:Functional in 0.000 seconds.
  Ran 42 tests with 0 failures and 0 errors in 11.689 seconds.
Tearing down left over layers:
  Tear down plone.app.contentlisting.tests.base.ContentListing:Functional in 0.000 seconds.
  Tear down plone.app.contentlisting.tests.base.ContentListingLayer in 0.003 seconds.
  Tear down plone.app.testing.layers.PloneFixture in 0.102 seconds.
  Tear down plone.testing.z2.Startup in 0.008 seconds.
  Tear down plone.testing.zca.LayerCleanup in 0.003 seconds.
/home/stefan/autotest/temp/python26-zope213-cmf22-plone42/bin/test:267: DeprecationWarning: zope.testing.testrunner is deprecated in favour of zope.testrunner.
  import zope.testing.testrunner
/home/stefan/autotest/temp/python26-zope213-cmf22-plone42/eggs/zope.testing-3.9.6-py2.6.egg/zope/testing/testrunner/formatter.py:28: DeprecationWarning: zope.testing.exceptions is deprecated in favour of zope.testrunner.exceptions
  from zope.testing.exceptions import DocTestFailureException
/home/stefan/autotest/temp/python26-zope213-cmf22-plone42/src/plone.testing/src/plone/testing/z2.py:19: DeprecationWarning: Zope2VocabularyRegistry is deprecated. Please import from Zope2.App.schema
  from Products.Five.schema import Zope2VocabularyRegistry
Running plone.app.discussion.testing.PloneAppDiscussion:Functional tests:
  Set up plone.testing.zca.LayerCleanup in 0.000 seconds.
  Set up plone.testing.z2.Startup/home/stefan/autotest/temp/python26-zope213-cmf22-plone42/eggs/zope.configuration-3.7.4-py2.6.egg/zope/configuration/config.py:193: DeprecationWarning: FiveSecurityPolicy is deprecated. Please import from AccessControl.security
  obj = getattr(mod, oname)
 in 0.207 seconds.
  Set up plone.app.testing.layers.PloneFixture in 8.707 seconds.
  Set up plone.app.discussion.testing.PloneAppDiscussion in 0.490 seconds.
  Set up plone.app.discussion.testing.PloneAppDiscussion:Functional in 0.000 seconds.
  Ran 2 tests with 0 failures and 0 errors in 13.132 seconds.
Running plone.app.discussion.testing.PloneAppDiscussion:Integration tests:
  Tear down plone.app.discussion.testing.PloneAppDiscussion:Functional in 0.000 seconds.
  Set up plone.app.discussion.testing.PloneAppDiscussion:Integration in 0.000 seconds.
  Ran 150 tests with 0 failures and 0 errors in 17.159 seconds.
Tearing down left over layers:
  Tear down plone.app.discussion.testing.PloneAppDiscussion:Integration in 0.000 seconds.
  Tear down plone.app.discussion.testing.PloneAppDiscussion in 0.004 seconds.
  Tear down plone.app.testing.layers.PloneFixture in 0.098 seconds.
  Tear down plone.testing.z2.Startup in 0.008 seconds.
  Tear down plone.testing.zca.LayerCleanup in 0.007 seconds.
Total: 152 tests, 0 failures, 0 errors in 40.327 seconds.
/home/stefan/autotest/temp/python26-zope213-cmf22-plone42/bin/test:267: DeprecationWarning: zope.testing.testrunner is deprecated in favour of zope.testrunner.
  import zope.testing.testrunner
/home/stefan/autotest/temp/python26-zope213-cmf22-plone42/eggs/zope.testing-3.9.6-py2.6.egg/zope/testing/testrunner/formatter.py:28: DeprecationWarning: zope.testing.exceptions is deprecated in favour of zope.testrunner.exceptions
  from zope.testing.exceptions import DocTestFailureException
Running Testing.ZopeTestCase.layer.ZopeLite tests:
  Set up Testing.ZopeTestCase.layer.ZopeLite in 0.868 seconds.
  Ran 2 tests with 0 failures and 0 errors in 0.008 seconds.
Running plone.app.folder.tests.layer.IntegrationLayer tests:
  Set up Products.PloneTestCase.layer.ZCML in 4.676 seconds.
  Set up Products.PloneTestCase.layer.PloneSite in 4.562 seconds.
  Set up plone.app.folder.tests.layer.IntegrationLayer in 0.077 seconds.
  Ran 27 tests with 0 failures and 0 errors in 6.691 seconds.
Running plone.app.folder.tests.layer.PartialOrderingIntegrationLayer tests:
  Set up plone.app.folder.tests.layer.PartialOrderingIntegrationLayer in 0.000 seconds.
  Ran 3 tests with 0 failures and 0 errors in 0.331 seconds.
Tearing down left over layers:
  Tear down plone.app.folder.tests.layer.PartialOrderingIntegrationLayer in 0.000 seconds.
  Tear down plone.app.folder.tests.layer.IntegrationLayer in 0.000 seconds.
  Tear down Products.PloneTestCase.layer.PloneSite in 0.181 seconds.
  Tear down Products.PloneTestCase.layer.ZCML in 0.004 seconds.
  Tear down Testing.ZopeTestCase.layer.ZopeLite in 0.000 seconds.
Total: 32 tests, 0 failures, 0 errors in 18.016 seconds.
/home/stefan/autotest/temp/python26-zope213-cmf22-plone42/bin/test:267: DeprecationWarning: zope.testing.testrunner is deprecated in favour of zope.testrunner.
  import zope.testing.testrunner
/home/stefan/autotest/temp/python26-zope213-cmf22-plone42/eggs/zope.testing-3.9.6-py2.6.egg/zope/testing/testrunner/formatter.py:28: DeprecationWarning: zope.testing.exceptions is deprecated in favour of zope.testrunner.exceptions
  from zope.testing.exceptions import DocTestFailureException
/home/stefan/autotest/temp/python26-zope213-cmf22-plone42/src/plone.app.controlpanel/plone/app/controlpanel/tests/cptc.py:10: DeprecationWarning: Browser is deprecated. Please import from Testing.testbrowser
  from Products.Five.testbrowser import Browser
Running plone.app.imaging.testing.ImagingLayer tests:
  Set up Testing.ZopeTestCase.layer.ZopeLite in 0.873 seconds.
  Set up Products.PloneTestCase.layer.ZCML in 4.764 seconds.
  Set up Products.PloneTestCase.layer.PloneSite in 4.477 seconds.
  Set up collective.testcaselayer.ptc.PTCLayer in 0.027 seconds.
  Set up plone.app.imaging.testing.ImagingLayer/home/stefan/autotest/temp/python26-zope213-cmf22-plone42/eggs/plone.app.imaging-1.0.5-py2.6.egg/plone/app/imaging/testing.py:14: DeprecationWarning: load_config is deprecated. Please import from Zope2.App.zcml
  zcml.load_config('testing.zcml', imaging)
 in 0.122 seconds.
  Ran 44 tests with 0 failures and 0 errors in 7.648 seconds.
Running zope.testing.testrunner.layer.UnitTests tests:
  Tear down plone.app.imaging.testing.ImagingLayer in 0.000 seconds.
  Tear down collective.testcaselayer.ptc.PTCLayer in 0.000 seconds.
  Tear down Products.PloneTestCase.layer.PloneSite in 0.180 seconds.
  Tear down Products.PloneTestCase.layer.ZCML in 0.005 seconds.
  Tear down Testing.ZopeTestCase.layer.ZopeLite in 0.000 seconds.
  Set up zope.testing.testrunner.layer.UnitTests in 0.000 seconds.
  Ran 7 tests with 0 failures and 0 errors in 0.001 seconds.
Tearing down left over layers:
  Tear down zope.testing.testrunner.layer.UnitTests in 0.000 seconds.
Total: 51 tests, 0 failures, 0 errors in 18.620 seconds.
/home/stefan/autotest/temp/python26-zope213-cmf22-plone42/bin/test:267: DeprecationWarning: zope.testing.testrunner is deprecated in favour of zope.testrunner.
  import zope.testing.testrunner
/home/stefan/autotest/temp/python26-zope213-cmf22-plone42/eggs/zope.testing-3.9.6-py2.6.egg/zope/testing/testrunner/formatter.py:28: DeprecationWarning: zope.testing.exceptions is deprecated in favour of zope.testrunner.exceptions
  from zope.testing.exceptions import DocTestFailureException
Running Products.PloneTestCase.layer.PloneSite tests:
  Set up Testing.ZopeTestCase.layer.ZopeLite in 1.445 seconds.
  Set up Products.PloneTestCase.layer.ZCML in 4.730 seconds.
  Set up Products.PloneTestCase.layer.PloneSite in 4.448 seconds.
  Ran 1 tests with 0 failures and 0 errors in 0.297 seconds.
Tearing down left over layers:
  Tear down Products.PloneTestCase.layer.PloneSite in 0.179 seconds.
  Tear down Products.PloneTestCase.layer.ZCML in 0.004 seconds.
  Tear down Testing.ZopeTestCase.layer.ZopeLite in 0.000 seconds.
/home/stefan/autotest/temp/python26-zope213-cmf22-plone42/bin/test:267: DeprecationWarning: zope.testing.testrunner is deprecated in favour of zope.testrunner.
  import zope.testing.testrunner
/home/stefan/autotest/temp/python26-zope213-cmf22-plone42/eggs/zope.testing-3.9.6-py2.6.egg/zope/testing/testrunner/formatter.py:28: DeprecationWarning: zope.testing.exceptions is deprecated in favour of zope.testrunner.exceptions
  from zope.testing.exceptions import DocTestFailureException
Running plone.app.linkintegrity.tests.layer.PloneLinkintegrity tests:
  Set up Testing.ZopeTestCase.layer.ZopeLite in 1.456 seconds.
  Set up Products.PloneTestCase.layer.ZCML in 4.889 seconds.
  Set up Products.PloneTestCase.layer.PloneSite in 4.453 seconds.
  Set up collective.testcaselayer.ptc.PTCLayer in 0.024 seconds.
  Set up plone.app.linkintegrity.tests.layer.PloneLinkintegrity in 0.750 seconds.
  Ran 28 tests with 0 failures and 0 errors in 36.759 seconds.
Running zope.testing.testrunner.layer.UnitTests tests:
  Tear down plone.app.linkintegrity.tests.layer.PloneLinkintegrity in 0.000 seconds.
  Tear down collective.testcaselayer.ptc.PTCLayer in 0.000 seconds.
  Tear down Products.PloneTestCase.layer.PloneSite in 0.179 seconds.
  Tear down Products.PloneTestCase.layer.ZCML in 0.006 seconds.
  Tear down Testing.ZopeTestCase.layer.ZopeLite in 0.000 seconds.
  Set up zope.testing.testrunner.layer.UnitTests in 0.000 seconds.
  Ran 2 tests with 0 failures and 0 errors in 0.000 seconds.
Tearing down left over layers:
  Tear down zope.testing.testrunner.layer.UnitTests in 0.000 seconds.
Total: 30 tests, 0 failures, 0 errors in 49.135 seconds.
/home/stefan/autotest/temp/python26-zope213-cmf22-plone42/bin/test:267: DeprecationWarning: zope.testing.testrunner is deprecated in favour of zope.testrunner.
  import zope.testing.testrunner
/home/stefan/autotest/temp/python26-zope213-cmf22-plone42/eggs/zope.testing-3.9.6-py2.6.egg/zope/testing/testrunner/formatter.py:28: DeprecationWarning: zope.testing.exceptions is deprecated in favour of zope.testrunner.exceptions
  from zope.testing.exceptions import DocTestFailureException
Total: 0 tests, 0 failures, 0 errors in 0.000 seconds.
/home/stefan/autotest/temp/python26-zope213-cmf22-plone42/bin/test:267: DeprecationWarning: zope.testing.testrunner is deprecated in favour of zope.testrunner.
  import zope.testing.testrunner
/home/stefan/autotest/temp/python26-zope213-cmf22-plone42/eggs/zope.testing-3.9.6-py2.6.egg/zope/testing/testrunner/formatter.py:28: DeprecationWarning: zope.testing.exceptions is deprecated in favour of zope.testrunner.exceptions
  from zope.testing.exceptions import DocTestFailureException
Running plone.app.querystring.tests.base.QuerystringInstalled tests:
  Set up Testing.ZopeTestCase.layer.ZopeLite in 1.410 seconds.
  Set up Products.PloneTestCase.layer.ZCML in 4.723 seconds.
  Set up Products.PloneTestCase.layer.PloneSite in 4.440 seconds.
  Set up collective.testcaselayer.ptc.PTCLayer in 0.024 seconds.
  Set up collective.testcaselayer.mail.MockMailHostLayer in 0.011 seconds.
  Set up collective.testcaselayer.common.CommonPTCLayer in 0.006 seconds.
  Set up collective.testcaselayer.ptc.BasePTCLayer in 0.006 seconds.
  Set up plone.app.querystring.tests.base.QuerystringInstalled/home/stefan/autotest/temp/python26-zope213-cmf22-plone42/eggs/collective.testcaselayer-1.3-py2.6.egg/collective/testcaselayer/ztc.py:20: DeprecationWarning: load_config is deprecated. Please import from Zope2.App.zcml
  zcml.load_config(file_, **kw)
 in 0.006 seconds.
  Ran 7 tests with 0 failures and 0 errors in 0.120 seconds.
Running plone.app.querystring.tests.base.RealGSProfile tests:
  Set up plone.app.querystring.tests.base.RealGSProfile in 0.608 seconds.
  Ran 6 tests with 0 failures and 0 errors in 0.344 seconds.
Running plone.app.querystring.tests.base.RegistryLayer tests:
  Tear down plone.app.querystring.tests.base.RealGSProfile in 0.000 seconds.
  Tear down plone.app.querystring.tests.base.QuerystringInstalled in 0.000 seconds.
  Tear down collective.testcaselayer.ptc.BasePTCLayer in 0.000 seconds.
  Tear down collective.testcaselayer.common.CommonPTCLayer in 0.000 seconds.
  Tear down collective.testcaselayer.mail.MockMailHostLayer in 0.000 seconds.
  Tear down collective.testcaselayer.ptc.PTCLayer in 0.000 seconds.
  Tear down Products.PloneTestCase.layer.PloneSite in 0.179 seconds.
  Tear down Products.PloneTestCase.layer.ZCML in 0.004 seconds.
  Tear down Testing.ZopeTestCase.layer.ZopeLite in 0.000 seconds.
  Set up plone.app.querystring.tests.base.UnittestLayer in 0.000 seconds.
  Set up plone.app.querystring.tests.base.RegistryLayer in 0.000 seconds.
  Ran 13 tests with 0 failures and 0 errors in 0.007 seconds.
Running plone.app.querystring.tests.base.TestGSProfile tests:
  Tear down plone.app.querystring.tests.base.RegistryLayer in 0.000 seconds.
  Tear down plone.app.querystring.tests.base.UnittestLayer in 0.000 seconds.
  Set up Testing.ZopeTestCase.layer.ZopeLite in 0.007 seconds.
  Set up Products.PloneTestCase.layer.ZCML in 3.796 seconds.
  Set up Products.PloneTestCase.layer.PloneSite in 3.363 seconds.
  Set up collective.testcaselayer.ptc.PTCLayer in 0.024 seconds.
  Set up collective.testcaselayer.mail.MockMailHostLayer in 0.011 seconds.
  Set up collective.testcaselayer.common.CommonPTCLayer in 0.008 seconds.
  Set up collective.testcaselayer.ptc.BasePTCLayer in 0.006 seconds.
  Set up plone.app.querystring.tests.base.QuerystringInstalled in 0.006 seconds.
  Set up plone.app.querystring.tests.base.TestGSProfile in 0.540 seconds.
  Ran 3 tests with 0 failures and 0 errors in 0.038 seconds.
Tearing down left over layers:
  Tear down plone.app.querystring.tests.base.TestGSProfile in 0.000 seconds.
  Tear down plone.app.querystring.tests.base.QuerystringInstalled in 0.000 seconds.
  Tear down collective.testcaselayer.ptc.BasePTCLayer in 0.000 seconds.
  Tear down collective.testcaselayer.common.CommonPTCLayer in 0.000 seconds.
  Tear down collective.testcaselayer.mail.MockMailHostLayer in 0.000 seconds.
  Tear down collective.testcaselayer.ptc.PTCLayer in 0.000 seconds.
  Tear down Products.PloneTestCase.layer.PloneSite in 0.180 seconds.
  Tear down Products.PloneTestCase.layer.ZCML in 0.004 seconds.
  Tear down Testing.ZopeTestCase.layer.ZopeLite in 0.000 seconds.
Total: 29 tests, 0 failures, 0 errors in 20.851 seconds.
/home/stefan/autotest/temp/python26-zope213-cmf22-plone42/bin/test:267: DeprecationWarning: zope.testing.testrunner is deprecated in favour of zope.testrunner.
  import zope.testing.testrunner
/home/stefan/autotest/temp/python26-zope213-cmf22-plone42/eggs/zope.testing-3.9.6-py2.6.egg/zope/testing/testrunner/formatter.py:28: DeprecationWarning: zope.testing.exceptions is deprecated in favour of zope.testrunner.exceptions
  from zope.testing.exceptions import DocTestFailureException
/home/stefan/autotest/temp/python26-zope213-cmf22-plone42/src/plone.testing/src/plone/testing/z2.py:19: DeprecationWarning: Zope2VocabularyRegistry is deprecated. Please import from Zope2.App.schema
  from Products.Five.schema import Zope2VocabularyRegistry
Running plone.app.registry.testing.plone.app.registry:Integration tests:
  Set up plone.testing.zca.LayerCleanup in 0.000 seconds.
  Set up plone.testing.z2.Startup/home/stefan/autotest/temp/python26-zope213-cmf22-plone42/eggs/zope.configuration-3.7.4-py2.6.egg/zope/configuration/config.py:193: DeprecationWarning: FiveSecurityPolicy is deprecated. Please import from AccessControl.security
  obj = getattr(mod, oname)
 in 0.212 seconds.
  Set up plone.app.testing.layers.PloneFixture in 9.370 seconds.
  Set up plone.app.registry.testing.PloneAppRegistry in 0.480 seconds.
  Set up plone.app.registry.testing.plone.app.registry:Integration in 0.000 seconds.
  Ran 2 tests with 0 failures and 0 errors in 0.007 seconds.
Running plone.testing.zca.UnitTesting tests:
  Tear down plone.app.registry.testing.plone.app.registry:Integration in 0.000 seconds.
  Tear down plone.app.registry.testing.PloneAppRegistry in 0.003 seconds.
  Tear down plone.app.testing.layers.PloneFixture in 0.098 seconds.
  Tear down plone.testing.z2.Startup in 0.008 seconds.
  Tear down plone.testing.zca.LayerCleanup in 0.003 seconds.
  Set up plone.testing.zca.UnitTesting in 0.000 seconds.
  Ran 37 tests with 0 failures and 0 errors in 1.061 seconds.
Tearing down left over layers:
  Tear down plone.testing.zca.UnitTesting in 0.000 seconds.
Total: 39 tests, 0 failures, 0 errors in 11.717 seconds.
/home/stefan/autotest/temp/python26-zope213-cmf22-plone42/bin/test:267: DeprecationWarning: zope.testing.testrunner is deprecated in favour of zope.testrunner.
  import zope.testing.testrunner
/home/stefan/autotest/temp/python26-zope213-cmf22-plone42/eggs/zope.testing-3.9.6-py2.6.egg/zope/testing/testrunner/formatter.py:28: DeprecationWarning: zope.testing.exceptions is deprecated in favour of zope.testrunner.exceptions
  from zope.testing.exceptions import DocTestFailureException
/home/stefan/autotest/temp/python26-zope213-cmf22-plone42/src/plone.testing/src/plone/testing/z2.py:19: DeprecationWarning: Zope2VocabularyRegistry is deprecated. Please import from Zope2.App.schema
  from Products.Five.schema import Zope2VocabularyRegistry
Running plone.app.search.tests.base.Search:Integration tests:
  Set up plone.testing.zca.LayerCleanup in 0.000 seconds.
  Set up plone.testing.z2.Startup/home/stefan/autotest/temp/python26-zope213-cmf22-plone42/eggs/zope.configuration-3.7.4-py2.6.egg/zope/configuration/config.py:193: DeprecationWarning: FiveSecurityPolicy is deprecated. Please import from AccessControl.security
  obj = getattr(mod, oname)
 in 0.258 seconds.
  Set up plone.app.testing.layers.PloneFixture in 9.474 seconds.
  Set up plone.app.search.tests.base.SearchLayer in 4.007 seconds.
  Set up plone.app.search.tests.base.Search:Integration in 0.000 seconds.


Failure in test test_blacklisted_types_in_results (plone.app.search.tests.test_integration.TestSection)
Traceback (most recent call last):
  File "/home/stefan/autotest/temp/python26-zope213-cmf22-plone42/eggs/unittest2-0.5.1-py2.6.egg/unittest2/case.py", line 340, in run
    testMethod()
  File "/home/stefan/autotest/temp/python26-zope213-cmf22-plone42/eggs/plone.app.search-1.0-py2.6.egg/plone/app/search/tests/test_integration.py", line 74, in test_blacklisted_types_in_results
    'Test document is not found in the results.')
  File "/home/stefan/autotest/temp/python26-zope213-cmf22-plone42/eggs/unittest2-0.5.1-py2.6.egg/unittest2/case.py", line 619, in deprecated_func
    return original_func(*args, **kwargs)
  File "/home/stefan/autotest/temp/python26-zope213-cmf22-plone42/eggs/unittest2-0.5.1-py2.6.egg/unittest2/case.py", line 427, in assertTrue
    raise self.failureException(msg)
AssertionError: False is not True : Test document is not found in the results.

  Ran 3 tests with 1 failures and 0 errors in 0.246 seconds.
Tearing down left over layers:
  Tear down plone.app.search.tests.base.Search:Integration in 0.000 seconds.
  Tear down plone.app.search.tests.base.SearchLayer in 0.005 seconds.
  Tear down plone.app.testing.layers.PloneFixture in 0.100 seconds.
  Tear down plone.testing.z2.Startup in 0.008 seconds.
  Tear down plone.testing.zca.LayerCleanup in 0.003 seconds.
/home/stefan/autotest/temp/python26-zope213-cmf22-plone42/bin/test:267: DeprecationWarning: zope.testing.testrunner is deprecated in favour of zope.testrunner.
  import zope.testing.testrunner
/home/stefan/autotest/temp/python26-zope213-cmf22-plone42/eggs/zope.testing-3.9.6-py2.6.egg/zope/testing/testrunner/formatter.py:28: DeprecationWarning: zope.testing.exceptions is deprecated in favour of zope.testrunner.exceptions
  from zope.testing.exceptions import DocTestFailureException
/home/stefan/autotest/temp/python26-zope213-cmf22-plone42/src/plone.testing/src/plone/testing/z2.py:19: DeprecationWarning: Zope2VocabularyRegistry is deprecated. Please import from Zope2.App.schema
  from Products.Five.schema import Zope2VocabularyRegistry
Running zope.testing.testrunner.layer.UnitTests tests:
  Set up zope.testing.testrunner.layer.UnitTests in 0.000 seconds.
/home/stefan/autotest/temp/python26-zope213-cmf22-plone42/eggs/zope.configuration-3.7.4-py2.6.egg/zope/configuration/config.py:193: DeprecationWarning: FiveSecurityPolicy is deprecated. Please import from AccessControl.security
  obj = getattr(mod, oname)
  Ran 3 tests with 0 failures and 0 errors in 1 minutes 10.193 seconds.
Tearing down left over layers:
  Tear down zope.testing.testrunner.layer.UnitTests in 0.000 seconds.
/home/stefan/autotest/temp/python26-zope213-cmf22-plone42/bin/test:267: DeprecationWarning: zope.testing.testrunner is deprecated in favour of zope.testrunner.
  import zope.testing.testrunner
/home/stefan/autotest/temp/python26-zope213-cmf22-plone42/eggs/zope.testing-3.9.6-py2.6.egg/zope/testing/testrunner/formatter.py:28: DeprecationWarning: zope.testing.exceptions is deprecated in favour of zope.testrunner.exceptions
  from zope.testing.exceptions import DocTestFailureException
Running Products.PloneTestCase.layer.PloneSite tests:
  Set up Testing.ZopeTestCase.layer.ZopeLite in 1.310 seconds.
  Set up Products.PloneTestCase.layer.ZCML in 4.749 seconds.
  Set up Products.PloneTestCase.layer.PloneSite in 4.455 seconds.
  Ran 7 tests with 0 failures and 0 errors in 7.977 seconds.
Running zope.testing.testrunner.layer.UnitTests tests:
  Tear down Products.PloneTestCase.layer.PloneSite in 0.179 seconds.
  Tear down Products.PloneTestCase.layer.ZCML in 0.006 seconds.
  Tear down Testing.ZopeTestCase.layer.ZopeLite in 0.000 seconds.
  Set up zope.testing.testrunner.layer.UnitTests in 0.000 seconds.
  Ran 3 tests with 0 failures and 0 errors in 0.001 seconds.
Tearing down left over layers:
  Tear down zope.testing.testrunner.layer.UnitTests in 0.000 seconds.
Total: 10 tests, 0 failures, 0 errors in 19.223 seconds.
/home/stefan/autotest/temp/python26-zope213-cmf22-plone42/bin/test:267: DeprecationWarning: zope.testing.testrunner is deprecated in favour of zope.testrunner.
  import zope.testing.testrunner
/home/stefan/autotest/temp/python26-zope213-cmf22-plone42/eggs/zope.testing-3.9.6-py2.6.egg/zope/testing/testrunner/formatter.py:28: DeprecationWarning: zope.testing.exceptions is deprecated in favour of zope.testrunner.exceptions
  from zope.testing.exceptions import DocTestFailureException
/home/stefan/autotest/temp/python26-zope213-cmf22-plone42/src/plone.testing/src/plone/testing/z2.py:19: DeprecationWarning: Zope2VocabularyRegistry is deprecated. Please import from Zope2.App.schema
  from Products.Five.schema import Zope2VocabularyRegistry
Running plone.app.uuid.testing.plone.app.uuid:Functional tests:
  Set up plone.testing.zca.LayerCleanup in 0.000 seconds.
  Set up plone.testing.z2.Startup/home/stefan/autotest/temp/python26-zope213-cmf22-plone42/eggs/zope.configuration-3.7.4-py2.6.egg/zope/configuration/config.py:193: DeprecationWarning: FiveSecurityPolicy is deprecated. Please import from AccessControl.security
  obj = getattr(mod, oname)
 in 0.292 seconds.
  Set up plone.app.testing.layers.PloneFixture in 9.738 seconds.
  Set up plone.app.uuid.testing.PloneAppUUID in 0.157 seconds.
  Set up plone.app.uuid.testing.plone.app.uuid:Functional in 0.000 seconds.
  Ran 3 tests with 0 failures and 0 errors in 0.871 seconds.
Running plone.app.uuid.testing.plone.app.uuid:Integration tests:
  Tear down plone.app.uuid.testing.plone.app.uuid:Functional in 0.000 seconds.
  Set up plone.app.uuid.testing.plone.app.uuid:Integration in 0.000 seconds.
  Ran 5 tests with 0 failures and 0 errors in 0.296 seconds.
Tearing down left over layers:
  Tear down plone.app.uuid.testing.plone.app.uuid:Integration in 0.000 seconds.
  Tear down plone.app.uuid.testing.PloneAppUUID in 0.003 seconds.
  Tear down plone.app.testing.layers.PloneFixture in 0.101 seconds.
  Tear down plone.testing.z2.Startup in 0.008 seconds.
  Tear down plone.testing.zca.LayerCleanup in 0.003 seconds.
Total: 8 tests, 0 failures, 0 errors in 11.966 seconds.
#### Running tests for group ATCT ####
#### Finished tests for group ATCT ####

#### Running tests for group Add-ons ####
#### Finished tests for group Add-ons ####

#### Running tests for group Archetypes ####
#### Finished tests for group Archetypes ####

#### Running tests for group CMF ####
#### Finished tests for group CMF ####

#### Running tests for group CMFEditions ####
#### Finished tests for group CMFEditions ####

#### Running tests for group Plone ####
#### Finished tests for group Plone ####

#### Running tests for group PlonePAS ####
#### Finished tests for group PlonePAS ####

#### Running tests for group plone ####
#### Finished tests for group plone ####

#### Running tests for group portlets ####
#### Finished tests for group portlets ####

#### Running tests for group z3c.autoinclude ####
#### Finished tests for group z3c.autoinclude ####

#### Running tests for AccessControl ####
#### Finished tests for AccessControl ####

#### Running tests for Products.CMFTestCase ####
#### Finished tests for Products.CMFTestCase ####

#### Running tests for Products.ExtendedPathIndex ####
#### Finished tests for Products.ExtendedPathIndex ####

#### Running tests for Products.PasswordResetTool ####
#### Finished tests for Products.PasswordResetTool ####

#### Running tests for Products.ResourceRegistries ####
#### Finished tests for Products.ResourceRegistries ####

#### Running tests for Products.TinyMCE ####
#### Finished tests for Products.TinyMCE ####

#### Running tests for Products.contentmigration ####
#### Finished tests for Products.contentmigration ####

#### Running tests for Products.i18ntestcase ####
#### Finished tests for Products.i18ntestcase ####

#### Running tests for archetypes.querywidget ####
#### Finished tests for archetypes.querywidget ####

#### Running tests for archetypes.referencebrowserwidget ####
#### Finished tests for archetypes.referencebrowserwidget ####

#### Running tests for archetypes.schemaextender ####
#### Finished tests for archetypes.schemaextender ####

#### Running tests for collective.monkeypatcher ####
#### Finished tests for collective.monkeypatcher ####

#### Running tests for collective.z3cform.datetimewidget ####
#### Finished tests for collective.z3cform.datetimewidget ####

#### Running tests for five.customerize ####
#### Finished tests for five.customerize ####

#### Running tests for five.formlib ####
#### Finished tests for five.formlib ####

#### Running tests for kss.core ####
#### Finished tests for kss.core ####

#### Running tests for plone.app.blob ####
#### Finished tests for plone.app.blob ####

#### Running tests for plone.app.caching ####
#### Finished tests for plone.app.caching ####

#### Running tests for plone.app.collection ####
#### Finished tests for plone.app.collection ####

#### Running tests for plone.app.contentlisting ####
#### Finished tests for plone.app.contentlisting ####

#### Running tests for plone.app.discussion ####
#### Finished tests for plone.app.discussion ####

#### Running tests for plone.app.folder ####
#### Finished tests for plone.app.folder ####

#### Running tests for plone.app.imaging ####
#### Finished tests for plone.app.imaging ####

#### Running tests for plone.app.jquerytools ####
#### Finished tests for plone.app.jquerytools ####

#### Running tests for plone.app.linkintegrity ####
#### Finished tests for plone.app.linkintegrity ####

#### Running tests for plone.app.locales ####
#### Finished tests for plone.app.locales ####

#### Running tests for plone.app.querystring ####
#### Finished tests for plone.app.querystring ####

#### Running tests for plone.app.registry ####
#### Finished tests for plone.app.registry ####

#### Running tests for plone.app.search ####
#### Finished tests for plone.app.search ####

#### Running tests for plone.app.testing ####
#### Finished tests for plone.app.testing ####

#### Running tests for plone.app.users ####
#### Finished tests for plone.app.users ####

#### Running tests for plone.app.uuid ####
#### Finished tests for plone.app.uuid ####

#### Running tests for plone.a/home/stefan/autotest/temp/python26-zope213-cmf22-plone42/bin/test:267: DeprecationWarning: zope.testing.testrunner is deprecated in favour of zope.testrunner.
  import zope.testing.testrunner
/home/stefan/autotest/temp/python26-zope213-cmf22-plone42/eggs/zope.testing-3.9.6-py2.6.egg/zope/testing/testrunner/formatter.py:28: DeprecationWarning: zope.testing.exceptions is deprecated in favour of zope.testrunner.exceptions
  from zope.testing.exceptions import DocTestFailureException
/home/stefan/autotest/temp/python26-zope213-cmf22-plone42/eggs/plone.app.z3cform-0.5.6-py2.6.egg/plone/app/z3cform/tests/test_kss_attr.py:3: DeprecationWarning: Browser is deprecated. Please import from Testing.testbrowser
  from Products.Five.testbrowser import Browser
/home/stefan/autotest/temp/python26-zope213-cmf22-plone42/eggs/plone.app.z3cform-0.5.6-py2.6.egg/plone/app/z3cform/tests/tests.py:3: DeprecationWarning: zope.testing.doctest is deprecated in favour of the Python standard library doctest module
  import zope.testing.doctest
Running Products.PloneTestCase.layer.PloneSite tests:
  Set up Testing.ZopeTestCase.layer.ZopeLite in 1.455 seconds.
  Set up Products.PloneTestCase.layer.ZCML in 4.703 seconds.
  Set up Products.PloneTestCase.layer.PloneSite/home/stefan/autotest/temp/python26-zope213-cmf22-plone42/eggs/plone.app.z3cform-0.5.6-py2.6.egg/plone/app/z3cform/tests/tests.py:21: DeprecationWarning: load_config is deprecated. Please import from Zope2.App.zcml
  zcml.load_config('testing.zcml', plone.app.z3cform.tests)
 in 4.702 seconds.
  Ran 5 tests with 0 failures and 0 errors in 0.774 seconds.
Running plone.app.z3cform.tests.layer.KSSUnitTestLayer tests:
  Tear down Products.PloneTestCase.layer.PloneSite in 0.179 seconds.
  Tear down Products.PloneTestCase.layer.ZCML in 0.005 seconds.
  Tear down Testing.ZopeTestCase.layer.ZopeLite in 0.000 seconds.
  Set up plone.app.z3cform.tests.layer.KSSUnitTestLayer in 0.499 seconds.
  Ran 9 tests with 0 failures and 0 errors in 0.138 seconds.
Running zope.testing.testrunner.layer.UnitTests tests:
  Tear down plone.app.z3cform.tests.layer.KSSUnitTestLayer in 0.001 seconds.
  Set up zope.testing.testrunner.layer.UnitTests in 0.000 seconds.
  Ran 3 tests with 0 failures and 0 errors in 0.004 seconds.
Tearing down left over layers:
  Tear down zope.testing.testrunner.layer.UnitTests in 0.000 seconds.
Total: 17 tests, 0 failures, 0 errors in 13.200 seconds.
/home/stefan/autotest/temp/python26-zope213-cmf22-plone42/bin/test:267: DeprecationWarning: zope.testing.testrunner is deprecated in favour of zope.testrunner.
  import zope.testing.testrunner
/home/stefan/autotest/temp/python26-zope213-cmf22-plone42/eggs/zope.testing-3.9.6-py2.6.egg/zope/testing/testrunner/formatter.py:28: DeprecationWarning: zope.testing.exceptions is deprecated in favour of zope.testrunner.exceptions
  from zope.testing.exceptions import DocTestFailureException
Running zope.testing.testrunner.layer.UnitTests tests:
  Set up zope.testing.testrunner.layer.UnitTests in 0.000 seconds.
  Ran 18 tests with 0 failures and 0 errors in 1.312 seconds.
Tearing down left over layers:
  Tear down zope.testing.testrunner.layer.UnitTests in 0.000 seconds.
/home/stefan/autotest/temp/python26-zope213-cmf22-plone42/bin/test:267: DeprecationWarning: zope.testing.testrunner is deprecated in favour of zope.testrunner.
  import zope.testing.testrunner
/home/stefan/autotest/temp/python26-zope213-cmf22-plone42/eggs/zope.testing-3.9.6-py2.6.egg/zope/testing/testrunner/formatter.py:28: DeprecationWarning: zope.testing.exceptions is deprecated in favour of zope.testrunner.exceptions
  from zope.testing.exceptions import DocTestFailureException
Running zope.testing.testrunner.layer.UnitTests tests:
  Set up zope.testing.testrunner.layer.UnitTests in 0.000 seconds.
  Ran 61 tests with 0 failures and 0 errors in 5.151 seconds.
Tearing down left over layers:
  Tear down zope.testing.testrunner.layer.UnitTests in 0.000 seconds.
/home/stefan/autotest/temp/python26-zope213-cmf22-plone42/bin/test:267: DeprecationWarning: zope.testing.testrunner is deprecated in favour of zope.testrunner.
  import zope.testing.testrunner
/home/stefan/autotest/temp/python26-zope213-cmf22-plone42/eggs/zope.testing-3.9.6-py2.6.egg/zope/testing/testrunner/formatter.py:28: DeprecationWarning: zope.testing.exceptions is deprecated in favour of zope.testrunner.exceptions
  from zope.testing.exceptions import DocTestFailureException
Running zope.testing.testrunner.layer.UnitTests tests:
  Set up zope.testing.testrunner.layer.UnitTests in 0.000 seconds.
  Ran 57 tests with 0 failures and 0 errors in 0.052 seconds.
Tearing down left over layers:
  Tear down zope.testing.testrunner.layer.UnitTests in 0.000 seconds.
/home/stefan/autotest/temp/python26-zope213-cmf22-plone42/bin/test:267: DeprecationWarning: zope.testing.testrunner is deprecated in favour of zope.testrunner.
  import zope.testing.testrunner
/home/stefan/autotest/temp/python26-zope213-cmf22-plone42/eggs/zope.testing-3.9.6-py2.6.egg/zope/testing/testrunner/formatter.py:28: DeprecationWarning: zope.testing.exceptions is deprecated in favour of zope.testrunner.exceptions
  from zope.testing.exceptions import DocTestFailureException
/home/stefan/autotest/temp/python26-zope213-cmf22-plone42/eggs/plone.folder-1.0.1-py2.6.egg/plone/folder/tests/layer.py:2: DeprecationWarning: load_config is deprecated. Please import from Zope2.App.zcml
  from Products.Five.zcml import load_config
Running plone.folder.tests.layer.PloneFolderLayer tests:
  Set up plone.folder.tests.layer.PloneFolderLayer in 0.007 seconds.
  Ran 67 tests with 0 failures and 0 errors in 6.489 seconds.
Tearing down left over layers:
  Tear down plone.folder.tests.layer.PloneFolderLayer in 0.000 seconds.
/home/stefan/autotest/temp/python26-zope213-cmf22-plone42/bin/test:267: DeprecationWarning: zope.testing.testrunner is deprecated in favour of zope.testrunner.
  import zope.testing.testrunner
/home/stefan/autotest/temp/python26-zope213-cmf22-plone42/eggs/zope.testing-3.9.6-py2.6.egg/zope/testing/testrunner/formatter.py:28: DeprecationWarning: zope.testing.exceptions is deprecated in favour of zope.testrunner.exceptions
  from zope.testing.exceptions import DocTestFailureException
Running plone.outputfilters.tests.base.layer tests:
  Set up Testing.ZopeTestCase.layer.ZopeLite in 1.226 seconds.
  Set up Products.PloneTestCase.layer.ZCML in 4.712 seconds.
  Set up Products.PloneTestCase.layer.PloneSite in 4.524 seconds.
  Set up plone.outputfilters.tests.base.layer in 0.000 seconds.
/home/stefan/autotest/temp/python26-zope213-cmf22-plone42/eggs/plone.outputfilters-1.0-py2.6.egg/plone/outputfilters/README.txt:1: DeprecationWarning: load_string is deprecated. Please import from Zope2.App.zcml
  Introduction
  Ran 36 tests with 0 failures and 0 errors in 5.549 seconds.
Running zope.testing.testrunner.layer.UnitTests tests:
  Tear down plone.outputfilters.tests.base.layer in 0.000 seconds.
  Tear down Products.PloneTestCase.layer.PloneSite in 0.179 seconds.
  Tear down Products.PloneTestCase.layer.ZCML in 0.005 seconds.
  Tear down Testing.ZopeTestCase.layer.ZopeLite in 0.000 seconds.
  Set up zope.testing.testrunner.layer.UnitTests in 0.000 seconds.
  Ran 4 tests with 0 failures and 0 errors in 0.000 seconds.
Tearing down left over layers:
  Tear down zope.testing.testrunner.layer.UnitTests in 0.000 seconds.
Total: 40 tests, 0 failures, 0 errors in 16.699 seconds.
/home/stefan/autotest/temp/python26-zope213-cmf22-plone42/bin/test:267: DeprecationWarning: zope.testing.testrunner is deprecated in favour of zope.testrunner.
  import zope.testing.testrunner
/home/stefan/autotest/temp/python26-zope213-cmf22-plone42/eggs/zope.testing-3.9.6-py2.6.egg/zope/testing/testrunner/formatter.py:28: DeprecationWarning: zope.testing.exceptions is deprecated in favour of zope.testrunner.exceptions
  from zope.testing.exceptions import DocTestFailureException
/home/stefan/autotest/temp/python26-zope213-cmf22-plone42/eggs/plone.registry-1.0-py2.6.egg/plone/registry/tests.py:4: DeprecationWarning: zope.testing.doctestunit is deprecated in favour of the Python standard library doctest module
  from zope.testing import doctestunit
/home/stefan/autotest/temp/python26-zope213-cmf22-plone42/eggs/zope.testing-3.9.6-py2.6.egg/zope/testing/doctestunit.py:27: DeprecationWarning: zope.testing.doctest is deprecated in favour of the Python standard library doctest module
  from doctest import DocFileSuite, DocTestSuite
Running zope.testing.testrunner.layer.UnitTests tests:
  Set up zope.testing.testrunner.layer.UnitTests in 0.000 seconds.
/home/stefan/autotest/temp/python26-zope213-cmf22-plone42/eggs/plone.registry-1.0-py2.6.egg/plone/registry/registry.py:274: DeprecationWarning: The Records persistent class is deprecated and should not be used.
  warnings.warn("The Records persistent class is deprecated and should not be used.", DeprecationWarning)
  Ran 112 tests with 0 failures and 0 errors in 0.058 seconds.
Tearing down left over layers:
  Tear down zope.testing.testrunner.layer.UnitTests in 0.000 seconds.
/home/stefan/autotest/temp/python26-zope213-cmf22-plone42/bin/test:267: DeprecationWarning: zope.testing.testrunner is deprecated in favour of zope.testrunner.
  import zope.testing.testrunner
/home/stefan/autotest/temp/python26-zope213-cmf22-plone42/eggs/zope.testing-3.9.6-py2.6.egg/zope/testing/testrunner/formatter.py:28: DeprecationWarning: zope.testing.exceptions is deprecated in favour of zope.testrunner.exceptions
  from zope.testing.exceptions import DocTestFailureException
Running zope.testing.testrunner.layer.UnitTests tests:
  Set up zope.testing.testrunner.layer.UnitTests in 0.000 seconds.
  Ran 33 tests with 0 failures and 0 errors in 0.097 seconds.
Tearing down left over layers:
  Tear down zope.testing.testrunner.layer.UnitTests in 0.000 seconds.
/home/stefan/autotest/temp/python26-zope213-cmf22-plone42/bin/test:267: DeprecationWarning: zope.testing.testrunner is deprecated in favour of zope.testrunner.
  import zope.testing.testrunner
/home/stefan/autotest/temp/python26-zope213-cmf22-plone42/eggs/zope.testing-3.9.6-py2.6.egg/zope/testing/testrunner/formatter.py:28: DeprecationWarning: zope.testing.exceptions is deprecated in favour of zope.testrunner.exceptions
  from zope.testing.exceptions import DocTestFailureException
/home/stefan/autotest/temp/python26-zope213-cmf22-plone42/eggs/plone.stringinterp-1.0.4-py2.6.egg/plone/stringinterp/tests/stringinterpTestCase.py:5: DeprecationWarning: Browser is deprecated. Please import from Testing.testbrowser
  from Products.Five.testbrowser import Browser
Running Products.PloneTestCase.layer.PloneSite tests:
  Set up Testing.ZopeTestCase.layer.ZopeLite in 1.445 seconds.
  Set up Products.PloneTestCase.layer.ZCML in 4.719 seconds.
  Set up Products.PloneTestCase.layer.PloneSite/home/stefan/autotest/temp/python26-zope213-cmf22-plone42/eggs/plone.stringinterp-1.0.4-py2.6.egg/plone/stringinterp/tests/stringinterpTestCase.py:19: DeprecationWarning: load_config is deprecated. Please import from Zope2.App.zcml
  zcml.load_config('configure.zcml', plone.stringinterp)
 in 4.642 seconds.
  Ran 2 tests with 0 failures and 0 errors in 0.446 seconds.
Tearing down left over layers:
  Tear down Products.PloneTestCase.layer.PloneSite in 0.180 seconds.
  Tear down Products.PloneTestCase.layer.ZCML in 0.004 seconds.
  Tear down Testing.ZopeTestCase.layer.ZopeLite in 0.000 seconds.
/home/stefan/autotest/temp/python26-zope213-cmf22-plone42/bin/test:267: DeprecationWarning: zope.testing.testrunner is deprecated in favour of zope.testrunner.
  import zope.testing.testrunner
/home/stefan/autotest/temp/python26-zope213-cmf22-plone42/eggs/zope.testing-3.9.6-py2.6.egg/zope/testing/testrunner/formatter.py:28: DeprecationWarning: zope.testing.exceptions is deprecated in favour of zope.testrunner.exceptions
  from zope.testing.exceptions import DocTestFailureException
Running zope.testing.testrunner.layer.UnitTests tests:
  Set up zope.testing.testrunner.layer.UnitTests in 0.000 seconds.
  Ran 16 tests with 0 failures and 0 errors in 0.306 seconds.
Tearing down left over layers:
  Tear down zope.testing.testrunner.layer.UnitTests in 0.000 seconds.
/home/stefan/autotest/temp/python26-zope213-cmf22-plone42/bin/test:267: DeprecationWarning: zope.testing.testrunner is deprecated in favour of zope.testrunner.
  import zope.testing.testrunner
/home/stefan/autotest/temp/python26-zope213-cmf22-plone42/eggs/zope.testing-3.9.6-py2.6.egg/zope/testing/testrunner/formatter.py:28: DeprecationWarning: zope.testing.exceptions is deprecated in favour of zope.testrunner.exceptions
  from zope.testing.exceptions import DocTestFailureException
Running zope.testing.testrunner.layer.UnitTests tests:
  Set up zope.testing.testrunner.layer.UnitTests in 0.000 seconds.
/home/stefan/autotest/temp/python26-zope213-cmf22-plone42/src/plone.testing/src/plone/testing/z2.py:19: DeprecationWarning: Zope2VocabularyRegistry is deprecated. Please import from Zope2.App.schema
  from Products.Five.schema import Zope2VocabularyRegistry
/home/stefan/autotest/temp/python26-zope213-cmf22-plone42/eggs/zope.configuration-3.7.4-py2.6.egg/zope/configuration/config.py:193: DeprecationWarning: FiveSecurityPolicy is deprecated. Please import from AccessControl.security
  obj = getattr(mod, oname)
  Ran 7 tests with 0 failures and 0 errors in 13.483 seconds.
Tearing down left over layers:
  Tear down zope.testing.testrunner.layer.UnitTests in 0.000 seconds.
/home/stefan/autotest/temp/python26-zope213-cmf22-plone42/bin/test:267: DeprecationWarning: zope.testing.testrunner is deprecated in favour of zope.testrunner.
  import zope.testing.testrunner
/home/stefan/autotest/temp/python26-zope213-cmf22-plone42/eggs/zope.testing-3.9.6-py2.6.egg/zope/testing/testrunner/formatter.py:28: DeprecationWarning: zope.testing.exceptions is deprecated in favour of zope.testrunner.exceptions
  from zope.testing.exceptions import DocTestFailureException
Running plone.testing.zca.UnitTesting tests:
  Set up plone.testing.zca.UnitTesting in 0.000 seconds.
  Ran 11 tests with 0 failures and 0 errors in 0.010 seconds.
Running zope.testing.testrunner.layer.UnitTests tests:
  Tear down plone.testing.zca.UnitTesting in 0.000 seconds.
  Set up zope.testing.testrunner.layer.UnitTests in 0.000 seconds.
  Ran 12 tests with 0 failures and 0 errors in 0.005 seconds.
Tearing down left over layers:
  Tear down zope.testing.testrunner.layer.UnitTests in 0.000 seconds.
Total: 23 tests, 0 failures, 0 errors in 0.084 seconds.
/home/stefan/autotest/temp/python26-zope213-cmf22-plone42/bin/test:267: DeprecationWarning: zope.testing.testrunner is deprecated in favour of zope.testrunner.
  import zope.testing.testrunner
/home/stefan/autotest/temp/python26-zope213-cmf22-plone42/eggs/zope.testing-3.9.6-py2.6.egg/zope/testing/testrunner/formatter.py:28: DeprecationWarning: zope.testing.exceptions is deprecated in favour of zope.testrunner.exceptions
  from zope.testing.exceptions import DocTestFailureException
Running zope.testing.testrunner.layer.UnitTests tests:
  Set up zope.testing.testrunner.layer.UnitTests in 0.000 seconds.
  Ran 6 tests with 0 failures and 0 errors in 0.742 seconds.
Tearing down left over layers:
  Tear down zope.testing.testrunner.layer.UnitTests in 0.000 seconds.
/home/stefan/autotest/temp/python26-zope213-cmf22-plone42/bin/test:267: DeprecationWarning: zope.testing.testrunner is deprecated in favour of zope.testrunner.
  import zope.testing.testrunner
/home/stefan/autotest/temp/python26-zope213-cmf22-plone42/eggs/zope.testing-3.9.6-py2.6.egg/zope/testing/testrunner/formatter.py:28: DeprecationWarning: zope.testing.exceptions is deprecated in favour of zope.testrunner.exceptions
  from zope.testing.exceptions import DocTestFailureException
Running plone.z3cform.testing_zcml_layer tests:
  Set up plone.z3cform.testing_zcml_layer in 0.372 seconds.
  Ran 4 tests with 0 failures and 0 errors in 0.280 seconds.
Running zope.testing.testrunner.layer.UnitTests tests:
  Tear down plone.z3cform.testing_zcml_layer ... not supported
  Running in a subprocess.
  Set up zope.testing.testrunner.layer.UnitTests in 0.000 seconds.
  Ran 3 tests with 0 failures and 0 errors in 0.750 seconds.
  Tear down zope.testing.testrunner.layer.UnitTests in 0.000 seconds.
Total: 7 tests, 0 failures, 0 errors in 4.050 seconds.
/home/stefan/autotest/temp/python26-zope213-cmf22-plone42/bin/test:267: DeprecationWarning: zope.testing.testrunner is deprecated in favour of zope.testrunner.
  import zope.testing.testrunner
/home/stefan/autotest/temp/python26-zope213-cmf22-plone42/eggs/zope.testing-3.9.6-py2.6.egg/zope/testing/testrunner/formatter.py:28: DeprecationWarning: zope.testing.exceptions is deprecated in favour of zope.testrunner.exceptions
  from zope.testing.exceptions import DocTestFailureException
Total: 0 tests, 0 failures, 0 errors in 0.000 seconds.
/home/stefan/autotest/temp/python26-zope213-cmf22-plone42/bin/test:267: DeprecationWarning: zope.testing.testrunner is deprecated in favour of zope.testrunner.
  import zope.testing.testrunner
/home/stefan/autotest/temp/python26-zope213-cmf22-plone42/eggs/zope.testing-3.9.6-py2.6.egg/zope/testing/testrunner/formatter.py:28: DeprecationWarning: zope.testing.exceptions is deprecated in favour of zope.testrunner.exceptions
  from zope.testing.exceptions import DocTestFailureException
/home/stefan/autotest/temp/python26-zope213-cmf22-plone42/eggs/plonetheme.sunburst-1.2-py2.6.egg/plonetheme/sunburst/tests/base.py:6: DeprecationWarning: Browser is deprecated. Please import from Testing.testbrowser
  from Products.Five.testbrowser import Browser
Running plonetheme.sunburst.tests.base.Layer tests:
  Set up Testing.ZopeTestCase.layer.ZopeLite in 1.490 seconds.
  Set up Products.PloneTestCase.layer.ZCML in 4.718 seconds.
  Set up Products.PloneTestCase.layer.PloneSite in 4.448 seconds.
  Set up collective.testcaselayer.ptc.PTCLayer in 0.024 seconds.
  Set up plonetheme.sunburst.tests.base.Layer/home/stefan/autotest/temp/python26-zope213-cmf22-plone42/eggs/plonetheme.sunburst-1.2-py2.6.egg/plonetheme/sunburst/tests/base.py:18: DeprecationWarning: load_config is deprecated. Please import from Zope2.App.zcml
  zcml.load_config('configure.zcml', package=sunburst)
 in 0.006 seconds.
/home/stefan/autotest/temp/python26-zope213-cmf22-plone42/eggs/plonetheme.sunburst-1.2-py2.6.egg/plonetheme/sunburst/README.txt:1: DeprecationWarning: load_string is deprecated. Please import from Zope2.App.zcml
  Detailed documentation
  Ran 3 tests with 0 failures and 0 errors in 1.189 seconds.
Tearing down left over layers:
  Tear down plonetheme.sunburst.tests.base.Layer in 0.000 seconds.
  Tear down collective.testcaselayer.ptc.PTCLayer in 0.000 seconds.
  Tear down Products.PloneTestCase.layer.PloneSite in 0.179 seconds.
  Tear down Products.PloneTestCase.layer.ZCML in 0.004 seconds.
  Tear down Testing.ZopeTestCase.layer.ZopeLite in 0.000 seconds.
/home/stefan/autotest/temp/python26-zope213-cmf22-plone42/bin/test:267: DeprecationWarning: zope.testing.testrunner is deprecated in favour of zope.testrunner.
  import zope.testing.testrunner
/home/stefan/autotest/temp/python26-zope213-cmf22-plone42/eggs/zope.testing-3.9.6-py2.6.egg/zope/testing/testrunner/formatter.py:28: DeprecationWarning: zope.testing.exceptions is deprecated in favour of zope.testrunner.exceptions
  from zope.testing.exceptions import DocTestFailureException
Total: 0 tests, 0 failures, 0 errors in 0.000 seconds.
/home/stefan/autotest/temp/python26-zope213-cmf22-plone42/bin/test:267: DeprecationWarning: zope.testing.testrunner is deprecated in favour of zope.testrunner.
  import zope.testing.testrunner
/home/stefan/autotest/temp/python26-zope213-cmf22-plone42/eggs/zope.testing-3.9.6-py2.6.egg/zope/testing/testrunner/formatter.py:28: DeprecationWarning: zope.testing.exceptions is deprecated in favour of zope.testrunner.exceptions
  from zope.testing.exceptions import DocTestFailureException
/home/stefan/autotest/temp/python26-zope213-cmf22-plone42/eggs/wicked-1.1.9-py2.6.egg/wicked/utils.py:223: DeprecationWarning: zope.testing.doctest is deprecated in favour of the Python standard library doctest module
  from zope.testing import doctest
Running Products.PloneTestCase.layer.ZCML tests:
  Set up Testing.ZopeTestCase.layer.ZopeLite in 0.898 seconds.
  Set up Products.PloneTestCase.layer.ZCML in 4.905 seconds.
  Ran 3 tests with 0 failures and 0 errors in 0.037 seconds.
Running wicked.at.tests.wickedtestcase.WickedSite tests:
  Set up Products.PloneTestCase.layer.PloneSite/home/stefan/autotest/temp/python26-zope213-cmf22-plone42/eggs/wicked-1.1.9-py2.6.egg/wicked/at/tests/wickedtestcase.py:19: DeprecationWarning: load_config is deprecated. Please import from Zope2.App.zcml
  zcml.load_config("configure.zcml", package=wicked.atcontent)
 in 5.607 seconds.
  Set up wicked.at.tests.wickedtestcase.WickedSite in 0.002 seconds.
  Ran 23 tests with 0 failures and 0 errors in 5.621 seconds.
Running wicked.at.tests.test_scope.Scoped tests:
  Set up wicked.at.tests.test_scope.Scoped in 0.001 seconds.
  Ran 3 tests with 0 failures and 0 errors in 0.631 seconds.
Running wicked.plone.tests.SelectiveATCT tests:
  Tear down wicked.at.tests.test_scope.Scoped in 0.000 seconds.
  Tear down wicked.at.tests.wickedtestcase.WickedSite in 0.002 seconds.
  Set up wicked.plone.tests.SelectiveATCT in 0.003 seconds.
  Ran 22 tests with 0 failures and 0 errors in 6.969 seconds.
Running wicked.plone.tests.ZCMLLayer tests:
  Tear down wicked.plone.tests.SelectiveATCT in 0.004 seconds.
  Set up wicked.plone.tests.ZCMLLayer in 0.026 seconds.
  Ran 2 tests with 0 failures and 0 errors in 0.658 seconds.
Running zope.testing.testrunner.layer.UnitTests tests:
  Tear down wicked.plone.tests.ZCMLLayer in 0.209 seconds.
  Tear down Products.PloneTestCase.layer.PloneSite in 0.001 seconds.
  Tear down Products.PloneTestCase.layer.ZCML in 0.004 seconds.
  Tear down Testing.ZopeTestCase.layer.ZopeLite in 0.000 seconds.
  Set up zope.testing.testrunner.layer.UnitTests in 0.000 seconds.
  Ran 34 tests with 0 failures and 0 errors in 0.017 seconds.
Tearing down left over layers:
  Tear down zope.testing.testrunner.layer.UnitTests in 0.000 seconds.
Total: 87 tests, 0 failures, 0 errors in 27.007 seconds.
/home/stefan/autotest/temp/python26-zope213-cmf22-plone42/bin/test:267: DeprecationWarning: zope.testing.testrunner is deprecated in favour of zope.testrunner.
  import zope.testing.testrunner
/home/stefan/autotest/temp/python26-zope213-cmf22-plone42/eggs/zope.testing-3.9.6-py2.6.egg/zope/testing/testrunner/formatter.py:28: DeprecationWarning: zope.testing.exceptions is deprecated in favour of zope.testrunner.exceptions
  from zope.testing.exceptions import DocTestFailureException
Running zope.testing.testrunner.layer.UnitTests tests:
  Set up zope.testing.testrunner.layer.UnitTests in 0.000 seconds.
  Ran 2 tests with 0 failures and 0 errors in 0.014 seconds.
Tearing down left over layers:
  Tear down zope.testing.testrunner.layer.UnitTests in 0.000 seconds.
/home/stefan/autotest/temp/python26-zope213-cmf22-plone42/bin/test:267: DeprecationWarning: zope.testing.testrunner is deprecated in favour of zope.testrunner.
  import zope.testing.testrunner
/home/stefan/autotest/temp/python26-zope213-cmf22-plone42/eggs/zope.testing-3.9.6-py2.6.egg/zope/testing/testrunner/formatter.py:28: DeprecationWarning: zope.testing.exceptions is deprecated in favour of zope.testrunner.exceptions
  from zope.testing.exceptions import DocTestFailureException
Running zope.testing.testrunner.layer.UnitTests tests:
  Set up zope.testing.testrunner.layer.UnitTests in 0.000 seconds.
  Ran 38 tests with 0 failures and 0 errors in 3.592 seconds.
Tearing down left over layers:
  Tear down zope.testing.testrunner.layer.UnitTests in 0.000 seconds.
/home/stefan/autotest/temp/python26-zope213-cmf22-plone42/bin/test:267: DeprecationWarning: zope.testing.testrunner is deprecated in favour of zope.testrunner.
  import zope.testing.testrunner
/home/stefan/autotest/temp/python26-zope213-cmf22-plone42/eggs/zope.testing-3.9.6-py2.6.egg/zope/testing/testrunner/formatter.py:28: DeprecationWarning: zope.testing.exceptions is deprecated in favour of zope.testrunner.exceptions
  from zope.testing.exceptions import DocTestFailureException
/home/stefan/autotest/temp/python26-zope213-cmf22-plone42/eggs/z3c.formwidget.query-0.5-py2.6.egg/z3c/formwidget/query/tests.py:4: DeprecationWarning: zope.testing.doctestunit is deprecated in favour of the Python standard library doctest module
  from zope.testing import doctestunit
/home/stefan/autotest/temp/python26-zope213-cmf22-plone42/eggs/zope.testing-3.9.6-py2.6.egg/zope/testing/doctestunit.py:27: DeprecationWarning: zope.testing.doctest is deprecated in favour of the Python standard library doctest module
  from doctest import DocFileSuite, DocTestSuite
Running zope.testing.testrunner.layer.UnitTests tests:
  Set up zope.testing.testrunner.layer.UnitTests in 0.000 seconds.
  Ran 25 tests with 0 failures and 0 errors in 0.399 seconds.
Tearing down left over layers:
  Tear down zope.testing.testrunner.layer.UnitTests in 0.000 seconds.
pp.z3cform ####
#### Finished tests for plone.app.z3cform ####

#### Running tests for plone.autoform ####
#### Finished tests for plone.autoform ####

#### Running tests for plone.cachepurging ####
#### Finished tests for plone.cachepurging ####

#### Running tests for plone.caching ####
#### Finished tests for plone.caching ####

#### Running tests for plone.folder ####
#### Finished tests for plone.folder ####

#### Running tests for plone.outputfilters ####
#### Finished tests for plone.outputfilters ####

#### Running tests for plone.registry ####
#### Finished tests for plone.registry ####

#### Running tests for plone.scale ####
#### Finished tests for plone.scale ####

#### Running tests for plone.stringinterp ####
#### Finished tests for plone.stringinterp ####

#### Running tests for plone.supermodel ####
#### Finished tests for plone.supermodel ####

#### Running tests for plone.testing ####
#### Finished tests for plone.testing ####

#### Running tests for plone.transformchain ####
#### Finished tests for plone.transformchain ####

#### Running tests for plone.uuid ####
#### Finished tests for plone.uuid ####

#### Running tests for plone.z3cform ####
#### Finished tests for plone.z3cform ####

#### Running tests for plonetheme.classic ####
#### Finished tests for plonetheme.classic ####

#### Running tests for plonetheme.sunburst ####
#### Finished tests for plonetheme.sunburst ####

#### Running tests for rdflib ####
#### Finished tests for rdflib ####

#### Running tests for wicked ####
#### Finished tests for wicked ####

#### Running tests for z3c.batching ####
#### Finished tests for z3c.batching ####

#### Running tests for z3c.form ####
#### Finished tests for z3c.form ####

#### Running tests for z3c.formwidget.query ####
#### Finished tests for z3c.formwidget.query ####

Packages with test failures:

Failing tests in plone.app.search

Total time elapsed: 1587.238 seconds

Grand total: 113 packages, 1 failures


FAILED (113 packages, 1 failures)


More information about the Testbot mailing list