[Testbot] FAILED (91 packages, 5 failures) : Plone-4.0 Zope-2.12 Python-2.6.4

Plone Tests plone-tests at epy.co.at
Wed Mar 24 02:39:59 UTC 2010


Plone Tests : FAILED (91 packages, 5 failures)
Plone-4.0 Zope-2.12 Python-2.6.4

Running ./bin/alltests -q --no-color --no-progress
Running Products.CMFTestCase.layer.CMFSite tests:
  Set up Testing.ZopeTestCase.layer.ZopeLite in 1.030 seconds.
  Set up Products.CMFTestCase.layer.ZCML in 3.079 seconds.
  Set up Products.CMFTestCase.layer.CMFSite in 1.464 seconds.
/home/stefan/autotest/temp/python26-zope212-cmf22-plone40/eggs/Products.CMFDefault-2.2.0-py2.6.egg/Products/CMFDefault/DublinCore.py:203: DeprecationWarning: Calls to `DateTime.ISO()` should be replaced with `DateTime.ISO8601()` to avoid implicit changes to GMT in expressions like `DateTime(obj.ModificationTime())`. Please also see http://dev.plone.org/plone/ticket/10140
  return self.creation_date.toZone(zone).ISO()
/home/stefan/autotest/temp/python26-zope212-cmf22-plone40/eggs/Products.CMFDefault-2.2.0-py2.6.egg/Products/CMFDefault/DublinCore.py:193: DeprecationWarning: Calls to `DateTime.ISO()` should be replaced with `DateTime.ISO8601()` to avoid implicit changes to GMT in expressions like `DateTime(obj.ModificationTime())`. Please also see http://dev.plone.org/plone/ticket/10140
  return date.toZone(zone).ISO()
/home/stefan/autotest/temp/python26-zope212-cmf22-plone40/eggs/Products.CMFDefault-2.2.0-py2.6.egg/Products/CMFDefault/DublinCore.py:231: DeprecationWarning: Calls to `DateTime.ISO()` should be replaced with `DateTime.ISO8601()` to avoid implicit changes to GMT in expressions like `DateTime(obj.ModificationTime())`. Please also see http://dev.plone.org/plone/ticket/10140
  return self.modified().toZone(zone).ISO()
  Ran 31 tests with 0 failures and 0 errors in 0.548 seconds.
Running Products.PloneTestCase.layer.PloneSite tests:
  Tear down Products.CMFTestCase.layer.CMFSite in 0.066 seconds.
  Tear down Products.CMFTestCase.layer.ZCML in 0.004 seconds.
  Set up Products.PloneTestCase.layer.ZCML in 1.788 seconds.
  Set up Products.PloneTestCase.layer.PloneSite in 3.645 seconds.


Error in test test_setLayoutUnsetsDefaultPage (Products.ATContentTypes.tests.test_browserdefaultmixin.TestBrowserDefaultMixin)
Traceback (most recent call last):
  File "/usr/local/python2.6/lib/python2.6/unittest.py", line 279, in run
    testMethod()
  File "/home/stefan/autotest/temp/python26-zope212-cmf22-plone40/eggs/Products.ATContentTypes-2.0b6-py2.6.egg/Products/ATContentTypes/tests/test_browserdefaultmixin.py", line 114, in test_setLayoutUnsetsDefaultPage
    resolved = self.af.unrestrictedTraverse(layout)()
  File "/home/stefan/autotest/temp/python26-zope212-cmf22-plone40/eggs/Zope2-2.12.3-py2.6-linux-x86_64.egg/Shared/DC/Scripts/Bindings.py", line 324, in __call__
    return self._bindAndExec(args, kw, None)
  File "/home/stefan/autotest/temp/python26-zope212-cmf22-plone40/eggs/Zope2-2.12.3-py2.6-linux-x86_64.egg/Shared/DC/Scripts/Bindings.py", line 361, in _bindAndExec
    return self._exec(bound_data, args, kw)
  File "/home/stefan/autotest/temp/python26-zope212-cmf22-plone40/eggs/Products.CMFCore-2.2.0-py2.6.egg/Products/CMFCore/FSPageTemplate.py", line 240, in _exec
    result = self.pt_render(extra_context=bound_names)
  File "/home/stefan/autotest/temp/python26-zope212-cmf22-plone40/eggs/Products.CMFCore-2.2.0-py2.6.egg/Products/CMFCore/FSPageTemplate.py", line 180, in pt_render
    self, source, extra_context
  File "/home/stefan/autotest/temp/python26-zope212-cmf22-plone40/eggs/Zope2-2.12.3-py2.6-linux-x86_64.egg/Products/PageTemplates/PageTemplate.py", line 80, in pt_render
    showtal=showtal)
  File "/home/stefan/autotest/temp/python26-zope212-cmf22-plone40/eggs/zope.pagetemplate-3.5.0-py2.6.egg/zope/pagetemplate/pagetemplate.py", line 115, in pt_render
    strictinsert=0, sourceAnnotations=sourceAnnotations)()
  File "/home/stefan/autotest/temp/python26-zope212-cmf22-plone40/eggs/zope.tal-3.5.2-py2.6.egg/zope/tal/talinterpreter.py", line 271, in __call__
    self.interpret(self.program)
  File "/home/stefan/autotest/temp/python26-zope212-cmf22-plone40/eggs/zope.tal-3.5.2-py2.6.egg/zope/tal/talinterpreter.py", line 343, in interpret
    handlers[opcode](self, args)
  File "/home/stefan/autotest/temp/python26-zope212-cmf22-plone40/eggs/zope.tal-3.5.2-py2.6.egg/zope/tal/talinterpreter.py", line 888, in do_useMacro
    self.interpret(macro)
  File "/home/stefan/autotest/temp/python26-zope212-cmf22-plone40/eggs/zope.tal-3.5.2-py2.6.egg/zope/tal/talinterpreter.py", line 343, in interpret
    handlers[opcode](self, args)
  File "/home/stefan/autotest/temp/python26-zope212-cmf22-plone40/eggs/zope.tal-3.5.2-py2.6.egg/zope/tal/talinterpreter.py", line 533, in do_optTag_tal
    self.do_optTag(stuff)
  File "/home/stefan/autotest/temp/python26-zope212-cmf22-plone40/eggs/zope.tal-3.5.2-py2.6.egg/zope/tal/talinterpreter.py", line 518, in do_optTag
    return self.no_tag(start, program)
  File "/home/stefan/autotest/temp/python26-zope212-cmf22-plone40/eggs/zope.tal-3.5.2-py2.6.egg/zope/tal/talinterpreter.py", line 513, in no_tag
    self.interpret(program)
  File "/home/stefan/autotest/temp/python26-zope212-cmf22-plone40/eggs/zope.tal-3.5.2-py2.6.egg/zope/tal/talinterpreter.py", line 343, in interpret
    handlers[opcode](self, args)
  File "/home/stefan/autotest/temp/python26-zope212-cmf22-plone40/eggs/zope.tal-3.5.2-py2.6.egg/zope/tal/talinterpreter.py", line 954, in do_defineSlot
    self.interpret(block)
  File "/home/stefan/autotest/temp/python26-zope212-cmf22-plone40/eggs/zope.tal-3.5.2-py2.6.egg/zope/tal/talinterpreter.py", line 343, in interpret
    handlers[opcode](self, args)
  File "/home/stefan/autotest/temp/python26-zope212-cmf22-plone40/eggs/zope.tal-3.5.2-py2.6.egg/zope/tal/talinterpreter.py", line 533, in do_optTag_tal
    self.do_optTag(stuff)
  File "/home/stefan/autotest/temp/python26-zope212-cmf22-plone40/eggs/zope.tal-3.5.2-py2.6.egg/zope/tal/talinterpreter.py", line 518, in do_optTag
    return self.no_tag(start, program)
  File "/home/stefan/autotest/temp/python26-zope212-cmf22-plone40/eggs/zope.tal-3.5.2-py2.6.egg/zope/tal/talinterpreter.py", line 513, in no_tag
    self.interpret(program)
  File "/home/stefan/autotest/temp/python26-zope212-cmf22-plone40/eggs/zope.tal-3.5.2-py2.6.egg/zope/tal/talinterpreter.py", line 343, in interpret
    handlers[opcode](self, args)
  File "/home/stefan/autotest/temp/python26-zope212-cmf22-plone40/eggs/zope.tal-3.5.2-py2.6.egg/zope/tal/talinterpreter.py", line 858, in do_defineMacro
    self.interpret(macro)
  File "/home/stefan/autotest/temp/python26-zope212-cmf22-plone40/eggs/zope.tal-3.5.2-py2.6.egg/zope/tal/talinterpreter.py", line 343, in interpret
    handlers[opcode](self, args)
  File "/home/stefan/autotest/temp/python26-zope212-cmf22-plone40/eggs/zope.tal-3.5.2-py2.6.egg/zope/tal/talinterpreter.py", line 954, in do_defineSlot
    self.interpret(block)
  File "/home/stefan/autotest/temp/python26-zope212-cmf22-plone40/eggs/zope.tal-3.5.2-py2.6.egg/zope/tal/talinterpreter.py", line 343, in interpret
    handlers[opcode](self, args)
  File "/home/stefan/autotest/temp/python26-zope212-cmf22-plone40/eggs/zope.tal-3.5.2-py2.6.egg/zope/tal/talinterpreter.py", line 533, in do_optTag_tal
    self.do_optTag(stuff)
  File "/home/stefan/autotest/temp/python26-zope212-cmf22-plone40/eggs/zope.tal-3.5.2-py2.6.egg/zope/tal/talinterpreter.py", line 518, in do_optTag
    return self.no_tag(start, program)
  File "/home/stefan/autotest/temp/python26-zope212-cmf22-plone40/eggs/zope.tal-3.5.2-py2.6.egg/zope/tal/talinterpreter.py", line 513, in no_tag
    self.interpret(program)
  File "/home/stefan/autotest/temp/python26-zope212-cmf22-plone40/eggs/zope.tal-3.5.2-py2.6.egg/zope/tal/talinterpreter.py", line 343, in interpret
    handlers[opcode](self, args)
  File "/home/stefan/autotest/temp/python26-zope212-cmf22-plone40/eggs/zope.tal-3.5.2-py2.6.egg/zope/tal/talinterpreter.py", line 954, in do_defineSlot
    self.interpret(block)
  File "/home/stefan/autotest/temp/python26-zope212-cmf22-plone40/eggs/zope.tal-3.5.2-py2.6.egg/zope/tal/talinterpreter.py", line 343, in interpret
    handlers[opcode](self, args)
  File "/home/stefan/autotest/temp/python26-zope212-cmf22-plone40/eggs/zope.tal-3.5.2-py2.6.egg/zope/tal/talinterpreter.py", line 533, in do_optTag_tal
    self.do_optTag(stuff)
  File "/home/stefan/autotest/temp/python26-zope212-cmf22-plone40/eggs/zope.tal-3.5.2-py2.6.egg/zope/tal/talinterpreter.py", line 518, in do_optTag
    return self.no_tag(start, program)
  File "/home/stefan/autotest/temp/python26-zope212-cmf22-plone40/eggs/zope.tal-3.5.2-py2.6.egg/zope/tal/talinterpreter.py", line 513, in no_tag
    self.interpret(program)
  File "/home/stefan/autotest/temp/python26-zope212-cmf22-plone40/eggs/zope.tal-3.5.2-py2.6.egg/zope/tal/talinterpreter.py", line 343, in interpret
    handlers[opcode](self, args)
  File "/home/stefan/autotest/temp/python26-zope212-cmf22-plone40/eggs/zope.tal-3.5.2-py2.6.egg/zope/tal/talinterpreter.py", line 946, in do_defineSlot
    self.interpret(slot)
  File "/home/stefan/autotest/temp/python26-zope212-cmf22-plone40/eggs/zope.tal-3.5.2-py2.6.egg/zope/tal/talinterpreter.py", line 343, in interpret
    handlers[opcode](self, args)
  File "/home/stefan/autotest/temp/python26-zope212-cmf22-plone40/eggs/zope.tal-3.5.2-py2.6.egg/zope/tal/talinterpreter.py", line 533, in do_optTag_tal
    self.do_optTag(stuff)
  File "/home/stefan/autotest/temp/python26-zope212-cmf22-plone40/eggs/zope.tal-3.5.2-py2.6.egg/zope/tal/talinterpreter.py", line 518, in do_optTag
    return self.no_tag(start, program)
  File "/home/stefan/autotest/temp/python26-zope212-cmf22-plone40/eggs/zope.tal-3.5.2-py2.6.egg/zope/tal/talinterpreter.py", line 513, in no_tag
    self.interpret(program)
  File "/home/stefan/autotest/temp/python26-zope212-cmf22-plone40/eggs/zope.tal-3.5.2-py2.6.egg/zope/tal/talinterpreter.py", line 343, in interpret
    handlers[opcode](self, args)
  File "/home/stefan/autotest/temp/python26-zope212-cmf22-plone40/eggs/zope.tal-3.5.2-py2.6.egg/zope/tal/talinterpreter.py", line 858, in do_defineMacro
    self.interpret(macro)
  File "/home/stefan/autotest/temp/python26-zope212-cmf22-plone40/eggs/zope.tal-3.5.2-py2.6.egg/zope/tal/talinterpreter.py", line 343, in interpret
    handlers[opcode](self, args)
  File "/home/stefan/autotest/temp/python26-zope212-cmf22-plone40/eggs/zope.tal-3.5.2-py2.6.egg/zope/tal/talinterpreter.py", line 533, in do_optTag_tal
    self.do_optTag(stuff)
  File "/home/stefan/autotest/temp/python26-zope212-cmf22-plone40/eggs/zope.tal-3.5.2-py2.6.egg/zope/tal/talinterpreter.py", line 518, in do_optTag
    return self.no_tag(start, program)
  File "/home/stefan/autotest/temp/python26-zope212-cmf22-plone40/eggs/zope.tal-3.5.2-py2.6.egg/zope/tal/talinterpreter.py", line 513, in no_tag
    self.interpret(program)
  File "/home/stefan/autotest/temp/python26-zope212-cmf22-plone40/eggs/zope.tal-3.5.2-py2.6.egg/zope/tal/talinterpreter.py", line 343, in interpret
    handlers[opcode](self, args)
  File "/home/stefan/autotest/temp/python26-zope212-cmf22-plone40/eggs/zope.tal-3.5.2-py2.6.egg/zope/tal/talinterpreter.py", line 852, in do_condition
    self.interpret(block)
  File "/home/stefan/autotest/temp/python26-zope212-cmf22-plone40/eggs/zope.tal-3.5.2-py2.6.egg/zope/tal/talinterpreter.py", line 343, in interpret
    handlers[opcode](self, args)
  File "/home/stefan/autotest/temp/python26-zope212-cmf22-plone40/eggs/zope.tal-3.5.2-py2.6.egg/zope/tal/talinterpreter.py", line 533, in do_optTag_tal
    self.do_optTag(stuff)
  File "/home/stefan/autotest/temp/python26-zope212-cmf22-plone40/eggs/zope.tal-3.5.2-py2.6.egg/zope/tal/talinterpreter.py", line 518, in do_optTag
    return self.no_tag(start, program)
  File "/home/stefan/autotest/temp/python26-zope212-cmf22-plone40/eggs/zope.tal-3.5.2-py2.6.egg/zope/tal/talinterpreter.py", line 513, in no_tag
    self.interpret(program)
  File "/home/stefan/autotest/temp/python26-zope212-cmf22-plone40/eggs/zope.tal-3.5.2-py2.6.egg/zope/tal/talinterpreter.py", line 343, in interpret
    handlers[opcode](self, args)
  File "/home/stefan/autotest/temp/python26-zope212-cmf22-plone40/eggs/zope.tal-3.5.2-py2.6.egg/zope/tal/talinterpreter.py", line 888, in do_useMacro
    self.interpret(macro)
  File "/home/stefan/autotest/temp/python26-zope212-cmf22-plone40/eggs/zope.tal-3.5.2-py2.6.egg/zope/tal/talinterpreter.py", line 343, in interpret
    handlers[opcode](self, args)
  File "/home/stefan/autotest/temp/python26-zope212-cmf22-plone40/eggs/zope.tal-3.5.2-py2.6.egg/zope/tal/talinterpreter.py", line 533, in do_optTag_tal
    self.do_optTag(stuff)
  File "/home/stefan/autotest/temp/python26-zope212-cmf22-plone40/eggs/zope.tal-3.5.2-py2.6.egg/zope/tal/talinterpreter.py", line 518, in do_optTag
    return self.no_tag(start, program)
  File "/home/stefan/autotest/temp/python26-zope212-cmf22-plone40/eggs/zope.tal-3.5.2-py2.6.egg/zope/tal/talinterpreter.py", line 513, in no_tag
    self.interpret(program)
  File "/home/stefan/autotest/temp/python26-zope212-cmf22-plone40/eggs/zope.tal-3.5.2-py2.6.egg/zope/tal/talinterpreter.py", line 343, in interpret
    handlers[opcode](self, args)
  File "/home/stefan/autotest/temp/python26-zope212-cmf22-plone40/eggs/zope.tal-3.5.2-py2.6.egg/zope/tal/talinterpreter.py", line 533, in do_optTag_tal
    self.do_optTag(stuff)
  File "/home/stefan/autotest/temp/python26-zope212-cmf22-plone40/eggs/zope.tal-3.5.2-py2.6.egg/zope/tal/talinterpreter.py", line 518, in do_optTag
    return self.no_tag(start, program)
  File "/home/stefan/autotest/temp/python26-zope212-cmf22-plone40/eggs/zope.tal-3.5.2-py2.6.egg/zope/tal/talinterpreter.py", line 513, in no_tag
    self.interpret(program)
  File "/home/stefan/autotest/temp/python26-zope212-cmf22-plone40/eggs/zope.tal-3.5.2-py2.6.egg/zope/tal/talinterpreter.py", line 343, in interpret
    handlers[opcode](self, args)
  File "/home/stefan/autotest/temp/python26-zope212-cmf22-plone40/eggs/zope.tal-3.5.2-py2.6.egg/zope/tal/talinterpreter.py", line 852, in do_condition
    self.interpret(block)
  File "/home/stefan/autotest/temp/python26-zope212-cmf22-plone40/eggs/zope.tal-3.5.2-py2.6.egg/zope/tal/talinterpreter.py", line 343, in interpret
    handlers[opcode](self, args)
  File "/home/stefan/autotest/temp/python26-zope212-cmf22-plone40/eggs/zope.tal-3.5.2-py2.6.egg/zope/tal/talinterpreter.py", line 533, in do_optTag_tal
    self.do_optTag(stuff)
  File "/home/stefan/autotest/temp/python26-zope212-cmf22-plone40/eggs/zope.tal-3.5.2-py2.6.egg/zope/tal/talinterpreter.py", line 518, in do_optTag
    return self.no_tag(start, program)
  File "/home/stefan/autotest/temp/python26-zope212-cmf22-plone40/eggs/zope.tal-3.5.2-py2.6.egg/zope/tal/talinterpreter.py", line 513, in no_tag
    self.interpret(program)
  File "/home/stefan/autotest/temp/python26-zope212-cmf22-plone40/eggs/zope.tal-3.5.2-py2.6.egg/zope/tal/talinterpreter.py", line 343, in interpret
    handlers[opcode](self, args)
  File "/home/stefan/autotest/temp/python26-zope212-cmf22-plone40/eggs/zope.tal-3.5.2-py2.6.egg/zope/tal/talinterpreter.py", line 888, in do_useMacro
    self.interpret(macro)
  File "/home/stefan/autotest/temp/python26-zope212-cmf22-plone40/eggs/zope.tal-3.5.2-py2.6.egg/zope/tal/talinterpreter.py", line 343, in interpret
    handlers[opcode](self, args)
  File "/home/stefan/autotest/temp/python26-zope212-cmf22-plone40/eggs/zope.tal-3.5.2-py2.6.egg/zope/tal/talinterpreter.py", line 583, in do_setLocal_tal
    self.engine.setLocal(name, self.engine.evaluateValue(expr))
  File "/home/stefan/autotest/temp/python26-zope212-cmf22-plone40/eggs/zope.tales-3.4.0-py2.6.egg/zope/tales/tales.py", line 696, in evaluate
    return expression(self)
   - file:/home/stefan/autotest/temp/python26-zope212-cmf22-plone40/src/Plone/Products/CMFPlone/skins/plone_templates/batch_macros.pt
   - Line 8, Column 0
   - Expression: <PathExpr standard:u'batch/pagenumber'>
   - Names:
      {'container': <PloneSite at /plone>,
       'context': <ATFolder at /plone/Members/test_user_1_/af>,
       'default': <object object at 0x2b55b0b02750>,
       'here': <ATFolder at /plone/Members/test_user_1_/af>,
       'loop': {},
       'nothing': None,
       'options': {'args': ()},
       'repeat': <Products.PageTemplates.Expressions.SafeMapping object at 0x9175908>,
       'request': <HTTPRequest, URL=http://nohost>,
       'root': <Application at >,
       'template': <FSPageTemplate at /plone/atct_album_view used for /plone/Members/test_user_1_/af>,
       'traverse_subpath': [],
       'user': <PloneUser 'test_user_1_'>}
  File "/home/stefan/autotest/temp/python26-zope212-cmf22-plone40/eggs/zope.tales-3.4.0-py2.6.egg/zope/tales/expressions.py", line 217, in __call__
    return self._eval(econtext)
  File "/home/stefan/autotest/temp/python26-zope212-cmf22-plone40/eggs/Zope2-2.12.3-py2.6-linux-x86_64.egg/Products/PageTemplates/Expressions.py", line 149, in _eval
    ob = self._subexprs[-1](econtext)
  File "/home/stefan/autotest/temp/python26-zope212-cmf22-plone40/eggs/zope.tales-3.4.0-py2.6.egg/zope/tales/expressions.py", line 124, in _eval
    ob = self._traverser(ob, element, econtext)
  File "/home/stefan/autotest/temp/python26-zope212-cmf22-plone40/eggs/Zope2-2.12.3-py2.6-linux-x86_64.egg/Products/PageTemplates/Expressions.py", line 79, in boboAwareZopeTraverse
    request=request)
  File "/home/stefan/autotest/temp/python26-zope212-cmf22-plone40/eggs/zope.traversing-3.7.1-py2.6.egg/zope/traversing/adapters.py", line 139, in traversePathElement
    return traversable.traverse(nm, further_path)
   - __traceback_info__: ([<Products.ZCatalog.Catalog.mybrains object at 0x908ef18>], 'pagenumber')
  File "/home/stefan/autotest/temp/python26-zope212-cmf22-plone40/eggs/zope.traversing-3.7.1-py2.6.egg/zope/traversing/adapters.py", line 53, in traverse
    raise LocationError(subject, name)
   - __traceback_info__: ([<Products.ZCatalog.Catalog.mybrains object at 0x908ef18>], 'pagenumber', [])
LocationError: ([<Products.ZCatalog.Catalog.mybrains object at 0x908ef18>], 'pagenumber')

  Ran 712 tests with 0 failures and 1 errors in 1 minutes 5.420 seconds.
Tearing down left over layers:
  Tear down Products.PloneTestCase.layer.PloneSite in 0.339 seconds.
  Tear down Products.PloneTestCase.layer.ZCML in 0.010 seconds.
  Tear down Testing.ZopeTestCase.layer.ZopeLite in 0.000 seconds.
Total: 743 tests, 0 failures, 1 errors in 1 minutes 17.914 seconds.
Running Testing.ZopeTestCase.layer.ZopeLite tests:
  Set up Testing.ZopeTestCase.layer.ZopeLite in 0.820 seconds.
  Ran 43 tests with 0 failures and 0 errors in 0.106 seconds.
Running Products.Archetypes.tests.layer.ZCML tests:
  Set up Products.CMFCore.testing.FunctionalZCMLLayer in 0.191 seconds.
  Set up Products.Archetypes.tests.layer.ZCML in 0.180 seconds.
  Ran 59 tests with 0 failures and 0 errors in 1.141 seconds.
Running Products.Archetypes.tests.layer.ArchetypesSite tests:
  Set up Products.Archetypes.tests.layer.ArchetypesSite in 1.433 seconds.
/home/stefan/autotest/temp/python26-zope212-cmf22-plone40/eggs/Zope2-2.12.3-py2.6-linux-x86_64.egg/OFS/subscribers.py:73: DeprecationWarning: Products.Archetypes.tests.test_classgen.Dummy.manage_afterAdd is discouraged. You should use event subscribers instead.
  DeprecationWarning)
/home/stefan/autotest/temp/python26-zope212-cmf22-plone40/eggs/Zope2-2.12.3-py2.6-linux-x86_64.egg/OFS/subscribers.py:73: DeprecationWarning: Products.Archetypes.tests.test_annotation.AnnDummy.manage_afterAdd is discouraged. You should use event subscribers instead.
  DeprecationWarning)


Error in test test_clone_portal (Products.Archetypes.tests.test_copying.PortalCopyTests)
Traceback (most recent call last):
  File "/usr/local/python2.6/lib/python2.6/unittest.py", line 270, in run
    self.setUp()
  File "/home/stefan/autotest/temp/python26-zope212-cmf22-plone40/eggs/Zope2-2.12.3-py2.6-linux-x86_64.egg/Testing/ZopeTestCase/PortalTestCase.py", line 62, in setUp
    self.afterSetUp()
  File "/home/stefan/autotest/temp/python26-zope212-cmf22-plone40/src/Products.Archetypes/Products/Archetypes/tests/test_copying.py", line 89, in afterSetUp
    doc.setImage(self._image, mimetype='image/gif')
  File "/home/stefan/autotest/temp/python26-zope212-cmf22-plone40/src/Products.Archetypes/Products/Archetypes/ClassGen.py", line 74, in generatedMutator
    return schema[name].set(self, value, **kw)
  File "/home/stefan/autotest/temp/python26-zope212-cmf22-plone40/src/Products.Archetypes/Products/Archetypes/Field.py", line 2294, in set
    self.createScales(instance, value=data)
  File "/home/stefan/autotest/temp/python26-zope212-cmf22-plone40/src/plone.app.imaging/src/plone/app/imaging/monkey.py", line 35, in createScales
    handler = IImageScaleHandler(self)
TypeError: ('Could not adapt', <Field image(image:rw)>, <InterfaceClass plone.app.imaging.interfaces.IImageScaleHandler>)



Error in test test_copy_handles_talkback_Items (Products.Archetypes.tests.test_copying.PortalCopyTests)
Traceback (most recent call last):
  File "/usr/local/python2.6/lib/python2.6/unittest.py", line 270, in run
    self.setUp()
  File "/home/stefan/autotest/temp/python26-zope212-cmf22-plone40/eggs/Zope2-2.12.3-py2.6-linux-x86_64.egg/Testing/ZopeTestCase/PortalTestCase.py", line 62, in setUp
    self.afterSetUp()
  File "/home/stefan/autotest/temp/python26-zope212-cmf22-plone40/src/Products.Archetypes/Products/Archetypes/tests/test_copying.py", line 89, in afterSetUp
    doc.setImage(self._image, mimetype='image/gif')
  File "/home/stefan/autotest/temp/python26-zope212-cmf22-plone40/src/Products.Archetypes/Products/Archetypes/ClassGen.py", line 74, in generatedMutator
    return schema[name].set(self, value, **kw)
  File "/home/stefan/autotest/temp/python26-zope212-cmf22-plone40/src/Products.Archetypes/Products/Archetypes/Field.py", line 2294, in set
    self.createScales(instance, value=data)
  File "/home/stefan/autotest/temp/python26-zope212-cmf22-plone40/src/plone.app.imaging/src/plone/app/imaging/monkey.py", line 35, in createScales
    handler = IImageScaleHandler(self)
TypeError: ('Could not adapt', <Field image(image:rw)>, <InterfaceClass plone.app.imaging.interfaces.IImageScaleHandler>)



Error in test test_copy_paste_portal (Products.Archetypes.tests.test_copying.PortalCopyTests)
Traceback (most recent call last):
  File "/usr/local/python2.6/lib/python2.6/unittest.py", line 270, in run
    self.setUp()
  File "/home/stefan/autotest/temp/python26-zope212-cmf22-plone40/eggs/Zope2-2.12.3-py2.6-linux-x86_64.egg/Testing/ZopeTestCase/PortalTestCase.py", line 62, in setUp
    self.afterSetUp()
  File "/home/stefan/autotest/temp/python26-zope212-cmf22-plone40/src/Products.Archetypes/Products/Archetypes/tests/test_copying.py", line 89, in afterSetUp
    doc.setImage(self._image, mimetype='image/gif')
  File "/home/stefan/autotest/temp/python26-zope212-cmf22-plone40/src/Products.Archetypes/Products/Archetypes/ClassGen.py", line 74, in generatedMutator
    return schema[name].set(self, value, **kw)
  File "/home/stefan/autotest/temp/python26-zope212-cmf22-plone40/src/Products.Archetypes/Products/Archetypes/Field.py", line 2294, in set
    self.createScales(instance, value=data)
  File "/home/stefan/autotest/temp/python26-zope212-cmf22-plone40/src/plone.app.imaging/src/plone/app/imaging/monkey.py", line 35, in createScales
    handler = IImageScaleHandler(self)
TypeError: ('Could not adapt', <Field image(image:rw)>, <InterfaceClass plone.app.imaging.interfaces.IImageScaleHandler>)



Error in test test_copy_paste_resets_workflow (Products.Archetypes.tests.test_copying.PortalCopyTests)
Traceback (most recent call last):
  File "/usr/local/python2.6/lib/python2.6/unittest.py", line 270, in run
    self.setUp()
  File "/home/stefan/autotest/temp/python26-zope212-cmf22-plone40/eggs/Zope2-2.12.3-py2.6-linux-x86_64.egg/Testing/ZopeTestCase/PortalTestCase.py", line 62, in setUp
    self.afterSetUp()
  File "/home/stefan/autotest/temp/python26-zope212-cmf22-plone40/src/Products.Archetypes/Products/Archetypes/tests/test_copying.py", line 89, in afterSetUp
    doc.setImage(self._image, mimetype='image/gif')
  File "/home/stefan/autotest/temp/python26-zope212-cmf22-plone40/src/Products.Archetypes/Products/Archetypes/ClassGen.py", line 74, in generatedMutator
    return schema[name].set(self, value, **kw)
  File "/home/stefan/autotest/temp/python26-zope212-cmf22-plone40/src/Products.Archetypes/Products/Archetypes/Field.py", line 2294, in set
    self.createScales(instance, value=data)
  File "/home/stefan/autotest/temp/python26-zope212-cmf22-plone40/src/plone.app.imaging/src/plone/app/imaging/monkey.py", line 35, in createScales
    handler = IImageScaleHandler(self)
TypeError: ('Could not adapt', <Field image(image:rw)>, <InterfaceClass plone.app.imaging.interfaces.IImageScaleHandler>)



Error in test test_copy_paste_sets_ownership (Products.Archetypes.tests.test_copying.PortalCopyTests)
Traceback (most recent call last):
  File "/usr/local/python2.6/lib/python2.6/unittest.py", line 270, in run
    self.setUp()
  File "/home/stefan/autotest/temp/python26-zope212-cmf22-plone40/eggs/Zope2-2.12.3-py2.6-linux-x86_64.egg/Testing/ZopeTestCase/PortalTestCase.py", line 62, in setUp
    self.afterSetUp()
  File "/home/stefan/autotest/temp/python26-zope212-cmf22-plone40/src/Products.Archetypes/Products/Archetypes/tests/test_copying.py", line 89, in afterSetUp
    doc.setImage(self._image, mimetype='image/gif')
  File "/home/stefan/autotest/temp/python26-zope212-cmf22-plone40/src/Products.Archetypes/Products/Archetypes/ClassGen.py", line 74, in generatedMutator
    return schema[name].set(self, value, **kw)
  File "/home/stefan/autotest/temp/python26-zope212-cmf22-plone40/src/Products.Archetypes/Products/Archetypes/Field.py", line 2294, in set
    self.createScales(instance, value=data)
  File "/home/stefan/autotest/temp/python26-zope212-cmf22-plone40/src/plone.app.imaging/src/plone/app/imaging/monkey.py", line 35, in createScales
    handler = IImageScaleHandler(self)
TypeError: ('Could not adapt', <Field image(image:rw)>, <InterfaceClass plone.app.imaging.interfaces.IImageScaleHandler>)



Error in test test_created_doc (Products.Archetypes.tests.test_copying.PortalCopyTests)
Traceback (most recent call last):
  File "/usr/local/python2.6/lib/python2.6/unittest.py", line 270, in run
    self.setUp()
  File "/home/stefan/autotest/temp/python26-zope212-cmf22-plone40/eggs/Zope2-2.12.3-py2.6-linux-x86_64.egg/Testing/ZopeTestCase/PortalTestCase.py", line 62, in setUp
    self.afterSetUp()
  File "/home/stefan/autotest/temp/python26-zope212-cmf22-plone40/src/Products.Archetypes/Products/Archetypes/tests/test_copying.py", line 89, in afterSetUp
    doc.setImage(self._image, mimetype='image/gif')
  File "/home/stefan/autotest/temp/python26-zope212-cmf22-plone40/src/Products.Archetypes/Products/Archetypes/ClassGen.py", line 74, in generatedMutator
    return schema[name].set(self, value, **kw)
  File "/home/stefan/autotest/temp/python26-zope212-cmf22-plone40/src/Products.Archetypes/Products/Archetypes/Field.py", line 2294, in set
    self.createScales(instance, value=data)
  File "/home/stefan/autotest/temp/python26-zope212-cmf22-plone40/src/plone.app.imaging/src/plone/app/imaging/monkey.py", line 35, in createScales
    handler = IImageScaleHandler(self)
TypeError: ('Could not adapt', <Field image(image:rw)>, <InterfaceClass plone.app.imaging.interfaces.IImageScaleHandler>)



Error in test test_cut_paste_portal (Products.Archetypes.tests.test_copying.PortalCopyTests)
Traceback (most recent call last):
  File "/usr/local/python2.6/lib/python2.6/unittest.py", line 270, in run
    self.setUp()
  File "/home/stefan/autotest/temp/python26-zope212-cmf22-plone40/eggs/Zope2-2.12.3-py2.6-linux-x86_64.egg/Testing/ZopeTestCase/PortalTestCase.py", line 62, in setUp
    self.afterSetUp()
  File "/home/stefan/autotest/temp/python26-zope212-cmf22-plone40/src/Products.Archetypes/Products/Archetypes/tests/test_copying.py", line 89, in afterSetUp
    doc.setImage(self._image, mimetype='image/gif')
  File "/home/stefan/autotest/temp/python26-zope212-cmf22-plone40/src/Products.Archetypes/Products/Archetypes/ClassGen.py", line 74, in generatedMutator
    return schema[name].set(self, value, **kw)
  File "/home/stefan/autotest/temp/python26-zope212-cmf22-plone40/src/Products.Archetypes/Products/Archetypes/Field.py", line 2294, in set
    self.createScales(instance, value=data)
  File "/home/stefan/autotest/temp/python26-zope212-cmf22-plone40/src/plone.app.imaging/src/plone/app/imaging/monkey.py", line 35, in createScales
    handler = IImageScaleHandler(self)
TypeError: ('Could not adapt', <Field image(image:rw)>, <InterfaceClass plone.app.imaging.interfaces.IImageScaleHandler>)



Error in test test_cut_paste_preserves_workflow (Products.Archetypes.tests.test_copying.PortalCopyTests)
Traceback (most recent call last):
  File "/usr/local/python2.6/lib/python2.6/unittest.py", line 270, in run
    self.setUp()
  File "/home/stefan/autotest/temp/python26-zope212-cmf22-plone40/eggs/Zope2-2.12.3-py2.6-linux-x86_64.egg/Testing/ZopeTestCase/PortalTestCase.py", line 62, in setUp
    self.afterSetUp()
  File "/home/stefan/autotest/temp/python26-zope212-cmf22-plone40/src/Products.Archetypes/Products/Archetypes/tests/test_copying.py", line 89, in afterSetUp
    doc.setImage(self._image, mimetype='image/gif')
  File "/home/stefan/autotest/temp/python26-zope212-cmf22-plone40/src/Products.Archetypes/Products/Archetypes/ClassGen.py", line 74, in generatedMutator
    return schema[name].set(self, value, **kw)
  File "/home/stefan/autotest/temp/python26-zope212-cmf22-plone40/src/Products.Archetypes/Products/Archetypes/Field.py", line 2294, in set
    self.createScales(instance, value=data)
  File "/home/stefan/autotest/temp/python26-zope212-cmf22-plone40/src/plone.app.imaging/src/plone/app/imaging/monkey.py", line 35, in createScales
    handler = IImageScaleHandler(self)
TypeError: ('Could not adapt', <Field image(image:rw)>, <InterfaceClass plone.app.imaging.interfaces.IImageScaleHandler>)



Error in test test_delete_handles_talkback_Items (Products.Archetypes.tests.test_copying.PortalCopyTests)
Traceback (most recent call last):
  File "/usr/local/python2.6/lib/python2.6/unittest.py", line 270, in run
    self.setUp()
  File "/home/stefan/autotest/temp/python26-zope212-cmf22-plone40/eggs/Zope2-2.12.3-py2.6-linux-x86_64.egg/Testing/ZopeTestCase/PortalTestCase.py", line 62, in setUp
    self.afterSetUp()
  File "/home/stefan/autotest/temp/python26-zope212-cmf22-plone40/src/Products.Archetypes/Products/Archetypes/tests/test_copying.py", line 89, in afterSetUp
    doc.setImage(self._image, mimetype='image/gif')
  File "/home/stefan/autotest/temp/python26-zope212-cmf22-plone40/src/Products.Archetypes/Products/Archetypes/ClassGen.py", line 74, in generatedMutator
    return schema[name].set(self, value, **kw)
  File "/home/stefan/autotest/temp/python26-zope212-cmf22-plone40/src/Products.Archetypes/Products/Archetypes/Field.py", line 2294, in set
    self.createScales(instance, value=data)
  File "/home/stefan/autotest/temp/python26-zope212-cmf22-plone40/src/plone.app.imaging/src/plone/app/imaging/monkey.py", line 35, in createScales
    handler = IImageScaleHandler(self)
TypeError: ('Could not adapt', <Field image(image:rw)>, <InterfaceClass plone.app.imaging.interfaces.IImageScaleHandler>)

/home/stefan/autotest/temp/python26-zope212-cmf22-plone40/eggs/Zope2-2.12.3-py2.6-linux-x86_64.egg/OFS/subscribers.py:73: DeprecationWarning: Products.Archetypes.tests.test_event.Dummy.manage_afterAdd is discouraged. You should use event subscribers instead.
  DeprecationWarning)


Error in test test_get_size (Products.Archetypes.tests.test_fields.ProcessingTest)
Traceback (most recent call last):
  File "/usr/local/python2.6/lib/python2.6/unittest.py", line 279, in run
    testMethod()
  File "/home/stefan/autotest/temp/python26-zope212-cmf22-plone40/src/Products.Archetypes/Products/Archetypes/tests/test_fields.py", line 217, in test_get_size
    dummy.processForm()
  File "/home/stefan/autotest/temp/python26-zope212-cmf22-plone40/src/Products.Archetypes/Products/Archetypes/BaseObject.py", line 658, in processForm
    REQUEST=REQUEST, values=values)
  File "/home/stefan/autotest/temp/python26-zope212-cmf22-plone40/src/Products.Archetypes/Products/Archetypes/BaseObject.py", line 648, in _processForm
    mapply(mutator, result[0], **result[1])
   - __traceback_info__: (<Dummy at /cmf/dummy>, <Field imagefield(image:rw)>, <bound method Dummy.setImagefield of <Dummy at /cmf/dummy>>)
  File "/home/stefan/autotest/temp/python26-zope212-cmf22-plone40/src/Products.Archetypes/Products/Archetypes/utils.py", line 152, in mapply
    return method(*call_args, **kw)
  File "/home/stefan/autotest/temp/python26-zope212-cmf22-plone40/src/Products.Archetypes/Products/Archetypes/ClassGen.py", line 74, in generatedMutator
    return schema[name].set(self, value, **kw)
  File "/home/stefan/autotest/temp/python26-zope212-cmf22-plone40/src/Products.Archetypes/Products/Archetypes/Field.py", line 2294, in set
    self.createScales(instance, value=data)
  File "/home/stefan/autotest/temp/python26-zope212-cmf22-plone40/src/plone.app.imaging/src/plone/app/imaging/monkey.py", line 35, in createScales
    handler = IImageScaleHandler(self)
TypeError: ('Could not adapt', <Field imagefield(image:rw)>, <InterfaceClass plone.app.imaging.interfaces.IImageScaleHandler>)



Error in test test_image_tag (Products.Archetypes.tests.test_fields.ProcessingTest)
Traceback (most recent call last):
  File "/usr/local/python2.6/lib/python2.6/unittest.py", line 279, in run
    testMethod()
  File "/home/stefan/autotest/temp/python26-zope212-cmf22-plone40/src/Products.Archetypes/Products/Archetypes/tests/test_fields.py", line 201, in test_image_tag
    dummy.processForm()
  File "/home/stefan/autotest/temp/python26-zope212-cmf22-plone40/src/Products.Archetypes/Products/Archetypes/BaseObject.py", line 658, in processForm
    REQUEST=REQUEST, values=values)
  File "/home/stefan/autotest/temp/python26-zope212-cmf22-plone40/src/Products.Archetypes/Products/Archetypes/BaseObject.py", line 648, in _processForm
    mapply(mutator, result[0], **result[1])
   - __traceback_info__: (<Dummy at /cmf/dummy>, <Field imagefield(image:rw)>, <bound method Dummy.setImagefield of <Dummy at /cmf/dummy>>)
  File "/home/stefan/autotest/temp/python26-zope212-cmf22-plone40/src/Products.Archetypes/Products/Archetypes/utils.py", line 152, in mapply
    return method(*call_args, **kw)
  File "/home/stefan/autotest/temp/python26-zope212-cmf22-plone40/src/Products.Archetypes/Products/Archetypes/ClassGen.py", line 74, in generatedMutator
    return schema[name].set(self, value, **kw)
  File "/home/stefan/autotest/temp/python26-zope212-cmf22-plone40/src/Products.Archetypes/Products/Archetypes/Field.py", line 2294, in set
    self.createScales(instance, value=data)
  File "/home/stefan/autotest/temp/python26-zope212-cmf22-plone40/src/plone.app.imaging/src/plone/app/imaging/monkey.py", line 35, in createScales
    handler = IImageScaleHandler(self)
TypeError: ('Could not adapt', <Field imagefield(image:rw)>, <InterfaceClass plone.app.imaging.interfaces.IImageScaleHandler>)



Error in test test_processing (Products.Archetypes.tests.test_fields.ProcessingTest)
Traceback (most recent call last):
  File "/usr/local/python2.6/lib/python2.6/unittest.py", line 279, in run
    testMethod()
  File "/home/stefan/autotest/temp/python26-zope212-cmf22-plone40/src/Products.Archetypes/Products/Archetypes/tests/test_fields.py", line 173, in test_processing
    dummy.processForm(data=1)
  File "/home/stefan/autotest/temp/python26-zope212-cmf22-plone40/src/Products.Archetypes/Products/Archetypes/BaseObject.py", line 658, in processForm
    REQUEST=REQUEST, values=values)
  File "/home/stefan/autotest/temp/python26-zope212-cmf22-plone40/src/Products.Archetypes/Products/Archetypes/BaseObject.py", line 648, in _processForm
    mapply(mutator, result[0], **result[1])
   - __traceback_info__: (<Dummy at /cmf/dummy>, <Field imagefield(image:rw)>, <bound method Dummy.setImagefield of <Dummy at /cmf/dummy>>)
  File "/home/stefan/autotest/temp/python26-zope212-cmf22-plone40/src/Products.Archetypes/Products/Archetypes/utils.py", line 152, in mapply
    return method(*call_args, **kw)
  File "/home/stefan/autotest/temp/python26-zope212-cmf22-plone40/src/Products.Archetypes/Products/Archetypes/ClassGen.py", line 74, in generatedMutator
    return schema[name].set(self, value, **kw)
  File "/home/stefan/autotest/temp/python26-zope212-cmf22-plone40/src/Products.Archetypes/Products/Archetypes/Field.py", line 2294, in set
    self.createScales(instance, value=data)
  File "/home/stefan/autotest/temp/python26-zope212-cmf22-plone40/src/plone.app.imaging/src/plone/app/imaging/monkey.py", line 35, in createScales
    handler = IImageScaleHandler(self)
TypeError: ('Could not adapt', <Field imagefield(image:rw)>, <InterfaceClass plone.app.imaging.interfaces.IImageScaleHandler>)



Error in test test_processing_fieldset (Products.Archetypes.tests.test_fields.ProcessingTest)
Traceback (most recent call last):
  File "/usr/local/python2.6/lib/python2.6/unittest.py", line 279, in run
    testMethod()
  File "/home/stefan/autotest/temp/python26-zope212-cmf22-plone40/src/Products.Archetypes/Products/Archetypes/tests/test_fields.py", line 187, in test_processing_fieldset
    dummy.processForm()
  File "/home/stefan/autotest/temp/python26-zope212-cmf22-plone40/src/Products.Archetypes/Products/Archetypes/BaseObject.py", line 658, in processForm
    REQUEST=REQUEST, values=values)
  File "/home/stefan/autotest/temp/python26-zope212-cmf22-plone40/src/Products.Archetypes/Products/Archetypes/BaseObject.py", line 648, in _processForm
    mapply(mutator, result[0], **result[1])
   - __traceback_info__: (<Dummy at /cmf/dummy>, <Field imagefield(image:rw)>, <bound method Dummy.setImagefield of <Dummy at /cmf/dummy>>)
  File "/home/stefan/autotest/temp/python26-zope212-cmf22-plone40/src/Products.Archetypes/Products/Archetypes/utils.py", line 152, in mapply
    return method(*call_args, **kw)
  File "/home/stefan/autotest/temp/python26-zope212-cmf22-plone40/src/Products.Archetypes/Products/Archetypes/ClassGen.py", line 74, in generatedMutator
    return schema[name].set(self, value, **kw)
  File "/home/stefan/autotest/temp/python26-zope212-cmf22-plone40/src/Products.Archetypes/Products/Archetypes/Field.py", line 2294, in set
    self.createScales(instance, value=data)
  File "/home/stefan/autotest/temp/python26-zope212-cmf22-plone40/src/plone.app.imaging/src/plone/app/imaging/monkey.py", line 35, in createScales
    handler = IImageScaleHandler(self)
TypeError: ('Could not adapt', <Field imagefield(image:rw)>, <InterfaceClass plone.app.imaging.interfaces.IImageScaleHandler>)

/home/stefan/autotest/temp/python26-zope212-cmf22-plone40/eggs/Products.CMFDefault-2.2.0-py2.6.egg/Products/CMFDefault/DublinCore.py:203: DeprecationWarning: Calls to `DateTime.ISO()` should be replaced with `DateTime.ISO8601()` to avoid implicit changes to GMT in expressions like `DateTime(obj.ModificationTime())`. Please also see http://dev.plone.org/plone/ticket/10140
  return self.creation_date.toZone(zone).ISO()
/home/stefan/autotest/temp/python26-zope212-cmf22-plone40/eggs/Products.CMFDefault-2.2.0-py2.6.egg/Products/CMFDefault/DublinCore.py:193: DeprecationWarning: Calls to `DateTime.ISO()` should be replaced with `DateTime.ISO8601()` to avoid implicit changes to GMT in expressions like `DateTime(obj.ModificationTime())`. Please also see http://dev.plone.org/plone/ticket/10140
  return date.toZone(zone).ISO()
/home/stefan/autotest/temp/python26-zope212-cmf22-plone40/eggs/Products.CMFDefault-2.2.0-py2.6.egg/Products/CMFDefault/DublinCore.py:231: DeprecationWarning: Calls to `DateTime.ISO()` should be replaced with `DateTime.ISO8601()` to avoid implicit changes to GMT in expressions like `DateTime(obj.ModificationTime())`. Please also see http://dev.plone.org/plone/ticket/10140
  return self.modified().toZone(zone).ISO()
  Ran 517 tests with 0 failures and 13 errors in 33.260 seconds.
Running Products.PloneTestCase.layer.PloneSite tests:
  Tear down Products.Archetypes.tests.layer.ArchetypesSite in 0.061 seconds.
  Tear down Products.Archetypes.tests.layer.ZCML in 0.004 seconds.
  Tear down Products.CMFCore.testing.FunctionalZCMLLayer in 0.000 seconds.
  Set up Products.PloneTestCase.layer.ZCML in 2.395 seconds.
  Set up Products.PloneTestCase.layer.PloneSite in 3.670 seconds.
/home/stefan/autotest/temp/python26-zope212-cmf22-plone40/eggs/Products.Marshall-2.0b1-py2.6.egg/Products/Marshall/namespaces/cmfns.py:332: DeprecationWarning: Calls to `DateTime.ISO()` should be replaced with `DateTime.ISO8601()` to avoid implicit changes to GMT in expressions like `DateTime(obj.ModificationTime())`. Please also see http://dev.plone.org/plone/ticket/10140
  return value.ISO(), 'date'
  Ran 9 tests with 0 failures and 0 errors in 0.976 seconds.
Running plone.app.kss.tests.kss_and_plone_layer.KSSAndPloneLayer tests:
  Set up plone.app.kss.tests.kss_and_plone_layer.KSSAndPloneLayer in 0.006 seconds.


Failure in test testVersionPreviewIsNotInlineEditable (archetypes.kss.tests.test_fields.FieldsViewTestCase)
Traceback (most recent call last):
  File "/usr/local/python2.6/lib/python2.6/unittest.py", line 279, in run
    testMethod()
  File "/home/stefan/autotest/temp/python26-zope212-cmf22-plone40/eggs/archetypes.kss-1.6.0a2-py2.6.egg/archetypes/kss/tests/test_fields.py", line 279, in testVersionPreviewIsNotInlineEditable
    self.fail("The version form doesn't contain the title anymore, see "
  File "/usr/local/python2.6/lib/python2.6/unittest.py", line 317, in fail
    raise self.failureException, msg
AssertionError: The version form doesn't contain the title anymore, see http://dev.plone.org/plone/ticket/10234.

  Ran 19 tests with 1 failures and 0 errors in 1.343 seconds.
Running zope.testing.testrunner.layer.UnitTests tests:
  Tear down plone.app.kss.tests.kss_and_plone_layer.KSSAndPloneLayer in 0.000 seconds.
  Tear down Products.PloneTestCase.layer.PloneSite in 0.334 seconds.
  Tear down Products.PloneTestCase.layer.ZCML in 0.005 seconds.
  Tear down Testing.ZopeTestCase.layer.ZopeLite in 0.000 seconds.
  Set up zope.testing.testrunner.layer.UnitTests in 0.000 seconds.
/home/stefan/autotest/temp/python26-zope212-cmf22-plone40/src/Products.Archetypes/Products/Archetypes/ClassGen.py:152: UserWarning: The method 'makeFoo' was already protected by a different permission than the one declared on the field. Assuming that the explicit permission declared is the correct one and has preference over the permission declared on the field.
  self.handle_mode(klass, generator, type, field, mode)
  Ran 28 tests with 0 failures and 0 errors in 0.177 seconds.
Tearing down left over layers:
  Tear down zope.testing.testrunner.layer.UnitTests in 0.000 seconds.
Total: 675 tests, 1 failures, 13 errors in 47.484 seconds.
Running Testing.ZopeTestCase.layer.ZopeLite tests:
  Set up Testing.ZopeTestCase.layer.ZopeLite in 0.091 seconds.
  Ran 283 tests with 0 failures and 0 errors in 1.294 seconds.
Running Products.CMFCalendar.testing.FunctionalLayer tests:
  Set up Products.CMFCore.testing.FunctionalZCMLLayer in 0.167 seconds.
  Set up Products.CMFCalendar.testing.FunctionalLayer in 0.327 seconds.
  Ran 24 tests with 0 failures and 0 errors in 1.412 seconds.
Running Products.CMFCore.testing.EventZCMLLayer tests:
  Tear down Products.CMFCalendar.testing.FunctionalLayer in 0.026 seconds.
  Tear down Products.CMFCore.testing.FunctionalZCMLLayer in 0.001 seconds.
  Set up Products.CMFCore.testing.EventZCMLLayer in 0.001 seconds.
  Ran 8 tests with 0 failures and 0 errors in 0.200 seconds.
Running Products.CMFCore.testing.ExportImportZCMLLayer tests:
  Tear down Products.CMFCore.testing.EventZCMLLayer in 0.000 seconds.
  Set up Products.CMFCore.testing.ExportImportZCMLLayer in 0.001 seconds.
  Ran 10 tests with 0 failures and 0 errors in 0.927 seconds.
Running Products.CMFCore.testing.TraversingEventZCMLLayer tests:
  Tear down Products.CMFCore.testing.ExportImportZCMLLayer in 0.000 seconds.
  Set up Products.CMFCore.testing.TraversingEventZCMLLayer in 0.001 seconds.
  Ran 5 tests with 0 failures and 0 errors in 0.159 seconds.
Running Products.CMFDefault.testing.FunctionalLayer tests:
  Tear down Products.CMFCore.testing.TraversingEventZCMLLayer in 0.000 seconds.
  Set up Products.CMFCore.testing.FunctionalZCMLLayer in 0.152 seconds.
  Set up Products.CMFDefault.testing.FunctionalLayer in 0.244 seconds.
  Ran 76 tests with 0 failures and 0 errors in 3.721 seconds.
Running Products.CMFUid.testing.UidEventZCMLLayer tests:
  Tear down Products.CMFDefault.testing.FunctionalLayer in 0.023 seconds.
  Tear down Products.CMFCore.testing.FunctionalZCMLLayer in 0.002 seconds.
  Set up Products.CMFUid.testing.UidEventZCMLLayer in 0.001 seconds.
  Ran 12 tests with 0 failures and 0 errors in 0.316 seconds.
Running Products.DCWorkflow.testing.ExportImportZCMLLayer tests:
  Tear down Products.CMFUid.testing.UidEventZCMLLayer in 0.000 seconds.
  Set up Products.DCWorkflow.testing.ExportImportZCMLLayer in 0.140 seconds.
  Ran 38 tests with 0 failures and 0 errors in 0.730 seconds.
Running Products.GenericSetup.testing.ExportImportZCMLLayer tests:
  Tear down Products.DCWorkflow.testing.ExportImportZCMLLayer in 0.000 seconds.
  Set up Products.GenericSetup.testing.ExportImportZCMLLayer in 0.081 seconds.
  Ran 190 tests with 0 failures and 0 errors in 0.587 seconds.
Running zope.testing.testrunner.layer.UnitTests tests:
  Tear down Products.GenericSetup.testing.ExportImportZCMLLayer in 0.000 seconds.
  Tear down Testing.ZopeTestCase.layer.ZopeLite in 0.000 seconds.
  Set up zope.testing.testrunner.layer.UnitTests in 0.000 seconds.
  Ran 346 tests with 0 failures and 0 errors in 0.256 seconds.
Tearing down left over layers:
  Tear down zope.testing.testrunner.layer.UnitTests in 0.000 seconds.
Total: 992 tests, 0 failures, 0 errors in 12.142 seconds.
Running Testing.ZopeTestCase.layer.ZopeLite tests:
  Set up Testing.ZopeTestCase.layer.ZopeLite in 0.921 seconds.
  Ran 27 tests with 0 failures and 0 errors in 0.056 seconds.
Running Products.PloneTestCase.layer.PloneSite tests:
  Set up Products.PloneTestCase.layer.ZCML in 2.484 seconds.
  Set up Products.PloneTestCase.layer.PloneSite in 4.780 seconds.
/home/stefan/autotest/temp/python26-zope212-cmf22-plone40/eggs/Zope2-2.12.3-py2.6-linux-x86_64.egg/OFS/subscribers.py:73: DeprecationWarning: Products.FAQ.FAQ.FAQ.manage_afterAdd is discouraged. You should use event subscribers instead.
  DeprecationWarning)
/home/stefan/autotest/temp/python26-zope212-cmf22-plone40/eggs/Zope2-2.12.3-py2.6-linux-x86_64.egg/OFS/subscribers.py:73: DeprecationWarning: Products.FAQ.FAQQuestion.FAQQuestion.manage_afterAdd is discouraged. You should use event subscribers instead.
  DeprecationWarning)
  Ran 139 tests with 0 failures and 0 errors in 21.354 seconds.
Running Products.CMFDiffTool.tests.BaseTestCase.CMFDiffToolLayer tests:
  Set up Products.CMFDiffTool.tests.BaseTestCase.CMFDiffToolLayer in 0.013 seconds.
  Ran 2 tests with 0 failures and 0 errors in 0.218 seconds.
Running Products.CMFTestCase.layer.CMFSite tests:
  Tear down Products.CMFDiffTool.tests.BaseTestCase.CMFDiffToolLayer in 0.347 seconds.
  Tear down Products.PloneTestCase.layer.PloneSite in 0.006 seconds.
  Tear down Products.PloneTestCase.layer.ZCML in 0.004 seconds.
  Set up Products.CMFTestCase.layer.ZCML in 1.786 seconds.
  Set up Products.CMFTestCase.layer.CMFSite in 1.348 seconds.
/home/stefan/autotest/temp/python26-zope212-cmf22-plone40/eggs/Products.CMFDefault-2.2.0-py2.6.egg/Products/CMFDefault/DublinCore.py:203: DeprecationWarning: Calls to `DateTime.ISO()` should be replaced with `DateTime.ISO8601()` to avoid implicit changes to GMT in expressions like `DateTime(obj.ModificationTime())`. Please also see http://dev.plone.org/plone/ticket/10140
  return self.creation_date.toZone(zone).ISO()
/home/stefan/autotest/temp/python26-zope212-cmf22-plone40/eggs/Products.CMFDefault-2.2.0-py2.6.egg/Products/CMFDefault/DublinCore.py:193: DeprecationWarning: Calls to `DateTime.ISO()` should be replaced with `DateTime.ISO8601()` to avoid implicit changes to GMT in expressions like `DateTime(obj.ModificationTime())`. Please also see http://dev.plone.org/plone/ticket/10140
  return date.toZone(zone).ISO()
/home/stefan/autotest/temp/python26-zope212-cmf22-plone40/eggs/Products.CMFDefault-2.2.0-py2.6.egg/Products/CMFDefault/DublinCore.py:231: DeprecationWarning: Calls to `DateTime.ISO()` should be replaced with `DateTime.ISO8601()` to avoid implicit changes to GMT in expressions like `DateTime(obj.ModificationTime())`. Please also see http://dev.plone.org/plone/ticket/10140
  return self.modified().toZone(zone).ISO()
  Ran 20 tests with 0 failures and 0 errors in 0.407 seconds.
Running plone.app.blob.tests.layer.BlobReplacementLayer tests:
  Tear down Products.CMFTestCase.layer.CMFSite in 0.064 seconds.
  Tear down Products.CMFTestCase.layer.ZCML in 0.003 seconds.
  Set up Products.PloneTestCase.layer.ZCML in 1.780 seconds.
  Set up Products.PloneTestCase.layer.PloneSite in 3.945 seconds.
  Set up plone.app.blob.tests.layer.BlobLayer in 0.092 seconds.
  Set up plone.app.blob.tests.layer.BlobReplacementLayer in 0.195 seconds.
  Ran 6 tests with 0 failures and 0 errors in 1.788 seconds.
Running zope.testing.testrunner.layer.UnitTests tests:
  Tear down plone.app.blob.tests.layer.BlobReplacementLayer in 0.000 seconds.
  Tear down plone.app.blob.tests.layer.BlobLayer in 0.000 seconds.
  Tear down Products.PloneTestCase.layer.PloneSite in 0.360 seconds.
  Tear down Products.PloneTestCase.layer.ZCML in 0.004 seconds.
  Tear down Testing.ZopeTestCase.layer.ZopeLite in 0.000 seconds.
  Set up zope.testing.testrunner.layer.UnitTests in 0.000 seconds.
  Ran 10 tests with 0 failures and 0 errors in 0.005 seconds.
Tearing down left over layers:
  Tear down zope.testing.testrunner.layer.UnitTests in 0.000 seconds.
Total: 204 tests, 0 failures, 0 errors in 43.206 seconds.
Running Testing.ZopeTestCase.layer.ZopeLite tests:
  Set up Testing.ZopeTestCase.layer.ZopeLite in 0.564 seconds.
  Ran 126 tests with 0 failures and 0 errors in 0.758 seconds.
Running Products.CMFTestCase.layer.CMFSite tests:
  Set up Products.CMFTestCase.layer.ZCML in 2.360 seconds.
  Set up Products.CMFTestCase.layer.CMFSite in 0.235 seconds.
/home/stefan/autotest/temp/python26-zope212-cmf22-plone40/eggs/Products.CMFDefault-2.2.0-py2.6.egg/Products/CMFDefault/DublinCore.py:203: DeprecationWarning: Calls to `DateTime.ISO()` should be replaced with `DateTime.ISO8601()` to avoid implicit changes to GMT in expressions like `DateTime(obj.ModificationTime())`. Please also see http://dev.plone.org/plone/ticket/10140
  return self.creation_date.toZone(zone).ISO()
/home/stefan/autotest/temp/python26-zope212-cmf22-plone40/eggs/Products.CMFDefault-2.2.0-py2.6.egg/Products/CMFDefault/DublinCore.py:193: DeprecationWarning: Calls to `DateTime.ISO()` should be replaced with `DateTime.ISO8601()` to avoid implicit changes to GMT in expressions like `DateTime(obj.ModificationTime())`. Please also see http://dev.plone.org/plone/ticket/10140
  return date.toZone(zone).ISO()
/home/stefan/autotest/temp/python26-zope212-cmf22-plone40/eggs/Products.CMFDefault-2.2.0-py2.6.egg/Products/CMFDefault/DublinCore.py:231: DeprecationWarning: Calls to `DateTime.ISO()` should be replaced with `DateTime.ISO8601()` to avoid implicit changes to GMT in expressions like `DateTime(obj.ModificationTime())`. Please also see http://dev.plone.org/plone/ticket/10140
  return self.modified().toZone(zone).ISO()
  Ran 58 tests with 0 failures and 0 errors in 1.873 seconds.
Running Products.PloneTestCase.layer.ZCML tests:
  Tear down Products.CMFTestCase.layer.CMFSite in 0.039 seconds.
  Tear down Products.CMFTestCase.layer.ZCML in 0.004 seconds.
  Set up Products.PloneTestCase.layer.ZCML in 1.812 seconds.
  Ran 12 tests with 0 failures and 0 errors in 0.016 seconds.
Running Products.PloneTestCase.layer.PloneSite tests:
  Set up Products.PloneTestCase.layer.PloneSite in 3.929 seconds.
/home/stefan/autotest/temp/python26-zope212-cmf22-plone40/eggs/Products.PortalTransforms-2.0b4-py2.6.egg/Products/PortalTransforms/libtransforms/commandtransform.py:97: DeprecationWarning: os.popen4 is deprecated.  Use the subprocess module.
  cin, couterr = os.popen4(command, 'b')


Failure in test /home/stefan/autotest/temp/python26-zope212-cmf22-plone40/src/Plone/Products/CMFPlone/tests/emaillogin.txt
Failed doctest test for emaillogin.txt
  File "/home/stefan/autotest/temp/python26-zope212-cmf22-plone40/src/Plone/Products/CMFPlone/tests/emaillogin.txt", line 0

----------------------------------------------------------------------
File "/home/stefan/autotest/temp/python26-zope212-cmf22-plone40/src/Plone/Products/CMFPlone/tests/emaillogin.txt", line 153, in emaillogin.txt
Failed example:
    browser.getControl('E-mail').value = 'email2 at example.org'
Exception raised:
    Traceback (most recent call last):
      File "/home/stefan/autotest/temp/python26-zope212-cmf22-plone40/eggs/zope.testing-3.7.7-py2.6.egg/zope/testing/doctest.py", line 1361, in __run
        compileflags, 1) in test.globs
      File "<doctest emaillogin.txt[line 153, example 70]>", line 1, in <module>
        browser.getControl('E-mail').value = 'email2 at example.org'
      File "/home/stefan/autotest/temp/python26-zope212-cmf22-plone40/eggs/zope.testbrowser-3.6.0a2-py2.6.egg/zope/testbrowser/browser.py", line 366, in getControl
        control, form = disambiguate(intermediate, msg, index)
      File "/home/stefan/autotest/temp/python26-zope212-cmf22-plone40/eggs/zope.testbrowser-3.6.0a2-py2.6.egg/zope/testbrowser/browser.py", line 54, in disambiguate
        raise LookupError(msg)
    LookupError: label 'E-mail'
----------------------------------------------------------------------
File "/home/stefan/autotest/temp/python26-zope212-cmf22-plone40/src/Plone/Products/CMFPlone/tests/emaillogin.txt", line 156, in emaillogin.txt
Failed example:
    browser.getControl('E-mail').value
Exception raised:
    Traceback (most recent call last):
      File "/home/stefan/autotest/temp/python26-zope212-cmf22-plone40/eggs/zope.testing-3.7.7-py2.6.egg/zope/testing/doctest.py", line 1361, in __run
        compileflags, 1) in test.globs
      File "<doctest emaillogin.txt[line 156, example 73]>", line 1, in <module>
        browser.getControl('E-mail').value
      File "/home/stefan/autotest/temp/python26-zope212-cmf22-plone40/eggs/zope.testbrowser-3.6.0a2-py2.6.egg/zope/testbrowser/browser.py", line 366, in getControl
        control, form = disambiguate(intermediate, msg, index)
      File "/home/stefan/autotest/temp/python26-zope212-cmf22-plone40/eggs/zope.testbrowser-3.6.0a2-py2.6.egg/zope/testbrowser/browser.py", line 54, in disambiguate
        raise LookupError(msg)
    LookupError: label 'E-mail'
----------------------------------------------------------------------
File "/home/stefan/autotest/temp/python26-zope212-cmf22-plone40/src/Plone/Products/CMFPlone/tests/emaillogin.txt", line 178, in emaillogin.txt
Failed example:
    self.failIf('Log in' in browser.contents)
Exception raised:
    Traceback (most recent call last):
      File "/home/stefan/autotest/temp/python26-zope212-cmf22-plone40/eggs/zope.testing-3.7.7-py2.6.egg/zope/testing/doctest.py", line 1361, in __run
        compileflags, 1) in test.globs
      File "<doctest emaillogin.txt[line 178, example 86]>", line 1, in <module>
        self.failIf('Log in' in browser.contents)
      File "/usr/local/python2.6/lib/python2.6/unittest.py", line 321, in failIf
        if expr: raise self.failureException, msg
    AssertionError
----------------------------------------------------------------------
File "/home/stefan/autotest/temp/python26-zope212-cmf22-plone40/src/Plone/Products/CMFPlone/tests/emaillogin.txt", line 184, in emaillogin.txt
Failed example:
    browser.getControl('Save').click()
Exception raised:
    Traceback (most recent call last):
      File "/home/stefan/autotest/temp/python26-zope212-cmf22-plone40/eggs/zope.testing-3.7.7-py2.6.egg/zope/testing/doctest.py", line 1361, in __run
        compileflags, 1) in test.globs
      File "<doctest emaillogin.txt[line 184, example 89]>", line 1, in <module>
        browser.getControl('Save').click()
      File "/home/stefan/autotest/temp/python26-zope212-cmf22-plone40/eggs/zope.testbrowser-3.6.0a2-py2.6.egg/zope/testbrowser/browser.py", line 366, in getControl
        control, form = disambiguate(intermediate, msg, index)
      File "/home/stefan/autotest/temp/python26-zope212-cmf22-plone40/eggs/zope.testbrowser-3.6.0a2-py2.6.egg/zope/testbrowser/browser.py", line 54, in disambiguate
        raise LookupError(msg)
    LookupError: label 'Save'
----------------------------------------------------------------------
File "/home/stefan/autotest/temp/python26-zope212-cmf22-plone40/src/Plone/Products/CMFPlone/tests/emaillogin.txt", line 207, in emaillogin.txt
Failed example:
    self.failUnless('Password reset confirmation sent' in browser.contents)
Exception raised:
    Traceback (most recent call last):
      File "/home/stefan/autotest/temp/python26-zope212-cmf22-plone40/eggs/zope.testing-3.7.7-py2.6.egg/zope/testing/doctest.py", line 1361, in __run
        compileflags, 1) in test.globs
      File "<doctest emaillogin.txt[line 207, example 99]>", line 1, in <module>
        self.failUnless('Password reset confirmation sent' in browser.contents)
      File "/usr/local/python2.6/lib/python2.6/unittest.py", line 325, in failUnless
        if not expr: raise self.failureException, msg
    AssertionError
----------------------------------------------------------------------
File "/home/stefan/autotest/temp/python26-zope212-cmf22-plone40/src/Plone/Products/CMFPlone/tests/emaillogin.txt", line 214, in emaillogin.txt
Failed example:
    len(mailhost.messages)
Expected:
    1
Got:
    0
----------------------------------------------------------------------
File "/home/stefan/autotest/temp/python26-zope212-cmf22-plone40/src/Plone/Products/CMFPlone/tests/emaillogin.txt", line 216, in emaillogin.txt
Failed example:
    msg = mailhost.messages[0]
Exception raised:
    Traceback (most recent call last):
      File "/home/stefan/autotest/temp/python26-zope212-cmf22-plone40/eggs/zope.testing-3.7.7-py2.6.egg/zope/testing/doctest.py", line 1361, in __run
        compileflags, 1) in test.globs
      File "<doctest emaillogin.txt[line 216, example 102]>", line 1, in <module>
        msg = mailhost.messages[0]
      File "/usr/local/python2.6/lib/python2.6/UserList.py", line 31, in __getitem__
        def __getitem__(self, i): return self.data[i]
    IndexError: list index out of range
----------------------------------------------------------------------
File "/home/stefan/autotest/temp/python26-zope212-cmf22-plone40/src/Plone/Products/CMFPlone/tests/emaillogin.txt", line 221, in emaillogin.txt
Failed example:
    "To: email2 at example.org" in msg
Exception raised:
    Traceback (most recent call last):
      File "/home/stefan/autotest/temp/python26-zope212-cmf22-plone40/eggs/zope.testing-3.7.7-py2.6.egg/zope/testing/doctest.py", line 1361, in __run
        compileflags, 1) in test.globs
      File "<doctest emaillogin.txt[line 221, example 103]>", line 1, in <module>
        "To: email2 at example.org" in msg
    NameError: name 'msg' is not defined
----------------------------------------------------------------------
File "/home/stefan/autotest/temp/python26-zope212-cmf22-plone40/src/Plone/Products/CMFPlone/tests/emaillogin.txt", line 226, in emaillogin.txt
Failed example:
    url_index = msg.index('http://nohost/plone/passwordreset/')
Exception raised:
    Traceback (most recent call last):
      File "/home/stefan/autotest/temp/python26-zope212-cmf22-plone40/eggs/zope.testing-3.7.7-py2.6.egg/zope/testing/doctest.py", line 1361, in __run
        compileflags, 1) in test.globs
      File "<doctest emaillogin.txt[line 226, example 104]>", line 1, in <module>
        url_index = msg.index('http://nohost/plone/passwordreset/')
    NameError: name 'msg' is not defined
----------------------------------------------------------------------
File "/home/stefan/autotest/temp/python26-zope212-cmf22-plone40/src/Plone/Products/CMFPlone/tests/emaillogin.txt", line 227, in emaillogin.txt
Failed example:
    address = msg[url_index:].split()[0]
Exception raised:
    Traceback (most recent call last):
      File "/home/stefan/autotest/temp/python26-zope212-cmf22-plone40/eggs/zope.testing-3.7.7-py2.6.egg/zope/testing/doctest.py", line 1361, in __run
        compileflags, 1) in test.globs
      File "<doctest emaillogin.txt[line 227, example 105]>", line 1, in <module>
        address = msg[url_index:].split()[0]
    NameError: name 'msg' is not defined
----------------------------------------------------------------------
File "/home/stefan/autotest/temp/python26-zope212-cmf22-plone40/src/Plone/Products/CMFPlone/tests/emaillogin.txt", line 231, in emaillogin.txt
Failed example:
    browser.open(address)
Exception raised:
    Traceback (most recent call last):
      File "/home/stefan/autotest/temp/python26-zope212-cmf22-plone40/eggs/zope.testing-3.7.7-py2.6.egg/zope/testing/doctest.py", line 1361, in __run
        compileflags, 1) in test.globs
      File "<doctest emaillogin.txt[line 231, example 106]>", line 1, in <module>
        browser.open(address)
    NameError: name 'address' is not defined
----------------------------------------------------------------------
File "/home/stefan/autotest/temp/python26-zope212-cmf22-plone40/src/Plone/Products/CMFPlone/tests/emaillogin.txt", line 232, in emaillogin.txt
Failed example:
    "Set your password" in browser.contents
Expected:
    True
Got:
    False
----------------------------------------------------------------------
File "/home/stefan/autotest/temp/python26-zope212-cmf22-plone40/src/Plone/Products/CMFPlone/tests/emaillogin.txt", line 234, in emaillogin.txt
Failed example:
    form = browser.getForm(name='pwreset_action')
Exception raised:
    Traceback (most recent call last):
      File "/home/stefan/autotest/temp/python26-zope212-cmf22-plone40/eggs/zope.testing-3.7.7-py2.6.egg/zope/testing/doctest.py", line 1361, in __run
        compileflags, 1) in test.globs
      File "<doctest emaillogin.txt[line 234, example 108]>", line 1, in <module>
        form = browser.getForm(name='pwreset_action')
      File "/home/stefan/autotest/temp/python26-zope212-cmf22-plone40/eggs/zope.testbrowser-3.6.0a2-py2.6.egg/zope/testbrowser/browser.py", line 398, in getForm
        form = disambiguate(matching_forms, '', index)
      File "/home/stefan/autotest/temp/python26-zope212-cmf22-plone40/eggs/zope.testbrowser-3.6.0a2-py2.6.egg/zope/testbrowser/browser.py", line 54, in disambiguate
        raise LookupError(msg)
    LookupError
----------------------------------------------------------------------
File "/home/stefan/autotest/temp/python26-zope212-cmf22-plone40/src/Plone/Products/CMFPlone/tests/emaillogin.txt", line 235, in emaillogin.txt
Failed example:
    form.getControl(name='userid').value = 'email2 at example.org'
Exception raised:
    Traceback (most recent call last):
      File "/home/stefan/autotest/temp/python26-zope212-cmf22-plone40/eggs/zope.testing-3.7.7-py2.6.egg/zope/testing/doctest.py", line 1361, in __run
        compileflags, 1) in test.globs
      File "<doctest emaillogin.txt[line 235, example 109]>", line 1, in <module>
        form.getControl(name='userid').value = 'email2 at example.org'
      File "/home/stefan/autotest/temp/python26-zope212-cmf22-plone40/eggs/zope.testbrowser-3.6.0a2-py2.6.egg/zope/testbrowser/browser.py", line 752, in getControl
        raise zope.testbrowser.interfaces.ExpiredError
    ExpiredError
----------------------------------------------------------------------
File "/home/stefan/autotest/temp/python26-zope212-cmf22-plone40/src/Plone/Products/CMFPlone/tests/emaillogin.txt", line 236, in emaillogin.txt
Failed example:
    form.getControl(name='password').value = 'secretion'
Exception raised:
    Traceback (most recent call last):
      File "/home/stefan/autotest/temp/python26-zope212-cmf22-plone40/eggs/zope.testing-3.7.7-py2.6.egg/zope/testing/doctest.py", line 1361, in __run
        compileflags, 1) in test.globs
      File "<doctest emaillogin.txt[line 236, example 110]>", line 1, in <module>
        form.getControl(name='password').value = 'secretion'
      File "/home/stefan/autotest/temp/python26-zope212-cmf22-plone40/eggs/zope.testbrowser-3.6.0a2-py2.6.egg/zope/testbrowser/browser.py", line 752, in getControl
        raise zope.testbrowser.interfaces.ExpiredError
    ExpiredError
----------------------------------------------------------------------
File "/home/stefan/autotest/temp/python26-zope212-cmf22-plone40/src/Plone/Products/CMFPlone/tests/emaillogin.txt", line 237, in emaillogin.txt
Failed example:
    form.getControl(name='password2').value = 'secretion'
Exception raised:
    Traceback (most recent call last):
      File "/home/stefan/autotest/temp/python26-zope212-cmf22-plone40/eggs/zope.testing-3.7.7-py2.6.egg/zope/testing/doctest.py", line 1361, in __run
        compileflags, 1) in test.globs
      File "<doctest emaillogin.txt[line 237, example 111]>", line 1, in <module>
        form.getControl(name='password2').value = 'secretion'
      File "/home/stefan/autotest/temp/python26-zope212-cmf22-plone40/eggs/zope.testbrowser-3.6.0a2-py2.6.egg/zope/testbrowser/browser.py", line 752, in getControl
        raise zope.testbrowser.interfaces.ExpiredError
    ExpiredError
----------------------------------------------------------------------
File "/home/stefan/autotest/temp/python26-zope212-cmf22-plone40/src/Plone/Products/CMFPlone/tests/emaillogin.txt", line 238, in emaillogin.txt
Failed example:
    form.submit()
Exception raised:
    Traceback (most recent call last):
      File "/home/stefan/autotest/temp/python26-zope212-cmf22-plone40/eggs/zope.testing-3.7.7-py2.6.egg/zope/testing/doctest.py", line 1361, in __run
        compileflags, 1) in test.globs
      File "<doctest emaillogin.txt[line 238, example 112]>", line 1, in <module>
        form.submit()
      File "/home/stefan/autotest/temp/python26-zope212-cmf22-plone40/eggs/zope.testbrowser-3.6.0a2-py2.6.egg/zope/testbrowser/browser.py", line 729, in submit
        raise zope.testbrowser.interfaces.ExpiredError
    ExpiredError
----------------------------------------------------------------------
File "/home/stefan/autotest/temp/python26-zope212-cmf22-plone40/src/Plone/Products/CMFPlone/tests/emaillogin.txt", line 239, in emaillogin.txt
Failed example:
    "Your password has been set successfully." in browser.contents
Expected:
    True
Got:
    False
----------------------------------------------------------------------
File "/home/stefan/autotest/temp/python26-zope212-cmf22-plone40/src/Plone/Products/CMFPlone/tests/emaillogin.txt", line 249, in emaillogin.txt
Failed example:
    self.failIf('Log in' in browser.contents)
Exception raised:
    Traceback (most recent call last):
      File "/home/stefan/autotest/temp/python26-zope212-cmf22-plone40/eggs/zope.testing-3.7.7-py2.6.egg/zope/testing/doctest.py", line 1361, in __run
        compileflags, 1) in test.globs
      File "<doctest emaillogin.txt[line 249, example 119]>", line 1, in <module>
        self.failIf('Log in' in browser.contents)
      File "/usr/local/python2.6/lib/python2.6/unittest.py", line 321, in failIf
        if expr: raise self.failureException, msg
    AssertionError
----------------------------------------------------------------------
File "/home/stefan/autotest/temp/python26-zope212-cmf22-plone40/src/Plone/Products/CMFPlone/tests/emaillogin.txt", line 262, in emaillogin.txt
Failed example:
    len(mailhost.messages)
Expected:
    2
Got:
    1

/home/stefan/autotest/temp/python26-zope212-cmf22-plone40/eggs/Zope2-2.12.3-py2.6-linux-x86_64.egg/Products/PageTemplates/Expressions.py:119: DeprecationWarning: Calls to `DateTime.ISO()` should be replaced with `DateTime.ISO8601()` to avoid implicit changes to GMT in expressions like `DateTime(obj.ModificationTime())`. Please also see http://dev.plone.org/plone/ticket/10140
  ob = ob()
  Ran 1842 tests with 1 failures and 0 errors in 3 minutes 41.082 seconds.
Running plone.app.contentrules.tests.test_configuration.TestContentrulesGSLayer tests:
  Set up plone.app.contentrules.tests.test_configuration.TestContentrulesGSLayer in 0.002 seconds.
  Ran 6 tests with 0 failures and 0 errors in 2.420 seconds.
Running plone.app.customerize.tests.layer.PloneCustomerize tests:
  Tear down plone.app.contentrules.tests.test_configuration.TestContentrulesGSLayer in 0.000 seconds.
  Set up plone.app.customerize.tests.layer.PloneCustomerize in 0.000 seconds.
  Ran 27 tests with 0 failures and 0 errors in 2.615 seconds.
Running plone.app.kss.tests.kss_and_plone_layer.KSSAndPloneLayer tests:
  Tear down plone.app.customerize.tests.layer.PloneCustomerize in 0.000 seconds.
  Set up plone.app.kss.tests.kss_and_plone_layer.KSSAndPloneLayer in 0.004 seconds.
  Ran 13 tests with 0 failures and 0 errors in 1.141 seconds.
Running plone.app.upgrade.tests.base.FunctionalUpgradeLayer tests:
  Tear down plone.app.kss.tests.kss_and_plone_layer.KSSAndPloneLayer in 0.000 seconds.
  Set up plone.app.upgrade.tests.base.FunctionalUpgradeLayer in 0.000 seconds.
  Ran 11 tests with 0 failures and 0 errors in 56.187 seconds.
Running plone.app.viewletmanager.tests.test_exportimport.Layer tests:
  Tear down plone.app.upgrade.tests.base.FunctionalUpgradeLayer in 0.000 seconds.
  Tear down Products.PloneTestCase.layer.PloneSite in 0.363 seconds.
  Tear down Products.PloneTestCase.layer.ZCML in 0.014 seconds.
  Tear down Testing.ZopeTestCase.layer.ZopeLite in 0.000 seconds.
  Set up plone.app.viewletmanager.tests.test_exportimport.Layer in 0.000 seconds.
  Ran 16 tests with 0 failures and 0 errors in 0.050 seconds.
Running zope.testing.testrunner.layer.UnitTests tests:
  Tear down plone.app.viewletmanager.tests.test_exportimport.Layer in 0.000 seconds.
  Set up zope.testing.testrunner.layer.UnitTests in 0.000 seconds.
  Ran 145 tests with 0 failures and 0 errors in 0.873 seconds.
Tearing down left over layers:
  Tear down zope.testing.testrunner.layer.UnitTests in 0.000 seconds.
Total: 2256 tests, 1 failures, 0 errors in 4 minutes 59.969 seconds.
Running Testing.ZopeTestCase.layer.ZopeLite tests:
  Set up Testing.ZopeTestCase.layer.ZopeLite in 1.447 seconds.
  Ran 165 tests with 0 failures and 0 errors in 0.631 seconds.
Running Products.PloneTestCase.layer.ZCML tests:
  Set up Products.PloneTestCase.layer.ZCML in 2.407 seconds.
  Ran 27 tests with 0 failures and 0 errors in 0.200 seconds.
Running Products.PlonePAS.tests.layer.PlonePASLayer tests:
  Set up Products.PloneTestCase.layer.PloneSite in 3.645 seconds.
  Set up Products.PlonePAS.tests.layer.PlonePASLayer in 0.000 seconds.
  Ran 153 tests with 0 failures and 0 errors in 2.046 seconds.
Running zope.testing.testrunner.layer.UnitTests tests:
  Tear down Products.PlonePAS.tests.layer.PlonePASLayer in 0.000 seconds.
  Tear down Products.PloneTestCase.layer.PloneSite in 0.331 seconds.
  Tear down Products.PloneTestCase.layer.ZCML in 0.004 seconds.
  Tear down Testing.ZopeTestCase.layer.ZopeLite in 0.000 seconds.
  Set up zope.testing.testrunner.layer.UnitTests in 0.000 seconds.
  Ran 349 tests with 0 failures and 0 errors in 0.767 seconds.
Tearing down left over layers:
  Tear down zope.testing.testrunner.layer.UnitTests in 0.000 seconds.
Total: 694 tests, 0 failures, 0 errors in 12.257 seconds.
Running Products.PloneTestCase.layer.PloneSite tests:
  Set up Testing.ZopeTestCase.layer.ZopeLite in 1.392 seconds.
  Set up Products.PloneTestCase.layer.ZCML in 2.468 seconds.
  Set up Products.PloneTestCase.layer.PloneSite in 4.107 seconds.
/home/stefan/autotest/temp/python26-zope212-cmf22-plone40/eggs/borg.localrole-3.0a1-py2.6.egg/borg/localrole/bbb/bbb.txt:1: DeprecationWarning: IWorkspace is deprecated. Please use borg.localrole.interfaces.ILocalRoleProvider instead
  =========
/home/stefan/autotest/temp/python26-zope212-cmf22-plone40/eggs/borg.localrole-3.0a1-py2.6.egg/borg/localrole/bbb/bbb.txt:1: DeprecationWarning: IGroupAwareWorkspace is deprecated. Please use borg.localrole.interfaces.ILocalRoleProvider instead
  =========
  Ran 39 tests with 0 failures and 0 errors in 0.199 seconds.
Running plone.browserlayer.tests.test_doctest.PloneBrowserLayerLayer tests:
  Set up plone.browserlayer.tests.test_doctest.PloneBrowserLayerLayer in 0.003 seconds.
  Ran 9 tests with 0 failures and 0 errors in 0.656 seconds.
Running plone.theme.tests.test_doctest.PloneThemeLayer tests:
  Tear down plone.browserlayer.tests.test_doctest.PloneBrowserLayerLayer in 0.000 seconds.
  Set up plone.theme.tests.test_doctest.PloneThemeLayer in 0.003 seconds.
  Ran 5 tests with 0 failures and 0 errors in 0.044 seconds.
Running zope.testing.testrunner.layer.UnitTests tests:
  Tear down plone.theme.tests.test_doctest.PloneThemeLayer in 0.000 seconds.
  Tear down Products.PloneTestCase.layer.PloneSite in 0.326 seconds.
  Tear down Products.PloneTestCase.layer.ZCML in 0.004 seconds.
  Tear down Testing.ZopeTestCase.layer.ZopeLite in 0.000 seconds.
  Set up zope.testing.testrunner.layer.UnitTests in 0.000 seconds.
/usr/local/python2.6/lib/python2.6/mhlib.py:83: DeprecationWarning: the multifile module has been deprecated since Python 2.5
  import multifile
  Ran 252 tests with 0 failures and 0 errors in 0.893 seconds.
Tearing down left over layers:
  Tear down zope.testing.testrunner.layer.UnitTests in 0.000 seconds.
Total: 305 tests, 0 failures, 0 errors in 10.993 seconds.
Running Products.PloneTestCase.layer.PloneSite tests:
  Set up Testing.ZopeTestCase.layer.ZopeLite in 0.935 seconds.
  Set up Products.PloneTestCase.layer.ZCML in 2.583 seconds.
  Set up Products.PloneTestCase.layer.PloneSite in 3.962 seconds.
/usr/local/python2.6/lib/python2.6/unittest.py:279: DeprecationWarning: The use of 'hide' has been deprecated and will be removed in plone.portlet.static 2.0. Instead, use the new generic built-in show/hide setting of plone.portlets.
  testMethod()
  Ran 165 tests with 0 failures and 0 errors in 14.961 seconds.
Running plone.app.portlets.tests.test_configuration.TestPortletZCMLLayer tests:
  Set up plone.app.portlets.tests.test_configuration.TestPortletZCMLLayer in 0.006 seconds.
  Ran 5 tests with 0 failures and 0 errors in 0.042 seconds.
Running plone.app.portlets.tests.test_configuration.TestPortletGSLayer tests:
  Set up plone.app.portlets.tests.test_configuration.TestPortletGSLayer in 1.353 seconds.
  Ran 13 tests with 0 failures and 0 errors in 3.713 seconds.
Running zope.testing.testrunner.layer.UnitTests tests:
  Tear down plone.app.portlets.tests.test_configuration.TestPortletGSLayer in 0.000 seconds.
  Tear down plone.app.portlets.tests.test_configuration.TestPortletZCMLLayer in 0.000 seconds.
  Tear down Products.PloneTestCase.layer.PloneSite in 0.340 seconds.
  Tear down Products.PloneTestCase.layer.ZCML in 0.005 seconds.
  Tear down Testing.ZopeTestCase.layer.ZopeLite in 0.000 seconds.
  Set up zope.testing.testrunner.layer.UnitTests in 0.000 seconds.
  Ran 57 tests with 0 failures and 0 errors in 0.149 seconds.
Tearing down left over layers:
  Tear down zope.testing.testrunner.layer.UnitTests in 0.000 seconds.
Total: 240 tests, 0 failures, 0 errors in 28.892 seconds.
Running zope.testing.testrunner.layer.UnitTests tests:
  Set up zope.testing.testrunner.layer.UnitTests in 0.000 seconds.
  Ran 3 tests with 0 failures and 0 errors in 12.672 seconds.
Tearing down left over layers:
  Tear down zope.testing.testrunner.layer.UnitTests in 0.000 seconds.
Running Products.PloneTestCase.layer.PloneSite tests:
  Set up Testing.ZopeTestCase.layer.ZopeLite in 0.000 seconds.
  Set up Products.PloneTestCase.layer.ZCML in 1.881 seconds.
  Set up Products.PloneTestCase.layer.PloneSite in 4.513 seconds.
  Ran 23 tests with 0 failures and 0 errors in 2.732 seconds.
Running Products.CMFPlacefulWorkflow.tests.test_exportimport.ExportImportLayer tests:
  Set up Products.CMFPlacefulWorkflow.tests.test_exportimport.ExportImportLayer in 0.001 seconds.
  Ran 12 tests with 0 failures and 0 errors in 0.907 seconds.
Tearing down left over layers:
  Tear down Products.CMFPlacefulWorkflow.tests.test_exportimport.ExportImportLayer in 0.000 seconds.
  Tear down Products.PloneTestCase.layer.PloneSite in 0.339 seconds.
  Tear down Products.PloneTestCase.layer.ZCML in 0.004 seconds.
  Tear down Testing.ZopeTestCase.layer.ZopeLite in 0.000 seconds.
Total: 35 tests, 0 failures, 0 errors in 10.820 seconds.
Running Products.CMFTestCase.layer.CMFSite tests:
  Set up Testing.ZopeTestCase.layer.ZopeLite in 0.229 seconds.
  Set up Products.CMFTestCase.layer.ZCML in 0.369 seconds.
  Set up Products.CMFTestCase.layer.CMFSite in 0.210 seconds.
  Ran 58 tests with 0 failures and 0 errors in 0.226 seconds.
Tearing down left over layers:
  Tear down Products.CMFTestCase.layer.CMFSite in 0.025 seconds.
  Tear down Products.CMFTestCase.layer.ZCML in 0.001 seconds.
  Tear down Testing.ZopeTestCase.layer.ZopeLite in 0.000 seconds.
Running zope.testing.testrunner.layer.UnitTests tests:
  Set up zope.testing.testrunner.layer.UnitTests in 0.000 seconds.
  Ran 35 tests with 0 failures and 0 errors in 0.027 seconds.
Tearing down left over layers:
  Tear down zope.testing.testrunner.layer.UnitTests in 0.000 seconds.
Running Products.PloneTestCase.layer.PloneSite tests:
  Set up Testing.ZopeTestCase.layer.ZopeLite in 1.363 seconds.
  Set up Products.PloneTestCase.layer.ZCML in 2.515 seconds.
  Set up Products.PloneTestCase.layer.PloneSite in 3.981 seconds.
  Ran 38 tests with 0 failures and 0 errors in 3.976 seconds.
Tearing down left over layers:
  Tear down Products.PloneTestCase.layer.PloneSite in 0.338 seconds.
  Tear down Products.PloneTestCase.layer.ZCML in 0.006 seconds.
  Tear down Testing.ZopeTestCase.layer.ZopeLite in 0.000 seconds.
Running Products.PloneTestCase.layer.PloneSite tests:
  Set up Testing.ZopeTestCase.layer.ZopeLite in 1.441 seconds.
  Set up Products.PloneTestCase.layer.ZCML in 2.466 seconds.
  Set up Products.PloneTestCase.layer.PloneSite in 3.883 seconds.
/home/stefan/autotest/temp/python26-zope212-cmf22-plone40/eggs/Products.PlonePAS-4.0b6-py2.6.egg/Products/PlonePAS/tools/membership.py:553: DeprecationWarning: credentialsChanged should be called with 'REQUEST' as second argument. The BBB code will be removed in CMF 2.3.
  self.credentialsChanged(password, REQUEST=REQUEST)
  Ran 61 tests with 0 failures and 0 errors in 1.289 seconds.
Tearing down left over layers:
  Tear down Products.PloneTestCase.layer.PloneSite in 0.336 seconds.
  Tear down Products.PloneTestCase.layer.ZCML in 0.004 seconds.
  Tear down Testing.ZopeTestCase.layer.ZopeLite in 0.000 seconds.
Running Products.PloneTestCase.layer.PloneSite tests:
  Set up Testing.ZopeTestCase.layer.ZopeLite in 1.418 seconds.
  Set up Products.PloneTestCase.layer.ZCML in 2.469 seconds.
  Set up Products.PloneTestCase.layer.PloneSite in 3.989 seconds.
  Ran 245 tests with 0 failures and 0 errors in 15.247 seconds.
Running zope.testing.testrunner.layer.UnitTests tests:
  Tear down Products.PloneTestCase.layer.PloneSite in 0.344 seconds.
  Tear down Products.PloneTestCase.layer.ZCML in 0.004 seconds.
  Tear down Testing.ZopeTestCase.layer.ZopeLite in 0.000 seconds.
  Set up zope.testing.testrunner.layer.UnitTests in 0.000 seconds.
  Ran 59 tests with 0 failures and 0 errors in 0.012 seconds.
Tearing down left over layers:
  Tear down zope.testing.testrunner.layer.UnitTests in 0.000 seconds.
Total: 304 tests, 0 failures, 0 errors in 23.912 seconds.
Running Products.PloneTestCase.layer.PloneSite tests:
  Set up Testing.ZopeTestCase.layer.ZopeLite in 1.408 seconds.
  Set up Products.PloneTestCase.layer.ZCML in 2.470 seconds.
  Set up Products.PloneTestCase.layer.PloneSite in 3.843 seconds.
  Ran 79 tests with 0 failures and 0 errors in 2.676 seconds.
Tearing down left over layers:
  Tear down Products.PloneTestCase.layer.PloneSite in 0.333 seconds.
  Tear down Products.PloneTestCase.layer.ZCML in 0.006 seconds.
  Tear down Testing.ZopeTestCase.layer.ZopeLite in 0.000 seconds.
Running zope.testing.testrunner.layer.UnitTests tests:
  Set up zope.testing.testrunner.layer.UnitTests in 0.000 seconds.
  Ran 76 tests with 0 failures and 0 errors in 1.582 seconds.
Tearing down left over layers:
  Tear down zope.testing.testrunner.layer.UnitTests in 0.000 seconds.
Running Products.contentmigration.tests.layer.TestLayer tests:
  Set up Testing.ZopeTestCase.layer.ZopeLite in 1.418 seconds.
  Set up Products.PloneTestCase.layer.ZCML in 2.629 seconds.
  Set up Products.PloneTestCase.layer.PloneSite in 3.877 seconds.
  Set up Products.contentmigration.tests.layer.TestLayer in 0.002 seconds.
/home/stefan/autotest/temp/python26-zope212-cmf22-plone40/eggs/Products.CMFDefault-2.2.0-py2.6.egg/Products/CMFDefault/DublinCore.py:203: DeprecationWarning: Calls to `DateTime.ISO()` should be replaced with `DateTime.ISO8601()` to avoid implicit changes to GMT in expressions like `DateTime(obj.ModificationTime())`. Please also see http://dev.plone.org/plone/ticket/10140
  return self.creation_date.toZone(zone).ISO()
/home/stefan/autotest/temp/python26-zope212-cmf22-plone40/eggs/Products.CMFDefault-2.2.0-py2.6.egg/Products/CMFDefault/DublinCore.py:193: DeprecationWarning: Calls to `DateTime.ISO()` should be replaced with `DateTime.ISO8601()` to avoid implicit changes to GMT in expressions like `DateTime(obj.ModificationTime())`. Please also see http://dev.plone.org/plone/ticket/10140
  return date.toZone(zone).ISO()
/home/stefan/autotest/temp/python26-zope212-cmf22-plone40/eggs/Products.CMFDefault-2.2.0-py2.6.egg/Products/CMFDefault/DublinCore.py:231: DeprecationWarning: Calls to `DateTime.ISO()` should be replaced with `DateTime.ISO8601()` to avoid implicit changes to GMT in expressions like `DateTime(obj.ModificationTime())`. Please also see http://dev.plone.org/plone/ticket/10140
  return self.modified().toZone(zone).ISO()
  Ran 18 tests with 0 failures and 0 errors in 4.215 seconds.
Tearing down left over layers:
  Tear down Products.contentmigration.tests.layer.TestLayer in 0.000 seconds.
  Tear down Products.PloneTestCase.layer.PloneSite in 0.334 seconds.
  Tear down Products.PloneTestCase.layer.ZCML in 0.004 seconds.
  Tear down Testing.ZopeTestCase.layer.ZopeLite in 0.000 seconds.
Total: 0 tests, 0 failures, 0 errors in 0.000 seconds.
Running archetypes.referencebrowserwidget.tests.base.layer tests:
  Set up Testing.ZopeTestCase.layer.ZopeLite in 0.000 seconds.
  Set up Products.PloneTestCase.layer.ZCML in 1.892 seconds.
  Set up Products.PloneTestCase.layer.PloneSite in 4.039 seconds.
  Set up archetypes.referencebrowserwidget.tests.base.layer in 0.000 seconds.
  Ran 43 tests with 0 failures and 0 errors in 7.458 seconds.
Running zope.testing.testrunner.layer.UnitTests tests:
  Tear down archetypes.referencebrowserwidget.tests.base.layer in 0.000 seconds.
  Tear down Products.PloneTestCase.layer.PloneSite in 0.340 seconds.
  Tear down Products.PloneTestCase.layer.ZCML in 0.007 seconds.
  Tear down Testing.ZopeTestCase.layer.ZopeLite in 0.000 seconds.
  Set up zope.testing.testrunner.layer.UnitTests in 0.000 seconds.
  Ran 4 tests with 0 failures and 0 errors in 0.001 seconds.
Tearing down left over layers:
  Tear down zope.testing.testrunner.layer.UnitTests in 0.000 seconds.
Total: 47 tests, 0 failures, 0 errors in 14.197 seconds.
Running archetypes.schemaextender.tests.base.layer tests:
  Set up Testing.ZopeTestCase.layer.ZopeLite in 0.924 seconds.
  Set up Products.PloneTestCase.layer.ZCML in 2.496 seconds.
  Set up Products.PloneTestCase.layer.PloneSite in 3.899 seconds.
  Set up archetypes.schemaextender.tests.base.layer in 0.000 seconds.
  Ran 20 tests with 0 failures and 0 errors in 3.324 seconds.
Running zope.testing.testrunner.layer.UnitTests tests:
  Tear down archetypes.schemaextender.tests.base.layer in 0.000 seconds.
  Tear down Products.PloneTestCase.layer.PloneSite in 0.337 seconds.
  Tear down Products.PloneTestCase.layer.ZCML in 0.007 seconds.
  Tear down Testing.ZopeTestCase.layer.ZopeLite in 0.000 seconds.
  Set up zope.testing.testrunner.layer.UnitTests in 0.000 seconds.
  Ran 19 tests with 0 failures and 0 errors in 0.006 seconds.
Tearing down left over layers:
  Tear down zope.testing.testrunner.layer.UnitTests in 0.000 seconds.
Total: 39 tests, 0 failures, 0 errors in 11.428 seconds.
Running zope.testing.testrunner.layer.UnitTests tests:
  Set up zope.testing.testrunner.layer.UnitTests in 0.000 seconds.
  Ran 4 tests with 0 failures and 0 errors in 0.039 seconds.
Tearing down left over layers:
  Tear down zope.testing.testrunner.layer.UnitTests in 0.000 seconds.
Running Testing.ZopeTestCase.layer.ZopeLite tests:
  Set up Testing.ZopeTestCase.layer.ZopeLite in 0.067 seconds.
  Ran 40 tests with 0 failures and 0 errors in 0.774 seconds.
Tearing down left over layers:
  Tear down Testing.ZopeTestCase.layer.ZopeLite in 0.000 seconds.
Running Testing.ZopeTestCase.layer.ZopeLite tests:
  Set up Testing.ZopeTestCase.layer.ZopeLite in 0.034 seconds.
  Ran 40 tests with 0 failures and 0 errors in 0.973 seconds.
Running zope.testing.testrunner.layer.UnitTests tests:
  Tear down Testing.ZopeTestCase.layer.ZopeLite in 0.000 seconds.
  Set up zope.testing.testrunner.layer.UnitTests in 0.000 seconds.
  Ran 1 tests with 0 failures and 0 errors in 0.099 seconds.
Tearing down left over layers:
  Tear down zope.testing.testrunner.layer.UnitTests in 0.000 seconds.
Total: 41 tests, 0 failures, 0 errors in 1.282 seconds.
/home/stefan/autotest/temp/python26-zope212-cmf22-plone40/eggs/kss.core-1.6.0.a2-py2.6.egg/kss/core/tests/test_kssview_core.py:165: UserWarning: The test_class you are using doesn't subclass from ZopeTestCase.Functional. Please fix that.
  tearDown=KSSViewTestCase.beforeTearDown.im_func))
Running Testing.ZopeTestCase.layer.ZopeLite tests:
  Set up Testing.ZopeTestCase.layer.ZopeLite in 0.046 seconds.
  Ran 1 tests with 0 failures and 0 errors in 0.261 seconds.
Running kss.core.tests.base.KSSLayer tests:
  Tear down Testing.ZopeTestCase.layer.ZopeLite in 0.000 seconds.
  Set up kss.core.tests.base.KSSCoreLayer in 0.030 seconds.
  Set up kss.core.tests.base.KSSLayer in 0.056 seconds.
  Ran 29 tests with 0 failures and 0 errors in 0.152 seconds.
Running kss.core.tests.test_ttwapi.layer tests:
  Set up kss.core.tests.test_ttwapi.layer in 0.001 seconds.
  Ran 3 tests with 0 failures and 0 errors in 0.026 seconds.
Running zope.testing.testrunner.layer.UnitTests tests:
  Tear down kss.core.tests.test_ttwapi.layer in 0.000 seconds.
  Tear down kss.core.tests.base.KSSLayer in 0.000 seconds.
  Tear down kss.core.tests.base.KSSCoreLayer in 0.000 seconds.
  Set up zope.testing.testrunner.layer.UnitTests in 0.000 seconds.
/home/stefan/autotest/temp/python26-zope212-cmf22-plone40/eggs/kss.core-1.6.0.a2-py2.6.egg/kss/core/siteview.txt:1: DeprecationWarning: ISite is deprecated. Moved to zope.location.interfaces. Importing from here will stop working in Zope 3.6
  =========
  Ran 14 tests with 0 failures and 0 errors in 0.032 seconds.
Tearing down left over layers:
  Tear down zope.testing.testrunner.layer.UnitTests in 0.000 seconds.
Total: 47 tests, 0 failures, 0 errors in 0.914 seconds.
***********************************************
WARNING: LinguaPlone not found. Skipping tests.
***********************************************
***********************************************
WARNING: LinguaPlone not found. Skipping tests.
***********************************************
Running plone.app.blob.tests.layer.BlobLayer tests:
  Set up Testing.ZopeTestCase.layer.ZopeLite in 0.916 seconds.
  Set up Products.PloneTestCase.layer.ZCML in 2.457 seconds.
  Set up Products.PloneTestCase.layer.PloneSite in 3.854 seconds.
  Set up plone.app.blob.tests.layer.BlobLayer in 0.089 seconds.
/home/stefan/autotest/temp/python26-zope212-cmf22-plone40/eggs/Products.PortalTransforms-2.0b4-py2.6.egg/Products/PortalTransforms/libtransforms/commandtransform.py:97: DeprecationWarning: os.popen4 is deprecated.  Use the subprocess module.
  cin, couterr = os.popen4(command, 'b')
  Ran 29 tests with 0 failures and 0 errors in 6.508 seconds.
Running plone.app.blob.tests.layer.BlobReplacementLayer tests:
  Set up plone.app.blob.tests.layer.BlobReplacementLayer in 0.223 seconds.
  Ran 55 tests with 0 failures and 0 errors in 11.358 seconds.
Running zope.testing.testrunner.layer.UnitTests tests:
  Tear down plone.app.blob.tests.layer.BlobReplacementLayer in 0.000 seconds.
  Tear down plone.app.blob.tests.layer.BlobLayer in 0.000 seconds.
  Tear down Products.PloneTestCase.layer.PloneSite in 0.375 seconds.
  Tear down Products.PloneTestCase.layer.ZCML in 0.009 seconds.
  Tear down Testing.ZopeTestCase.layer.ZopeLite in 0.000 seconds.
  Set up zope.testing.testrunner.layer.UnitTests in 0.000 seconds.
  Ran 2 tests with 0 failures and 0 errors in 0.001 seconds.
Tearing down left over layers:
  Tear down zope.testing.testrunner.layer.UnitTests in 0.000 seconds.
Total: 86 tests, 0 failures, 0 errors in 26.555 seconds.
Running Testing.ZopeTestCase.layer.ZopeLite tests:
  Set up Testing.ZopeTestCase.layer.ZopeLite in 0.944 seconds.
  Ran 2 tests with 0 failures and 0 errors in 0.008 seconds.
Running plone.app.folder.tests.layer.IntegrationLayer tests:
  Set up Products.PloneTestCase.layer.ZCML in 2.580 seconds.
  Set up Products.PloneTestCase.layer.PloneSite in 3.726 seconds.
  Set up plone.app.folder.tests.layer.IntegrationLayer in 0.084 seconds.
  Ran 22 tests with 0 failures and 0 errors in 4.923 seconds.
Running plone.app.folder.tests.layer.PartialOrderingIntegrationLayer tests:
  Set up plone.app.folder.tests.layer.PartialOrderingIntegrationLayer in 0.000 seconds.
  Ran 3 tests with 0 failures and 0 errors in 0.314 seconds.
Tearing down left over layers:
  Tear down plone.app.folder.tests.layer.PartialOrderingIntegrationLayer in 0.000 seconds.
  Tear down plone.app.folder.tests.layer.IntegrationLayer in 0.000 seconds.
  Tear down Products.PloneTestCase.layer.PloneSite in 0.335 seconds.
  Tear down Products.PloneTestCase.layer.ZCML in 0.004 seconds.
  Tear down Testing.ZopeTestCase.layer.ZopeLite in 0.000 seconds.
Total: 27 tests, 0 failures, 0 errors in 13.496 seconds.
Running plone.app.imaging.testing.ImagingLayer tests:
  Set up Testing.ZopeTestCase.layer.ZopeLite in 0.931 seconds.
  Set up Products.PloneTestCase.layer.ZCML in 2.790 seconds.
  Set up Products.PloneTestCase.layer.PloneSite in 4.485 seconds.
  Set up collective.testcaselayer.ptc.PTCLayer in 0.030 seconds.
  Set up plone.app.imaging.testing.ImagingLayer in 0.120 seconds.


Failure in test /home/stefan/autotest/temp/python26-zope212-cmf22-plone40/src/plone.app.imaging/src/plone/app/imaging/tests/configlet.txt
Failed doctest test for configlet.txt
  File "/home/stefan/autotest/temp/python26-zope212-cmf22-plone40/src/plone.app.imaging/src/plone/app/imaging/tests/configlet.txt", line 0

----------------------------------------------------------------------
File "/home/stefan/autotest/temp/python26-zope212-cmf22-plone40/src/plone.app.imaging/src/plone/app/imaging/tests/configlet.txt", line 24, in configlet.txt
Failed example:
    self.browser.contents
Expected:
    '...<img src="http://nohost/plone/image_icon.gif"...
     ...Image Handling...'
Got:
    '\n\n\n  \n<!DOCTYPE html PUBLIC\n  "-//W3C//DTD XHTML 1.0 Transitional//EN"\n  "http://www.w3.org/TR/xhtml1/DTD/xhtml1-transitional.dtd">\n\n<html xmlns="http://www.w3.org/1999/xhtml" lang="en">\n\n    \n    \n    \n    \n    \n\n\n<head>\n    <meta http-equiv="Content-Type" content="text/html; charset=utf-8" />\n\n    <!-- Forces IE8+ into newest rendering engine even if on an intranet. This has to be defined before any script/style tags. -->\n    <meta http-equiv="X-UA-Compatible" content="IE=edge" /> \n    <!-- Enables iPhone web app use, fullscreen when added to home screen -->\n    <meta name="apple-mobile-web-app-capable" content="yes" />\n\n    \n        <base href="http://nohost/plone/" /><!--[if lt IE 7]></base><![endif]-->\n    \n\n    \n<link rel="kss-base-url" href="http://nohost/plone/" />\n\n  \n    <link rel="stylesheet" type="text/css" media="screen" href="http://nohost/plone/portal_css/Sunburst%20Theme/member-cachekey3027.css" />\n    <link rel="stylesheet" type="text/css" href="http://nohost/plone/portal_css/Sunburst%20Theme/base-cachekey5632.css" />\n    <style type="text/css" media="all">@import url(http://nohost/plone/portal_css/Sunburst%20Theme/resourcetinymce.stylesheetstinymce-cachekey8686.css);</style>\n    <link rel="stylesheet" type="text/css" media="all" href="http://nohost/plone/portal_css/Sunburst%20Theme/ploneCustom-cachekey1517.css" />\n\n  \n    <link rel="kinetic-stylesheet" type="text/css" href="http://nohost/plone/portal_kss/Sunburst%20Theme/resourcetinymce.ksstinymce-cachekey8832.kss" />\n    <link rel="kinetic-stylesheet" type="text/css" href="http://nohost/plone/portal_kss/Sunburst%20Theme/at-cachekey7943.kss" />\n  \n    <script type="text/javascript" src="http://nohost/plone/portal_javascripts/Sunburst%20Theme/jquery-cachekey1356.js"></script>\n    <script type="text/javascript" src="http://nohost/plone/portal_javascripts/Sunburst%20Theme/sarissa-cachekey4366.js"></script>\n    <script type="text/javascript" src="http://nohost/plone/portal_javascripts/Sunburst%20Theme/dropdown-cachekey6190.js"></script>\n       <!--[if lt IE 8]>\n     \n    <script type="text/javascript" src="http://nohost/plone/portal_javascripts/Sunburst%20Theme/IE8-cachekey3105.js"></script>\n       <![endif]-->\n     \n\n\n<title>Plone site</title>\n    \n    <link rel="author" href="http://nohost/plone/author/" title="Author information" />\n\n\n\n    <link rel="shortcut icon" type="image/x-icon" href="http://nohost/plone/favicon.ico" />\n\n\n\n    <link rel="home" href="http://nohost/plone" title="Front page" />\n\n    <link rel="contents" href="http://nohost/plone/sitemap" title="Site Map" />\n\n\n\n\n\n\n    <link rel="search" href="http://nohost/plone/search_form" title="Search this site" />\n\n\n\n    \n    \n    \n    \n    \n\n    <meta name="viewport" content="width=320; initial-scale=0.6666; maximum-scale=1.0; minimum-scale=0.6666" />\n    <meta name="generator" content="Plone - http://plone.org" />\n</head>\n\n<body class="template-imaging-controlpanel portaltype-plone-site" dir="ltr">\n\n<div id="visual-portal-wrapper">\n\n        <div id="portal-top" class="row">\n<div class="cell width-full position-0"> <!-- TODO: Temporary, this one should be in the template that is inserted -->\n            <div id="portal-header">\n    <p class="hiddenStructure">\n  <a accesskey="2" href="http://nohost/plone/@@imaging-controlpanel#content">Skip to content.</a> |\n\n  <a accesskey="6" href="http://nohost/plone/@@imaging-controlpanel#portlet-navigation-tree">Skip to navigation</a>\n</p>\n\n<div id="portal-personaltools-wrapper">\n\n<h5 class="hiddenStructure">Personal tools</h5>\n\n<dl class="actionMenu" id="portal-personaltools">\n   <!-- TODO: Can we nest these in a better way? -->\n  <dt class="actionMenuHeader">\n    <!-- The following a-tag needs to be clicked to dropdown the menu -->\n    <a id="user-name" href="http://nohost/plone/dashboard">root</a>\n  </dt>\n  <dd class="actionMenuContent">\n    <ul>\n        <li id="personaltools-dashboard">\n            <a href="http://nohost/plone/dashboard">Dashboard</a>\n        </li>\n    </ul>\n    <ul>\n        <li id="personaltools-preferences">\n            <a href="http://nohost/plone/@@personal-preferences">Preferences</a>\n        </li>\n    </ul>\n    <ul>\n        <li id="personaltools-plone_setup">\n            <a href="http://nohost/plone/plone_control_panel">Site Setup</a>\n        </li>\n    </ul>\n    <ul>\n        <li id="personaltools-logout">\n            <a href="http://nohost/plone/logout">Log out</a>\n        </li>\n    </ul>\n  </dd>\n  \n</dl>\n\n\n\n</div>\n\n\n\n<div id="portal-searchbox">\n    <form name="searchform" action="http://nohost/plone/search">\n\n        <label class="hiddenStructure" for="searchGadget">Search Site</label>\n\n        <div class="LSBox">\n        <input name="SearchableText" type="text" size="18" title="Search Site" accesskey="4" class="inputLabel" id="searchGadget" />\n\n        <input class="searchButton" type="submit" value="Search" />\n\n        <div class="searchSection">\n            <input id="searchbox_currentfolder_only" class="noborder" type="checkbox" name="path" value="/plone" />\n            <label for="searchbox_currentfolder_only" style="cursor: pointer">\n                only in current section\n            </label>\n        </div>\n\n        <div class="LSResult" id="LSResult" style=""><div class="LSShadow" id="LSShadow"></div></div>\n        </div>\n    </form>\n\n    <div id="portal-advanced-search" class="hiddenStructure">\n        <a href="http://nohost/plone/search_form" accesskey="5">\n            Advanced Search&hellip;\n        </a>\n    </div>\n\n</div>\n\n<a id="portal-logo" title="Home" accesskey="1" href="http://nohost/plone">\n    <img src="http://nohost/plone/logo.png" alt="" title="" height="56" width="215" /></a>\n\n\n    <h5 class="hiddenStructure">Sections</h5>\n\n    <ul id="portal-globalnav"><li id="portaltab-index_html" class="selected"><a href="http://nohost/plone" title="">Home</a></li><li id="portaltab-news" class="plain"><a href="http://nohost/plone/news" title="Site News">News</a></li><li id="portaltab-events" class="plain"><a href="http://nohost/plone/events" title="Site Events">Events</a></li><li id="portaltab-Members" class="plain"><a href="http://nohost/plone/Members" title="Container for users\' home directories">Users</a></li></ul>\n\n</div>\n\n</div>\n        </div>\n    <div id="portal-columns" class="row">\n\n        <div id="portal-column-content" class="cell width-full position-0">\n\n            <div id="viewlet-above-content"></div>\n            \n            \n        \n          <div class="cell position-1:4 width-3:4">\n          \n          \n            <div class="">\n\n                    \n\n                    \n\n    <dl class="portalMessage info" id="kssPortalMessage" style="display:none">\n        <dt>Info</dt>\n        <dd></dd>\n    </dl>\n\n\n\n                    \n                        <div id="content">\n\n                            \n\n                            \n                \n\n    \n\n        \n\n            \n\n        \n        \n        <h1 class="documentFirstHeading">Image handling settings</h1>\n\n        <div class="documentDescription">Settings to configure image handling in Plone.</div>\n\n        <div id="content-core">\n            \n            <a href="http://nohost/plone/plone_control_panel" class="link-parent">\n                Up to Site Setup\n            </a>\n\n            <form action="http://nohost/plone/@@imaging-controlpanel" method="post" class="edit-form enableUnloadProtection" enctype="multipart/form-data" id="zc.page.browser_form">\n\n                <input type="hidden" name="fieldset.current" value="" />\n\n                \n\n                <fieldset>\n                    <legend>Imaging scaling</legend>\n                    \n\n                        <div class="field">\n\n                            <label for="form.allowed_sizes">Allowed image sizes</label>\n\n                            \n\n                            <div class="formHelp">Specify all allowed maximum image dimensions, one per line. The required format is &lt;name&gt; &lt;width&gt;:&lt;height&gt;.</div>\n\n                            \n\n                            <div class="widget"><table border="0" class="sequencewidget">\n  <tr>\n    <td>\n      <input class="editcheck" type="checkbox" name="form.allowed_sizes.remove_0" />\n    </td>\n    <td>\n      \n      <input class="textType" id="form.allowed_sizes.0." name="form.allowed_sizes.0." size="20" type="text" value="large 768:768"  />\n    </td>\n  </tr>\n  <tr>\n    <td>\n      <input class="editcheck" type="checkbox" name="form.allowed_sizes.remove_1" />\n    </td>\n    <td>\n      \n      <input class="textType" id="form.allowed_sizes.1." name="form.allowed_sizes.1." size="20" type="text" value="preview 400:400"  />\n    </td>\n  </tr>\n  <tr>\n    <td>\n      <input class="editcheck" type="checkbox" name="form.allowed_sizes.remove_2" />\n    </td>\n    <td>\n      \n      <input class="textType" id="form.allowed_sizes.2." name="form.allowed_sizes.2." size="20" type="text" value="mini 200:200"  />\n    </td>\n  </tr>\n  <tr>\n    <td>\n      <input class="editcheck" type="checkbox" name="form.allowed_sizes.remove_3" />\n    </td>\n    <td>\n      \n      <input class="textType" id="form.allowed_sizes.3." name="form.allowed_sizes.3." size="20" type="text" value="thumb 128:128"  />\n    </td>\n  </tr>\n  <tr>\n    <td>\n      <input class="editcheck" type="checkbox" name="form.allowed_sizes.remove_4" />\n    </td>\n    <td>\n      \n      <input class="textType" id="form.allowed_sizes.4." name="form.allowed_sizes.4." size="20" type="text" value="tile 64:64"  />\n    </td>\n  </tr>\n  <tr>\n    <td>\n      <input class="editcheck" type="checkbox" name="form.allowed_sizes.remove_5" />\n    </td>\n    <td>\n      \n      <input class="textType" id="form.allowed_sizes.5." name="form.allowed_sizes.5." size="20" type="text" value="icon 32:32"  />\n    </td>\n  </tr>\n  <tr>\n    <td>\n      <input class="editcheck" type="checkbox" name="form.allowed_sizes.remove_6" />\n    </td>\n    <td>\n      \n      <input class="textType" id="form.allowed_sizes.6." name="form.allowed_sizes.6." size="20" type="text" value="listing 16:16"  />\n    </td>\n  </tr>\n  <tr>\n    <td colspan="2">\n      <input type="submit" value="Remove selected items" name="form.allowed_sizes.remove" />\n      <input type="submit" value="Add Allowed image sizes" name="form.allowed_sizes.add" />\n    </td>\n  </tr>\n</table>\n<input type="hidden" name="form.allowed_sizes.count" value="7" />\n</div>\n                        </div>\n\n                    \n\n                </fieldset>\n\n\n                \n\n                <div class="visualClear"><!-- --></div>\n\n                <div id="actionsView" class="formControls">\n                    <span class="actionButtons">\n                        <input type="submit" id="form.actions.save" name="form.actions.save" value="Save" class="context" />\n                        <input type="submit" id="form.actions.cancel" name="form.actions.cancel" value="Cancel" class="context" />\n                    </span>\n                </div>\n\n                <input type="hidden" name="_authenticator" value="90300998a5edc79ec9748dfdc39020f0072232e8"/>\n\n            </form>\n\n            \n        </div>\n\n    \n\n\n              \n                        </div>\n                    \n\n                    \n                </div>\n      \n          \n          </div>      \n        \n    \n        \n            <div id="viewlet-below-content">\n</div>\n        </div>\n\n        \n        \n            <div id="portal-column-one" class="cell position-0 width-1:4">\n                \n\n<div class="visualPadding">\n\n<dl class="portlet" id="portlet-prefs">\n    <dt class="portletHeader">\n        <span class="portletTopLeft"></span>\n        <a href="http://nohost/plone/plone_control_panel">Site Setup</a>\n        <span class="portletTopRight"></span>\n    </dt>\n\n    <dd class="portletItem">\n\n        \n            <strong>Plone Configuration</strong>\n            <ul class="configlets">\n                \n                <li>\n                    <a href="http://nohost/plone/prefs_install_products_form">\n                        <img src="http://nohost/plone/product_icon.png" alt="" />\n                    Add-ons\n                    </a>\n                </li>\n                \n                \n                <li>\n                    <a href="http://nohost/plone/@@calendar-controlpanel">\n                        <img src="http://nohost/plone/event_icon.png" alt="" />\n                    Calendar\n                    </a>\n                </li>\n                \n                \n                <li>\n                    <a href="http://nohost/plone/portal_atct/atct_manageTopicIndex">\n                        <img src="http://nohost/plone/topic_icon.png" alt="" />\n                    Collections\n                    </a>\n                </li>\n                \n                \n                <li>\n                    <a href="http://nohost/plone/@@rules-controlpanel">\n                        <img src="http://nohost/plone/contentrules_icon.png" alt="" />\n                    Content Rules\n                    </a>\n                </li>\n                \n                \n                <li>\n                    <a href="http://nohost/plone/@@editing-controlpanel">\n                        <img src="http://nohost/plone/cut_icon.png" alt="" />\n                    Editing\n                    </a>\n                </li>\n                \n                \n                <li>\n                    <a href="http://nohost/plone/prefs_error_log_form">\n                        <img src="http://nohost/plone/error_log_icon.png" alt="" />\n                    Errors\n                    </a>\n                </li>\n                \n                \n                <li>\n                    <a href="http://nohost/plone/@@filter-controlpanel">\n                        <img src="http://nohost/plone/htmlfilter_icon.png" alt="" />\n                    HTML Filtering\n                    </a>\n                </li>\n                \n                \n                <li>\n                    <a href="http://nohost/plone/@@language-controlpanel">\n                        <img src="http://nohost/plone/flag-plone.png" alt="" />\n                    Language\n                    </a>\n                </li>\n                \n                \n                <li>\n                    <a href="http://nohost/plone/@@mail-controlpanel">\n                        <img src="http://nohost/plone/mail_icon.png" alt="" />\n                    Mail\n                    </a>\n                </li>\n                \n                \n                <li>\n                    <a href="http://nohost/plone/@@maintenance-controlpanel">\n                        <img src="http://nohost/plone/maintenance_icon.png" alt="" />\n                    Maintenance\n                    </a>\n                </li>\n                \n                \n                <li>\n                    <a href="http://nohost/plone/@@markup-controlpanel">\n                        <img src="http://nohost/plone/edit.png" alt="" />\n                    Markup\n                    </a>\n                </li>\n                \n                \n                <li>\n                    <a href="http://nohost/plone/@@navigation-controlpanel">\n                        <img src="http://nohost/plone/navigation_icon.png" alt="" />\n                    Navigation\n                    </a>\n                </li>\n                \n                \n                <li>\n                    <a href="http://nohost/plone/@@search-controlpanel">\n                        <img src="http://nohost/plone/search_icon.png" alt="" />\n                    Search\n                    </a>\n                </li>\n                \n                \n                <li>\n                    <a href="http://nohost/plone/@@security-controlpanel">\n                        <img src="http://nohost/plone/lock_icon.png" alt="" />\n                    Security\n                    </a>\n                </li>\n                \n                \n                <li>\n                    <a href="http://nohost/plone/@@site-controlpanel">\n                        <img src="http://nohost/plone/logoIcon.png" alt="" />\n                    Site\n                    </a>\n                </li>\n                \n                \n                <li>\n                    <a href="http://nohost/plone/@@skins-controlpanel">\n                        <img src="http://nohost/plone/skins_icon.png" alt="" />\n                    Themes\n                    </a>\n                </li>\n                \n                \n                <li>\n                    <a href="http://nohost/plone/portal_tinymce/@@tinymce-controlpanel">\n                        <img src="http://nohost/plone/++resource++tinymce.images/tinymce_icon.gif" alt="" />\n                    TinyMCE Visual Editor\n                    </a>\n                </li>\n                \n                \n                <li>\n                    <a href="http://nohost/plone/@@types-controlpanel">\n                        <img src="http://nohost/plone/document_icon.png" alt="" />\n                    Types\n                    </a>\n                </li>\n                \n                \n                <li>\n                    <a href="http://nohost/plone/@@usergroup-userprefs">\n                        <img src="http://nohost/plone/group.png" alt="" />\n                    Users and Groups\n                    </a>\n                </li>\n                \n                \n                \n                \n                \n                <li>\n                    <a href="http://nohost/plone/manage_main">\n                        <img src="http://nohost/plone/zope_icon.png" alt="" />\n                    Zope Management Interface\n                    </a>\n                </li>\n                \n            </ul>\n        \n        <span class="portletBottomLeft"></span>\n        <span class="portletBottomRight"></span>\n    </dd>\n    <dd class="portletItem">\n\n        \n            <strong>Add-on Configuration</strong>\n            <ul class="configlets">\n                \n                <li>\n                    <a href="http://nohost/plone/@@imaging-controlpanel">\n                        <img src="image_icon.gif" alt="" />\n                    Image Handling\n                    </a>\n                </li>\n                \n            </ul>\n        \n        <span class="portletBottomLeft"></span>\n        <span class="portletBottomRight"></span>\n    </dd>\n\n</dl>\n\n</div>\n\n\n\n\n            </div>\n        \n    \n\n        \n    </div>\n\n<div class="visualClear"></div> <!-- TODO: Temporary workaround -->\n\n    \n<div class="row"> <!-- TODO: Also temporary, should be in the proper template -->\n    <div class="cell width-full position-0">\n        <div id="portal-footer">\n\n<p>\n    \n    The\n    <a href="http://plone.org">Plone<sup>&reg;</sup> Open Source Content Management System</a>\n    is\n    <acronym title="Copyright">&copy;</acronym>\n    2000-2010\n    by the\n    <a href="http://plone.org/foundation">Plone Foundation</a>\n    et al.\n    \n</p>\n\n<p>\n    \n    Plone<sup>&reg;</sup> and the Plone logo are registered trademarks of the\n        <a href="http://plone.org/foundation">Plone Foundation</a>.\n    \n\n    \n    Distributed under the\n        <a href="http://creativecommons.org/licenses/GPL/2.0/">GNU GPL license</a>.\n    \n</p>\n\n</div>\n\n<div id="portal-colophon">\n\n<div class="colophonWrapper">\n<ul>\n  <li>\n    <a href="http://plone.org" title="This site was built using the Plone Open Source Content Management System. Click for more information.">\n      Powered by Plone</a>\n  </li>\n</ul>\n</div>\n</div>\n\n<ul id="portal-siteactions">\n\n    <li id="siteaction-sitemap"><a href="http://nohost/plone/sitemap" accesskey="3" title="Site Map">Site Map</a></li>\n    <li id="siteaction-accessibility"><a href="http://nohost/plone/accessibility-info" accesskey="0" title="Accessibility">Accessibility</a></li>\n    <li id="siteaction-contact"><a href="http://nohost/plone/contact-info" accesskey="9" title="Contact">Contact</a></li>\n</ul>\n\n\n    </div>\n</div>\n    \n\n</div>\n\n<!-- TODO: This needs to go away. -->\n<!-- <div id="kss-spinner"><img tal:attributes="src string:${portal_url}/spinner.png" alt="" /></div> -->\n\n</body>\n</html>\n\n\n\n\n'

  Ran 39 tests with 1 failures and 0 errors in 4.222 seconds.
Running zope.testing.testrunner.layer.UnitTests tests:
  Tear down plone.app.imaging.testing.ImagingLayer in 0.000 seconds.
  Tear down collective.testcaselayer.ptc.PTCLayer in 0.000 seconds.
  Tear down Products.PloneTestCase.layer.PloneSite in 0.342 seconds.
  Tear down Products.PloneTestCase.layer.ZCML in 0.005 seconds.
  Tear down Testing.ZopeTestCase.layer.ZopeLite in 0.000 seconds.
  Set up zope.testing.testrunner.layer.UnitTests in 0.000 seconds.
  Ran 7 tests with 0 failures and 0 errors in 0.001 seconds.
Tearing down left over layers:
  Tear down zope.testing.testrunner.layer.UnitTests in 0.000 seconds.
Total: 46 tests, 1 failures, 0 errors in 13.393 seconds.
Running Products.PloneTestCase.layer.PloneSite tests:
  Set up Testing.ZopeTestCase.layer.ZopeLite in 1.486 seconds.
  Set up Products.PloneTestCase.layer.ZCML in 2.510 seconds.
  Set up Products.PloneTestCase.layer.PloneSite in 3.931 seconds.
  Ran 9 tests with 0 failures and 0 errors in 0.117 seconds.
Tearing down left over layers:
  Tear down Products.PloneTestCase.layer.PloneSite in 0.336 seconds.
  Tear down Products.PloneTestCase.layer.ZCML in 0.004 seconds.
  Tear down Testing.ZopeTestCase.layer.ZopeLite in 0.000 seconds.
Running plone.app.linkintegrity.tests.layer.PloneLinkintegrity tests:
  Set up Testing.ZopeTestCase.layer.ZopeLite in 1.454 seconds.
  Set up Products.PloneTestCase.layer.ZCML in 2.503 seconds.
  Set up Products.PloneTestCase.layer.PloneSite in 3.994 seconds.
  Set up collective.testcaselayer.ptc.PTCLayer in 0.028 seconds.
  Set up plone.app.linkintegrity.tests.layer.PloneLinkintegrity in 0.506 seconds.
  Ran 117 tests with 0 failures and 0 errors in 23.723 seconds.
Running zope.testing.testrunner.layer.UnitTests tests:
  Tear down plone.app.linkintegrity.tests.layer.PloneLinkintegrity in 0.000 seconds.
  Tear down collective.testcaselayer.ptc.PTCLayer in 0.000 seconds.
  Tear down Products.PloneTestCase.layer.PloneSite in 0.348 seconds.
  Tear down Products.PloneTestCase.layer.ZCML in 0.006 seconds.
  Tear down Testing.ZopeTestCase.layer.ZopeLite in 0.000 seconds.
  Set up zope.testing.testrunner.layer.UnitTests in 0.000 seconds.
  Ran 1 tests with 0 failures and 0 errors in 0.001 seconds.
Tearing down left over layers:
  Tear down zope.testing.testrunner.layer.UnitTests in 0.000 seconds.
Total: 118 tests, 0 failures, 0 errors in 33.173 seconds.
Total: 0 tests, 0 failures, 0 errors in 0.000 seconds.
Running Products.PloneTestCase.layer.PloneSite tests:
  Set up Testing.ZopeTestCase.layer.ZopeLite in 1.457 seconds.
  Set up Products.PloneTestCase.layer.ZCML in 2.446 seconds.
  Set up Products.PloneTestCase.layer.PloneSite in 3.925 seconds.
  Ran 3 tests with 0 failures and 0 errors in 0.694 seconds.
Tearing down left over layers:
  Tear down Products.PloneTestCase.layer.PloneSite in 0.343 seconds.
  Tear down Products.PloneTestCase.layer.ZCML in 0.004 seconds.
  Tear down Testing.ZopeTestCase.layer.ZopeLite in 0.000 seconds.
Running Products.PloneTestCase.layer.PloneSite tests:
  Set up Testing.ZopeTestCase.layer.ZopeLite in 1.377 seconds.
  Set up Products.PloneTestCase.layer.ZCML in 2.478 seconds.
  Set up Products.PloneTestCase.layer.PloneSite in 3.900 seconds.
  Ran 39 tests with 0 failures and 0 errors in 8.226 seconds.
Tearing down left over layers:
  Tear down Products.PloneTestCase.layer.PloneSite in 0.334 seconds.
  Tear down Products.PloneTestCase.layer.ZCML in 0.006 seconds.
  Tear down Testing.ZopeTestCase.layer.ZopeLite in 0.000 seconds.
Running plone.folder.tests.layer.PloneFolderLayer tests:
  Set up plone.folder.tests.layer.PloneFolderLayer in 0.007 seconds.
  Ran 67 tests with 0 failures and 0 errors in 5.491 seconds.
Tearing down left over layers:
  Tear down plone.folder.tests.layer.PloneFolderLayer in 0.000 seconds.
Running Products.PloneTestCase.layer.PloneSite tests:
  Set up Testing.ZopeTestCase.layer.ZopeLite in 1.443 seconds.
  Set up Products.PloneTestCase.layer.ZCML in 2.482 seconds.
  Set up Products.PloneTestCase.layer.PloneSite in 4.084 seconds.
  Ran 41 tests with 0 failures and 0 errors in 0.318 seconds.
Tearing down left over layers:
  Tear down Products.PloneTestCase.layer.PloneSite in 0.332 seconds.
  Tear down Products.PloneTestCase.layer.ZCML in 0.004 seconds.
  Tear down Testing.ZopeTestCase.layer.ZopeLite in 0.000 seconds.
Total: 0 tests, 0 failures, 0 errors in 0.000 seconds.
Running plonetheme.sunburst.tests.base.Layer tests:
  Set up Testing.ZopeTestCase.layer.ZopeLite in 1.469 seconds.
  Set up Products.PloneTestCase.layer.ZCML in 2.925 seconds.
  Set up Products.PloneTestCase.layer.PloneSite in 3.899 seconds.
  Set up collective.testcaselayer.ptc.PTCLayer in 0.030 seconds.
  Set up plonetheme.sunburst.tests.base.Layer in 0.014 seconds.
  Ran 21 tests with 0 failures and 0 errors in 0.983 seconds.
Tearing down left over layers:
  Tear down plonetheme.sunburst.tests.base.Layer in 0.000 seconds.
  Tear down collective.testcaselayer.ptc.PTCLayer in 0.000 seconds.
  Tear down Products.PloneTestCase.layer.PloneSite in 0.336 seconds.
  Tear down Products.PloneTestCase.layer.ZCML in 0.004 seconds.
  Tear down Testing.ZopeTestCase.layer.ZopeLite in 0.000 seconds.
Traceback (most recent call last):
  File "/home/stefan/autotest/temp/python26-zope212-cmf22-plone40/bin/test", line 299, in <module>
    '--test-path', '/home/stefan/autotest/temp/python26-zope212-cmf22-plone40/src/plone.app.kss',
  File "/home/stefan/autotest/temp/python26-zope212-cmf22-plone40/eggs/zope.testing-3.7.7-py2.6.egg/zope/testing/testrunner/__init__.py", line 32, in run
    failed = run_internal(defaults, args)
  File "/home/stefan/autotest/temp/python26-zope212-cmf22-plone40/eggs/zope.testing-3.7.7-py2.6.egg/zope/testing/testrunner/__init__.py", line 45, in run_internal
    runner.run()
  File "/home/stefan/autotest/temp/python26-zope212-cmf22-plone40/eggs/zope.testing-3.7.7-py2.6.egg/zope/testing/testrunner/runner.py", line 125, in run
    feature.global_setup()
  File "/home/stefan/autotest/temp/python26-zope212-cmf22-plone40/eggs/zope.testing-3.7.7-py2.6.egg/zope/testing/testrunner/find.py", line 410, in global_setup
    tests = find_tests(self.runner.options, self.runner.found_suites)
  File "/home/stefan/autotest/temp/python26-zope212-cmf22-plone40/eggs/zope.testing-3.7.7-py2.6.egg/zope/testing/testrunner/find.py", line 117, in find_tests
    for suite in found_suites:
  File "/home/stefan/autotest/temp/python26-zope212-cmf22-plone40/eggs/zope.testing-3.7.7-py2.6.egg/zope/testing/testrunner/find.py", line 127, in find_suites
    for fpath, package in find_test_files(options):
  File "/home/stefan/autotest/temp/python26-zope212-cmf22-plone40/eggs/zope.testing-3.7.7-py2.6.egg/zope/testing/testrunner/find.py", line 176, in find_test_files
    for f, package in find_test_files_(options):
  File "/home/stefan/autotest/temp/python26-zope212-cmf22-plone40/eggs/zope.testing-3.7.7-py2.6.egg/zope/testing/testrunner/find.py", line 204, in find_test_files_
    for (p, package) in test_dirs(options, {}):
  File "/home/stefan/autotest/temp/python26-zope212-cmf22-plone40/eggs/zope.testing-3.7.7-py2.6.egg/zope/testing/testrunner/find.py", line 261, in test_dirs
    for p in p.__path__:
AttributeError: 'module' object has no attribute '__path__'
Running Products.PloneTestCase.layer.ZCML tests:
  Set up Testing.ZopeTestCase.layer.ZopeLite in 0.937 seconds.
  Set up Products.PloneTestCase.layer.ZCML in 2.507 seconds.
/home/stefan/autotest/temp/python26-zope212-cmf22-plone40/eggs/wicked-1.1.8alpha1-py2.6.egg/wicked/cache.py:34: DeprecationWarning: object.__init__() takes no parameters
  super(CacheStore, self).__init__(self)
  Ran 16 tests with 0 failures and 0 errors in 0.058 seconds.
Running wicked.at.tests.wickedtestcase.WickedSite tests:
  Set up Products.PloneTestCase.layer.PloneSite in 4.638 seconds.
  Set up wicked.at.tests.wickedtestcase.WickedSite in 0.002 seconds.
/home/stefan/autotest/temp/python26-zope212-cmf22-plone40/eggs/Zope2-2.12.3-py2.6-linux-x86_64.egg/OFS/subscribers.py:73: DeprecationWarning: wicked.atcontent.ironicwiki.IronicWiki.manage_afterAdd is discouraged. You should use event subscribers instead.
  DeprecationWarning)
/home/stefan/autotest/temp/python26-zope212-cmf22-plone40/eggs/Zope2-2.12.3-py2.6-linux-x86_64.egg/OFS/subscribers.py:73: DeprecationWarning: wicked.atcontent.ironicwiki.IronicWiki.manage_beforeDelete is discouraged. You should use event subscribers instead.
  DeprecationWarning)
/home/stefan/autotest/temp/python26-zope212-cmf22-plone40/eggs/Zope2-2.12.3-py2.6-linux-x86_64.egg/OFS/subscribers.py:73: DeprecationWarning: wicked.atcontent.ironicwiki.IronicWiki.manage_afterClone is discouraged. You should use event subscribers instead.
  DeprecationWarning)
  Ran 23 tests with 0 failures and 0 errors in 5.480 seconds.
Running wicked.at.tests.test_scope.Scoped tests:
  Set up wicked.at.tests.test_scope.Scoped in 0.000 seconds.
  Ran 3 tests with 0 failures and 0 errors in 0.603 seconds.
Running wicked.plone.tests.SelectiveATCT tests:
  Tear down wicked.at.tests.test_scope.Scoped in 0.000 seconds.
  Tear down wicked.at.tests.wickedtestcase.WickedSite in 0.002 seconds.
  Set up wicked.plone.tests.SelectiveATCT in 0.003 seconds.
  Ran 22 tests with 0 failures and 0 errors in 5.669 seconds.
Running wicked.plone.tests.ZCMLLayer tests:
  Tear down wicked.plone.tests.SelectiveATCT in 0.004 seconds.
  Set up wicked.plone.tests.ZCMLLayer in 0.020 seconds.
  Ran 8 tests with 0 failures and 0 errors in 0.667 seconds.
Running zope.testing.testrunner.layer.UnitTests tests:
  Tear down wicked.plone.tests.ZCMLLayer in 0.359 seconds.
  Tear down Products.PloneTestCase.layer.PloneSite in 0.001 seconds.
  Tear down Products.PloneTestCase.layer.ZCML in 0.004 seconds.
  Tear down Testing.ZopeTestCase.layer.ZopeLite in 0.000 seconds.
  Set up zope.testing.testrunner.layer.UnitTests in 0.000 seconds.
  Ran 34 tests with 0 failures and 0 errors in 0.016 seconds.
Tearing down left over layers:
  Tear down zope.testing.testrunner.layer.UnitTests in 0.000 seconds.
Total: 106 tests, 0 failures, 0 errors in 22.240 seconds.
#### Running tests for group ATCT ####
#### Finished tests for group ATCT ####

#### Running tests for group Archetypes ####
#### Finished tests for group Archetypes ####

#### Running tests for group CMF ####
#### Finished tests for group CMF ####

#### Running tests for group CMFEditions ####
#### Finished tests for group CMFEditions ####

#### Running tests for group Plone ####
#### Finished tests for group Plone ####

#### Running tests for group PlonePAS ####
#### Finished tests for group PlonePAS ####

#### Running tests for group plone ####
#### Finished tests for group plone ####

#### Running tests for group portlets ####
#### Finished tests for group portlets ####

#### Running tests for group z3c.autoinclude ####
#### Finished tests for group z3c.autoinclude ####

#### Running tests for Products.CMFPlacefulWorkflow ####
#### Finished tests for Products.CMFPlacefulWorkflow ####

#### Running tests for Products.CMFTestCase ####
#### Finished tests for Products.CMFTestCase ####

#### Running tests for Products.ExtendedPathIndex ####
#### Finished tests for Products.ExtendedPathIndex ####

#### Running tests for Products.PasswordResetTool ####
#### Finished tests for Products.PasswordResetTool ####

#### Running tests for Products.PloneTestCase ####
#### Finished tests for Products.PloneTestCase ####

#### Running tests for Products.ResourceRegistries ####
#### Finished tests for Products.ResourceRegistries ####

#### Running tests for Products.TinyMCE ####
#### Finished tests for Products.TinyMCE ####

#### Running tests for Products.ZopeVersionControl ####
#### Finished tests for Products.ZopeVersionControl ####

#### Running tests for Products.contentmigration ####
#### Finished tests for Products.contentmigration ####

#### Running tests for Products.i18ntestcase ####
#### Finished tests for Products.i18ntestcase ####

#### Running tests for archetypes.referencebrowserwidget ####
#### Finished tests for archetypes.referencebrowserwidget ####

#### Running tests for archetypes.schemaextender ####
#### Finished tests for archetypes.schemaextender ####

#### Running tests for collective.monkeypatcher ####
#### Finished tests for collective.monkeypatcher ####

#### Running tests for five.customerize ####
#### Finished tests for five.customerize ####

#### Running tests for five.formlib ####
#### Finished tests for five.formlib ####

#### Running tests for kss.core ####
#### Finished tests for kss.core ####

#### Running tests for plone.app.blob ####
#### Finished tests for plone.app.blob ####

#### Running tests for plone.app.folder ####
#### Finished tests for plone.app.folder ####

#### Running tests for plone.app.imaging ####
#### Finished tests for plone.app.imaging ####

#### Running tests for plone.app.jquerytools ####
#### Finished tests for plone.app.jquerytools ####

#### Running tests for plone.app.linkintegrity ####
#### Finished tests for plone.app.linkintegrity ####

#### Running tests for plone.app.locales ####
#### Finished tests for plone.app.locales ####

#### Running tests for plone.app.openid ####
#### Finished tests for plone.app.openid ####

#### Running tests for plone.app.users ####
#### Finished tests for plone.app.users ####

#### Running tests for plone.folder ####
#### Finished tests for plone.folder ####

#### Running tests for plone.stringinterp ####
#### Finished tests for plone.stringinterp ####

#### Running tests for plonetheme.classic ####
#### Finished tests for plonetheme.classic ####

#### Running tests for plonetheme.sunburst ####
#### Finished tests for plonetheme.sunburst ####

#### Running tests for roman ####
#### Finished tests for roman ####

#### Running tests for wicked ####
#### Finished tests for wicked ####

Packages with test failures:

Failing tests in group ATCT
Failing tests in group Archetypes
Failing tests in group Plone
Failing tests in plone.app.imaging
Failing tests in roman

Total time elapsed: 932.149 seconds

Grand total: 91 packages, 5 failures


FAILED (91 packages, 5 failures)




More information about the Testbot mailing list