[Testbot] FAILED (failures=1) : AT-1.5 Plone-3.3 Zope-2.10 Python-2.4.6

Archetypes Tests plone-tests at epy.co.at
Fri Mar 19 02:28:40 UTC 2010


Archetypes Tests : FAILED (failures=1)
AT-1.5 Plone-3.3 Zope-2.10 Python-2.4.6

Running ./bin/instance test -q --package Products.Archetypes --package Products.MimetypesRegistry --package Products.PortalTransforms --package Products.validation
/home/stefan/autotest/temp/cache/Zope-2.10.11-final-py2.4/lib/python/zope/configuration/xmlconfig.py:323: DeprecationWarning: zope.app.annotation has moved to zope.annotation. Import of zope.app.annotation will become unsupported in Zope 3.5
  __import__(arguments[0])
Failed to import ZPsycopgDA
Failed to import ZMySQLDA
Running unit tests:
  Ran 17 tests with 0 failures and 0 errors in 0.305 seconds.
Running Products.PloneTestCase.layer.ZCML tests:
  Set up Products.PloneTestCase.layer.ZCML in 1.419 seconds.
/home/stefan/autotest/temp/python24-zope210-cmf21-plone33next/eggs/Products.PlonePAS-3.12-py2.4.egg/Products/PlonePAS/setuphandlers.py:39: DeprecationWarning: portal_groups.getGroupIds is deprecated and will be removed in Plone 4.0. Use PAS searchGroups instead
  existing = gtool.listGroupIds()
  Ran 61 tests with 0 failures and 0 errors in 1.105 seconds.
Running Products.PloneTestCase.layer.PloneSite tests:
  Set up Products.PloneTestCase.layer.PloneSite in 3.941 seconds.
/home/stefan/autotest/temp/cache/Zope-2.10.11-final-py2.4/lib/python/OFS/subscribers.py:73: DeprecationWarning: Products.Archetypes.tests.test_classgen.Dummy.manage_afterAdd is discouraged. You should use event subscribers instead.
  DeprecationWarning)
/home/stefan/autotest/temp/cache/Zope-2.10.11-final-py2.4/lib/python/OFS/subscribers.py:73: DeprecationWarning: Products.Archetypes.tests.test_annotation.AnnDummy.manage_afterAdd is discouraged. You should use event subscribers instead.
  DeprecationWarning)
/home/stefan/autotest/temp/python24-zope210-cmf21-plone33next/eggs/Plone-3.3.5-py2.4.egg/Products/CMFPlone/utils.py:93: DeprecationWarning: The context parameter for isDefaultPage is deprecated and will be removed in Plone 4.
  DeprecationWarning, 1)
/home/stefan/autotest/temp/cache/Zope-2.10.11-final-py2.4/lib/python/OFS/subscribers.py:73: DeprecationWarning: Products.Archetypes.tests.test_event.Dummy.manage_afterAdd is discouraged. You should use event subscribers instead.
  DeprecationWarning)


Failure in test /home/stefan/autotest/temp/python24-zope210-cmf21-plone33next/eggs/Products.Archetypes-1.5.15-py2.4.egg/Products/Archetypes/tests/reindex_sanity_plone21.txt
Failed doctest test for reindex_sanity_plone21.txt
  File "/home/stefan/autotest/temp/python24-zope210-cmf21-plone33next/eggs/Products.Archetypes-1.5.15-py2.4.egg/Products/Archetypes/tests/reindex_sanity_plone21.txt", line 0

----------------------------------------------------------------------
File "/home/stefan/autotest/temp/python24-zope210-cmf21-plone33next/eggs/Products.Archetypes-1.5.15-py2.4.egg/Products/Archetypes/tests/reindex_sanity_plone21.txt", line 284, in reindex_sanity_plone21.txt
Failed example:
    self.folder.manage_renameObjects(ids=['new_folder1'],
                                     new_ids=['new_folder11'])
Differences (ndiff with -expected +actual):
      Catalog:    uid_catalog
      UnIndexing: Members/test_user_1_/new_folder1
      ------------------------------------------------------------
      Catalog:    portal_catalog
      UnIndexing: /plone/Members/test_user_1_/new_folder1
      ------------------------------------------------------------
      Catalog:  uid_catalog
      Indexing: Members/test_user_1_/new_folder11 []
      ------------------------------------------------------------
      Catalog:  portal_catalog
      Indexing: /plone/Members/test_user_1_/new_folder11 []
      ------------------------------------------------------------
      Catalog:  portal_catalog
    + Indexing: /plone/Members/test_user_1_/new_folder2 ['getObjPositionInParent']
    + ------------------------------------------------------------
    + Catalog:  portal_catalog
    + Indexing: /plone/Members/test_user_1_/new_folder11 ['getObjPositionInParent']
    + ------------------------------------------------------------
    + Catalog:  portal_catalog
      Indexing: /plone/Members/test_user_1_/sub ['getObjPositionInParent']
      ------------------------------------------------------------
      Catalog:  portal_catalog
      Indexing: /plone/Members/test_user_1_/new_doc2 ['getObjPositionInParent']
      ------------------------------------------------------------
    - Catalog:  portal_catalog
    - Indexing: /plone/Members/test_user_1_/new_folder2 ['getObjPositionInParent']
    - ------------------------------------------------------------
    - Catalog:  portal_catalog
    - Indexing: /plone/Members/test_user_1_/new_folder11 ['getObjPositionInParent']
    - ------------------------------------------------------------
----------------------------------------------------------------------
File "/home/stefan/autotest/temp/python24-zope210-cmf21-plone33next/eggs/Products.Archetypes-1.5.15-py2.4.egg/Products/Archetypes/tests/reindex_sanity_plone21.txt", line 416, in reindex_sanity_plone21.txt
Failed example:
    self.folder.manage_renameObjects(ids=['new_btree_folder1'],
                                     new_ids=['new_btree_folder11'])
Differences (ndiff with -expected +actual):
      Catalog:    uid_catalog
      UnIndexing: Members/test_user_1_/new_btree_folder1
      ------------------------------------------------------------
      Catalog:    portal_catalog
      UnIndexing: /plone/Members/test_user_1_/new_btree_folder1
      ------------------------------------------------------------
      Catalog:  uid_catalog
      Indexing: Members/test_user_1_/new_btree_folder11 []
      ------------------------------------------------------------
      Catalog:  portal_catalog
      Indexing: /plone/Members/test_user_1_/new_btree_folder11 []
      ------------------------------------------------------------
      Catalog:  portal_catalog
    - Indexing: /plone/Members/test_user_1_/sub ['getObjPositionInParent']
    - ------------------------------------------------------------
    - Catalog:  portal_catalog
    - Indexing: /plone/Members/test_user_1_/new_doc2 ['getObjPositionInParent']
    - ------------------------------------------------------------
    - Catalog:  portal_catalog
      Indexing: /plone/Members/test_user_1_/new_folder2 ['getObjPositionInParent']
      ------------------------------------------------------------
      Catalog:  portal_catalog
      Indexing: /plone/Members/test_user_1_/new_btree_folder2 ['getObjPositionInParent']
      ------------------------------------------------------------
      Catalog:  portal_catalog
      Indexing: /plone/Members/test_user_1_/new_btree_folder11 ['getObjPositionInParent']
      ------------------------------------------------------------
    + Catalog:  portal_catalog
    + Indexing: /plone/Members/test_user_1_/sub ['getObjPositionInParent']
    + ------------------------------------------------------------
    + Catalog:  portal_catalog
    + Indexing: /plone/Members/test_user_1_/new_doc2 ['getObjPositionInParent']
    + ------------------------------------------------------------

  Ran 539 tests with 1 failures and 0 errors in 62.029 seconds.
Tearing down left over layers:
  Tear down Products.PloneTestCase.layer.PloneSite in 0.301 seconds.
  Tear down Products.PloneTestCase.layer.ZCML in 0.006 seconds.
Total: 617 tests, 1 failures, 0 errors

FAILED (failures=1)




More information about the Testbot mailing list