[Testbot] FAILED (90 packages, 2 failures) : Plone-4.0 Zope-2.12 Python-2.6.4

Plone Tests plone-tests at epy.co.at
Sat Feb 27 02:39:23 UTC 2010


Plone Tests : FAILED (90 packages, 2 failures)
Plone-4.0 Zope-2.12 Python-2.6.4

Running ./bin/alltests -q --no-color --no-progress
Running Products.CMFTestCase.layer.CMFSite tests:
  Set up Testing.ZopeTestCase.layer.ZopeLite in 1.132 seconds.
  Set up Products.CMFTestCase.layer.ZCML in 3.242 seconds.
  Set up Products.CMFTestCase.layer.CMFSite in 1.502 seconds.
  Ran 31 tests with 0 failures and 0 errors in 0.543 seconds.
Running Products.PloneTestCase.layer.PloneSite tests:
  Tear down Products.CMFTestCase.layer.CMFSite in 0.064 seconds.
  Tear down Products.CMFTestCase.layer.ZCML in 0.004 seconds.
  Set up Products.PloneTestCase.layer.ZCML in 3.217 seconds.
  Set up Products.PloneTestCase.layer.PloneSite in 3.708 seconds.
  Ran 712 tests with 0 failures and 0 errors in 1 minutes 5.660 seconds.
Tearing down left over layers:
  Tear down Products.PloneTestCase.layer.PloneSite in 0.341 seconds.
  Tear down Products.PloneTestCase.layer.ZCML in 0.010 seconds.
  Tear down Testing.ZopeTestCase.layer.ZopeLite in 0.000 seconds.
Total: 743 tests, 0 failures, 0 errors in 1 minutes 19.937 seconds.
Running Testing.ZopeTestCase.layer.ZopeLite tests:
  Set up Testing.ZopeTestCase.layer.ZopeLite in 0.827 seconds.
  Ran 43 tests with 0 failures and 0 errors in 0.106 seconds.
Running Products.Archetypes.tests.layer.ZCML tests:
  Set up Products.CMFCore.testing.FunctionalZCMLLayer in 0.190 seconds.
  Set up Products.Archetypes.tests.layer.ZCML in 0.180 seconds.
  Ran 59 tests with 0 failures and 0 errors in 1.157 seconds.
Running Products.Archetypes.tests.layer.ArchetypesSite tests:
  Set up Products.Archetypes.tests.layer.ArchetypesSite in 1.425 seconds.
/home/stefan/autotest/temp/python26-zope212-cmf22-plone40/eggs/Zope2-2.12.3-py2.6-linux-x86_64.egg/OFS/subscribers.py:73: DeprecationWarning: Products.Archetypes.tests.test_classgen.Dummy.manage_afterAdd is discouraged. You should use event subscribers instead.
  DeprecationWarning)
/home/stefan/autotest/temp/python26-zope212-cmf22-plone40/eggs/Zope2-2.12.3-py2.6-linux-x86_64.egg/OFS/subscribers.py:73: DeprecationWarning: Products.Archetypes.tests.test_annotation.AnnDummy.manage_afterAdd is discouraged. You should use event subscribers instead.
  DeprecationWarning)
/home/stefan/autotest/temp/python26-zope212-cmf22-plone40/eggs/Zope2-2.12.3-py2.6-linux-x86_64.egg/OFS/subscribers.py:73: DeprecationWarning: Products.Archetypes.tests.test_event.Dummy.manage_afterAdd is discouraged. You should use event subscribers instead.
  DeprecationWarning)
  Ran 517 tests with 0 failures and 0 errors in 34.927 seconds.
Running Products.PloneTestCase.layer.PloneSite tests:
  Tear down Products.Archetypes.tests.layer.ArchetypesSite in 0.061 seconds.
  Tear down Products.Archetypes.tests.layer.ZCML in 0.004 seconds.
  Tear down Products.CMFCore.testing.FunctionalZCMLLayer in 0.000 seconds.
  Set up Products.PloneTestCase.layer.ZCML in 2.386 seconds.
  Set up Products.PloneTestCase.layer.PloneSite in 3.686 seconds.
  Ran 9 tests with 0 failures and 0 errors in 0.980 seconds.
Running plone.app.kss.tests.kss_and_plone_layer.KSSAndPloneLayer tests:
  Set up plone.app.kss.tests.kss_and_plone_layer.KSSAndPloneLayer in 0.005 seconds.


Failure in test testVersionPreviewIsNotInlineEditable (archetypes.kss.tests.test_fields.FieldsViewTestCase)
Traceback (most recent call last):
  File "/usr/local/python2.6/lib/python2.6/unittest.py", line 279, in run
    testMethod()
  File "/home/stefan/autotest/temp/python26-zope212-cmf22-plone40/src/archetypes.kss/archetypes/kss/tests/test_fields.py", line 279, in testVersionPreviewIsNotInlineEditable
    self.fail("The version form doesn't contain the title anymore, see "
  File "/usr/local/python2.6/lib/python2.6/unittest.py", line 317, in fail
    raise self.failureException, msg
AssertionError: The version form doesn't contain the title anymore, see http://dev.plone.org/plone/ticket/10234.

  Ran 19 tests with 1 failures and 0 errors in 1.336 seconds.
Running zope.testing.testrunner.layer.UnitTests tests:
  Tear down plone.app.kss.tests.kss_and_plone_layer.KSSAndPloneLayer in 0.000 seconds.
  Tear down Products.PloneTestCase.layer.PloneSite in 0.334 seconds.
  Tear down Products.PloneTestCase.layer.ZCML in 0.005 seconds.
  Tear down Testing.ZopeTestCase.layer.ZopeLite in 0.000 seconds.
  Set up zope.testing.testrunner.layer.UnitTests in 0.000 seconds.
/home/stefan/autotest/temp/python26-zope212-cmf22-plone40/src/Products.Archetypes/Products/Archetypes/ClassGen.py:152: UserWarning: The method 'makeFoo' was already protected by a different permission than the one declared on the field. Assuming that the explicit permission declared is the correct one and has preference over the permission declared on the field.
  self.handle_mode(klass, generator, type, field, mode)
  Ran 28 tests with 0 failures and 0 errors in 0.188 seconds.
Tearing down left over layers:
  Tear down zope.testing.testrunner.layer.UnitTests in 0.000 seconds.
Total: 675 tests, 1 failures, 0 errors in 49.182 seconds.
Running Testing.ZopeTestCase.layer.ZopeLite tests:
  Set up Testing.ZopeTestCase.layer.ZopeLite in 0.092 seconds.
  Ran 283 tests with 0 failures and 0 errors in 1.298 seconds.
Running Products.CMFCalendar.testing.FunctionalLayer tests:
  Set up Products.CMFCore.testing.FunctionalZCMLLayer in 0.168 seconds.
  Set up Products.CMFCalendar.testing.FunctionalLayer in 0.327 seconds.
  Ran 24 tests with 0 failures and 0 errors in 1.415 seconds.
Running Products.CMFCore.testing.EventZCMLLayer tests:
  Tear down Products.CMFCalendar.testing.FunctionalLayer in 0.026 seconds.
  Tear down Products.CMFCore.testing.FunctionalZCMLLayer in 0.001 seconds.
  Set up Products.CMFCore.testing.EventZCMLLayer in 0.001 seconds.
  Ran 8 tests with 0 failures and 0 errors in 0.200 seconds.
Running Products.CMFCore.testing.ExportImportZCMLLayer tests:
  Tear down Products.CMFCore.testing.EventZCMLLayer in 0.000 seconds.
  Set up Products.CMFCore.testing.ExportImportZCMLLayer in 0.001 seconds.
  Ran 10 tests with 0 failures and 0 errors in 0.929 seconds.
Running Products.CMFCore.testing.TraversingEventZCMLLayer tests:
  Tear down Products.CMFCore.testing.ExportImportZCMLLayer in 0.000 seconds.
  Set up Products.CMFCore.testing.TraversingEventZCMLLayer in 0.001 seconds.
  Ran 5 tests with 0 failures and 0 errors in 0.159 seconds.
Running Products.CMFDefault.testing.FunctionalLayer tests:
  Tear down Products.CMFCore.testing.TraversingEventZCMLLayer in 0.000 seconds.
  Set up Products.CMFCore.testing.FunctionalZCMLLayer in 0.153 seconds.
  Set up Products.CMFDefault.testing.FunctionalLayer in 0.244 seconds.
  Ran 76 tests with 0 failures and 0 errors in 3.732 seconds.
Running Products.CMFUid.testing.UidEventZCMLLayer tests:
  Tear down Products.CMFDefault.testing.FunctionalLayer in 0.023 seconds.
  Tear down Products.CMFCore.testing.FunctionalZCMLLayer in 0.002 seconds.
  Set up Products.CMFUid.testing.UidEventZCMLLayer in 0.001 seconds.
  Ran 12 tests with 0 failures and 0 errors in 0.316 seconds.
Running Products.DCWorkflow.testing.ExportImportZCMLLayer tests:
  Tear down Products.CMFUid.testing.UidEventZCMLLayer in 0.000 seconds.
  Set up Products.DCWorkflow.testing.ExportImportZCMLLayer in 0.141 seconds.
  Ran 38 tests with 0 failures and 0 errors in 0.730 seconds.
Running Products.GenericSetup.testing.ExportImportZCMLLayer tests:
  Tear down Products.DCWorkflow.testing.ExportImportZCMLLayer in 0.000 seconds.
  Set up Products.GenericSetup.testing.ExportImportZCMLLayer in 0.081 seconds.
  Ran 186 tests with 0 failures and 0 errors in 0.579 seconds.
Running zope.testing.testrunner.layer.UnitTests tests:
  Tear down Products.GenericSetup.testing.ExportImportZCMLLayer in 0.000 seconds.
  Tear down Testing.ZopeTestCase.layer.ZopeLite in 0.000 seconds.
  Set up zope.testing.testrunner.layer.UnitTests in 0.000 seconds.
  Ran 346 tests with 0 failures and 0 errors in 0.257 seconds.
Tearing down left over layers:
  Tear down zope.testing.testrunner.layer.UnitTests in 0.000 seconds.
Total: 988 tests, 0 failures, 0 errors in 12.157 seconds.
Running Testing.ZopeTestCase.layer.ZopeLite tests:
  Set up Testing.ZopeTestCase.layer.ZopeLite in 0.924 seconds.
  Ran 27 tests with 0 failures and 0 errors in 0.055 seconds.
Running Products.PloneTestCase.layer.PloneSite tests:
  Set up Products.PloneTestCase.layer.ZCML in 2.469 seconds.
  Set up Products.PloneTestCase.layer.PloneSite in 4.803 seconds.
/home/stefan/autotest/temp/python26-zope212-cmf22-plone40/eggs/Zope2-2.12.3-py2.6-linux-x86_64.egg/OFS/subscribers.py:73: DeprecationWarning: Products.FAQ.FAQ.FAQ.manage_afterAdd is discouraged. You should use event subscribers instead.
  DeprecationWarning)
/home/stefan/autotest/temp/python26-zope212-cmf22-plone40/eggs/Zope2-2.12.3-py2.6-linux-x86_64.egg/OFS/subscribers.py:73: DeprecationWarning: Products.FAQ.FAQQuestion.FAQQuestion.manage_afterAdd is discouraged. You should use event subscribers instead.
  DeprecationWarning)
  Ran 139 tests with 0 failures and 0 errors in 21.269 seconds.
Running Products.CMFDiffTool.tests.BaseTestCase.CMFDiffToolLayer tests:
  Set up Products.CMFDiffTool.tests.BaseTestCase.CMFDiffToolLayer in 0.013 seconds.
  Ran 2 tests with 0 failures and 0 errors in 0.217 seconds.
Running Products.CMFTestCase.layer.CMFSite tests:
  Tear down Products.CMFDiffTool.tests.BaseTestCase.CMFDiffToolLayer in 0.349 seconds.
  Tear down Products.PloneTestCase.layer.PloneSite in 0.006 seconds.
  Tear down Products.PloneTestCase.layer.ZCML in 0.004 seconds.
  Set up Products.CMFTestCase.layer.ZCML in 1.781 seconds.
  Set up Products.CMFTestCase.layer.CMFSite in 1.327 seconds.
  Ran 20 tests with 0 failures and 0 errors in 0.393 seconds.
Running plone.app.blob.tests.layer.BlobReplacementLayer tests:
  Tear down Products.CMFTestCase.layer.CMFSite in 0.064 seconds.
  Tear down Products.CMFTestCase.layer.ZCML in 0.003 seconds.
  Set up Products.PloneTestCase.layer.ZCML in 1.796 seconds.
  Set up Products.PloneTestCase.layer.PloneSite in 3.889 seconds.
  Set up plone.app.blob.tests.layer.BlobLayer in 0.080 seconds.
  Set up plone.app.blob.tests.layer.BlobReplacementLayer in 0.193 seconds.
  Ran 6 tests with 0 failures and 0 errors in 1.785 seconds.
Running zope.testing.testrunner.layer.UnitTests tests:
  Tear down plone.app.blob.tests.layer.BlobReplacementLayer in 0.000 seconds.
  Tear down plone.app.blob.tests.layer.BlobLayer in 0.000 seconds.
  Tear down Products.PloneTestCase.layer.PloneSite in 0.361 seconds.
  Tear down Products.PloneTestCase.layer.ZCML in 0.004 seconds.
  Tear down Testing.ZopeTestCase.layer.ZopeLite in 0.000 seconds.
  Set up zope.testing.testrunner.layer.UnitTests in 0.000 seconds.
  Ran 10 tests with 0 failures and 0 errors in 0.005 seconds.
Tearing down left over layers:
  Tear down zope.testing.testrunner.layer.UnitTests in 0.000 seconds.
Total: 204 tests, 0 failures, 0 errors in 43.037 seconds.
Running Testing.ZopeTestCase.layer.ZopeLite tests:
  Set up Testing.ZopeTestCase.layer.ZopeLite in 0.576 seconds.
  Ran 126 tests with 0 failures and 0 errors in 0.760 seconds.
Running Products.CMFTestCase.layer.CMFSite tests:
  Set up Products.CMFTestCase.layer.ZCML in 2.380 seconds.
  Set up Products.CMFTestCase.layer.CMFSite in 0.233 seconds.
  Ran 58 tests with 0 failures and 0 errors in 1.901 seconds.
Running Products.PloneTestCase.layer.ZCML tests:
  Tear down Products.CMFTestCase.layer.CMFSite in 0.039 seconds.
  Tear down Products.CMFTestCase.layer.ZCML in 0.004 seconds.
  Set up Products.PloneTestCase.layer.ZCML in 1.804 seconds.
  Ran 12 tests with 0 failures and 0 errors in 0.016 seconds.
Running Products.PloneTestCase.layer.PloneSite tests:
  Set up Products.PloneTestCase.layer.PloneSite in 4.096 seconds.
/home/stefan/autotest/temp/python26-zope212-cmf22-plone40/src/Products.PortalTransforms/Products/PortalTransforms/libtransforms/commandtransform.py:97: DeprecationWarning: os.popen4 is deprecated.  Use the subprocess module.
  cin, couterr = os.popen4(command, 'b')


Error in test testRepositionRecursiveGroupsPlugin (plone.app.upgrade.v40.tests.TestMigrations_v4_0beta1)
Traceback (most recent call last):
  File "/usr/local/python2.6/lib/python2.6/unittest.py", line 279, in run
    testMethod()
  File "/home/stefan/autotest/temp/python26-zope212-cmf22-plone40/src/plone.app.upgrade/plone/app/upgrade/v40/tests.py", line 425, in testRepositionRecursiveGroupsPlugin
    plugins.activatePlugin(IGroupsPlugin, 'recursive_groups')
  File "/home/stefan/autotest/temp/python26-zope212-cmf22-plone40/eggs/Products.PluginRegistry-1.2-py2.6.egg/Products/PluginRegistry/PluginRegistry.py", line 157, in activatePlugin
    raise KeyError, 'Duplicate plugin id: %s' % plugin_id
KeyError: 'Duplicate plugin id: recursive_groups'



Failure in test testListFolderContentsIsNotAcquiredInPrivateState (plone.app.workflow.tests.test_folder_workflow.TestFolderWorkflow)
Traceback (most recent call last):
  File "/usr/local/python2.6/lib/python2.6/unittest.py", line 279, in run
    testMethod()
  File "/home/stefan/autotest/temp/python26-zope212-cmf22-plone40/eggs/plone.app.workflow-2.0b1-py2.6.egg/plone/app/workflow/tests/test_folder_workflow.py", line 379, in testListFolderContentsIsNotAcquiredInPrivateState
    self.assertEqual(self.dir.acquiredRolesAreUsedBy(ListFolderContents), '')
  File "/usr/local/python2.6/lib/python2.6/unittest.py", line 350, in failUnlessEqual
    (msg or '%r != %r' % (first, second))
AssertionError: 'CHECKED' != ''



Failure in test testListFolderContentsIsNotAcquiredInPublishedState (plone.app.workflow.tests.test_folder_workflow.TestFolderWorkflow)
Traceback (most recent call last):
  File "/usr/local/python2.6/lib/python2.6/unittest.py", line 279, in run
    testMethod()
  File "/home/stefan/autotest/temp/python26-zope212-cmf22-plone40/eggs/plone.app.workflow-2.0b1-py2.6.egg/plone/app/workflow/tests/test_folder_workflow.py", line 397, in testListFolderContentsIsNotAcquiredInPublishedState
    self.assertEqual(self.dir.acquiredRolesAreUsedBy(ListFolderContents), '')
  File "/usr/local/python2.6/lib/python2.6/unittest.py", line 350, in failUnlessEqual
    (msg or '%r != %r' % (first, second))
AssertionError: 'CHECKED' != ''



Failure in test testListFolderContentsIsNotAcquiredInVisibleState (plone.app.workflow.tests.test_folder_workflow.TestFolderWorkflow)
Traceback (most recent call last):
  File "/usr/local/python2.6/lib/python2.6/unittest.py", line 279, in run
    testMethod()
  File "/home/stefan/autotest/temp/python26-zope212-cmf22-plone40/eggs/plone.app.workflow-2.0b1-py2.6.egg/plone/app/workflow/tests/test_folder_workflow.py", line 361, in testListFolderContentsIsNotAcquiredInVisibleState
    self.assertEqual(self.dir.acquiredRolesAreUsedBy(ListFolderContents), '')
  File "/usr/local/python2.6/lib/python2.6/unittest.py", line 350, in failUnlessEqual
    (msg or '%r != %r' % (first, second))
AssertionError: 'CHECKED' != ''



Failure in test testListPrivateFolderContents (plone.app.workflow.tests.test_folder_workflow.TestFolderWorkflow)
Traceback (most recent call last):
  File "/usr/local/python2.6/lib/python2.6/unittest.py", line 279, in run
    testMethod()
  File "/home/stefan/autotest/temp/python26-zope212-cmf22-plone40/eggs/plone.app.workflow-2.0b1-py2.6.egg/plone/app/workflow/tests/test_folder_workflow.py", line 372, in testListPrivateFolderContents
    self.failIf(checkPerm(ListFolderContents, self.dir))
  File "/usr/local/python2.6/lib/python2.6/unittest.py", line 321, in failIf
    if expr: raise self.failureException, msg
AssertionError



Failure in test testListPublishedFolderContents (plone.app.workflow.tests.test_folder_workflow.TestFolderWorkflow)
Traceback (most recent call last):
  File "/usr/local/python2.6/lib/python2.6/unittest.py", line 279, in run
    testMethod()
  File "/home/stefan/autotest/temp/python26-zope212-cmf22-plone40/eggs/plone.app.workflow-2.0b1-py2.6.egg/plone/app/workflow/tests/test_folder_workflow.py", line 387, in testListPublishedFolderContents
    self.failUnless(checkPerm(ListFolderContents, self.dir))
  File "/usr/local/python2.6/lib/python2.6/unittest.py", line 325, in failUnless
    if not expr: raise self.failureException, msg
AssertionError



Failure in test testListVisibleFolderContents (plone.app.workflow.tests.test_folder_workflow.TestFolderWorkflow)
Traceback (most recent call last):
  File "/usr/local/python2.6/lib/python2.6/unittest.py", line 279, in run
    testMethod()
  File "/home/stefan/autotest/temp/python26-zope212-cmf22-plone40/eggs/plone.app.workflow-2.0b1-py2.6.egg/plone/app/workflow/tests/test_folder_workflow.py", line 352, in testListVisibleFolderContents
    self.failUnless(checkPerm(ListFolderContents, self.dir))
  File "/usr/local/python2.6/lib/python2.6/unittest.py", line 325, in failUnless
    if not expr: raise self.failureException, msg
AssertionError

  Ran 1844 tests with 6 failures and 1 errors in 3 minutes 40.300 seconds.
Running plone.app.contentrules.tests.test_configuration.TestContentrulesGSLayer tests:
  Set up plone.app.contentrules.tests.test_configuration.TestContentrulesGSLayer in 0.002 seconds.
  Ran 6 tests with 0 failures and 0 errors in 2.444 seconds.
Running plone.app.customerize.tests.layer.PloneCustomerize tests:
  Tear down plone.app.contentrules.tests.test_configuration.TestContentrulesGSLayer in 0.000 seconds.
  Set up plone.app.customerize.tests.layer.PloneCustomerize in 0.000 seconds.
  Ran 27 tests with 0 failures and 0 errors in 2.614 seconds.
Running plone.app.kss.tests.kss_and_plone_layer.KSSAndPloneLayer tests:
  Tear down plone.app.customerize.tests.layer.PloneCustomerize in 0.000 seconds.
  Set up plone.app.kss.tests.kss_and_plone_layer.KSSAndPloneLayer in 0.005 seconds.
  Ran 13 tests with 0 failures and 0 errors in 1.142 seconds.
Running plone.app.upgrade.tests.base.FunctionalUpgradeLayer tests:
  Tear down plone.app.kss.tests.kss_and_plone_layer.KSSAndPloneLayer in 0.000 seconds.
  Set up plone.app.upgrade.tests.base.FunctionalUpgradeLayer in 0.000 seconds.
  Ran 11 tests with 0 failures and 0 errors in 55.602 seconds.
Running plone.app.viewletmanager.tests.test_exportimport.Layer tests:
  Tear down plone.app.upgrade.tests.base.FunctionalUpgradeLayer in 0.000 seconds.
  Tear down Products.PloneTestCase.layer.PloneSite in 0.364 seconds.
  Tear down Products.PloneTestCase.layer.ZCML in 0.015 seconds.
  Tear down Testing.ZopeTestCase.layer.ZopeLite in 0.000 seconds.
  Set up plone.app.viewletmanager.tests.test_exportimport.Layer in 0.000 seconds.
  Ran 16 tests with 0 failures and 0 errors in 0.050 seconds.
Running zope.testing.testrunner.layer.UnitTests tests:
  Tear down plone.app.viewletmanager.tests.test_exportimport.Layer in 0.000 seconds.
  Set up zope.testing.testrunner.layer.UnitTests in 0.000 seconds.
  Ran 144 tests with 0 failures and 0 errors in 0.858 seconds.
Tearing down left over layers:
  Tear down zope.testing.testrunner.layer.UnitTests in 0.000 seconds.
Total: 2257 tests, 6 failures, 1 errors in 4 minutes 58.834 seconds.
Running Testing.ZopeTestCase.layer.ZopeLite tests:
  Set up Testing.ZopeTestCase.layer.ZopeLite in 1.477 seconds.
  Ran 165 tests with 0 failures and 0 errors in 0.627 seconds.
Running Products.PloneTestCase.layer.ZCML tests:
  Set up Products.PloneTestCase.layer.ZCML in 2.405 seconds.
  Ran 34 tests with 0 failures and 0 errors in 0.208 seconds.
Running Products.PlonePAS.tests.layer.PlonePASLayer tests:
  Set up Products.PloneTestCase.layer.PloneSite in 3.645 seconds.
  Set up Products.PlonePAS.tests.layer.PlonePASLayer in 0.000 seconds.
  Ran 153 tests with 0 failures and 0 errors in 2.037 seconds.
Running zope.testing.testrunner.layer.UnitTests tests:
  Tear down Products.PlonePAS.tests.layer.PlonePASLayer in 0.000 seconds.
  Tear down Products.PloneTestCase.layer.PloneSite in 0.329 seconds.
  Tear down Products.PloneTestCase.layer.ZCML in 0.004 seconds.
  Tear down Testing.ZopeTestCase.layer.ZopeLite in 0.000 seconds.
  Set up zope.testing.testrunner.layer.UnitTests in 0.000 seconds.
  Ran 337 tests with 0 failures and 0 errors in 0.719 seconds.
Tearing down left over layers:
  Tear down zope.testing.testrunner.layer.UnitTests in 0.000 seconds.
Total: 689 tests, 0 failures, 0 errors in 12.228 seconds.
Running Products.PloneTestCase.layer.PloneSite tests:
  Set up Testing.ZopeTestCase.layer.ZopeLite in 1.404 seconds.
  Set up Products.PloneTestCase.layer.ZCML in 2.461 seconds.
  Set up Products.PloneTestCase.layer.PloneSite in 4.099 seconds.
/home/stefan/autotest/temp/python26-zope212-cmf22-plone40/eggs/borg.localrole-3.0a1-py2.6.egg/borg/localrole/bbb/bbb.txt:1: DeprecationWarning: IWorkspace is deprecated. Please use borg.localrole.interfaces.ILocalRoleProvider instead
  =========
/home/stefan/autotest/temp/python26-zope212-cmf22-plone40/eggs/borg.localrole-3.0a1-py2.6.egg/borg/localrole/bbb/bbb.txt:1: DeprecationWarning: IGroupAwareWorkspace is deprecated. Please use borg.localrole.interfaces.ILocalRoleProvider instead
  =========
  Ran 39 tests with 0 failures and 0 errors in 0.197 seconds.
Running plone.browserlayer.tests.test_doctest.PloneBrowserLayerLayer tests:
  Set up plone.browserlayer.tests.test_doctest.PloneBrowserLayerLayer in 0.003 seconds.
  Ran 9 tests with 0 failures and 0 errors in 0.713 seconds.
Running plone.theme.tests.test_doctest.PloneThemeLayer tests:
  Tear down plone.browserlayer.tests.test_doctest.PloneBrowserLayerLayer in 0.000 seconds.
  Set up plone.theme.tests.test_doctest.PloneThemeLayer in 0.003 seconds.
  Ran 5 tests with 0 failures and 0 errors in 0.044 seconds.
Running zope.testing.testrunner.layer.UnitTests tests:
  Tear down plone.theme.tests.test_doctest.PloneThemeLayer in 0.000 seconds.
  Tear down Products.PloneTestCase.layer.PloneSite in 0.327 seconds.
  Tear down Products.PloneTestCase.layer.ZCML in 0.004 seconds.
  Tear down Testing.ZopeTestCase.layer.ZopeLite in 0.000 seconds.
  Set up zope.testing.testrunner.layer.UnitTests in 0.000 seconds.
/usr/local/python2.6/lib/python2.6/mhlib.py:83: DeprecationWarning: the multifile module has been deprecated since Python 2.5
  import multifile
  Ran 252 tests with 0 failures and 0 errors in 0.826 seconds.
Tearing down left over layers:
  Tear down zope.testing.testrunner.layer.UnitTests in 0.000 seconds.
Total: 305 tests, 0 failures, 0 errors in 10.965 seconds.
Running Products.PloneTestCase.layer.PloneSite tests:
  Set up Testing.ZopeTestCase.layer.ZopeLite in 0.908 seconds.
  Set up Products.PloneTestCase.layer.ZCML in 2.387 seconds.
  Set up Products.PloneTestCase.layer.PloneSite in 3.959 seconds.
/usr/local/python2.6/lib/python2.6/unittest.py:279: DeprecationWarning: The use of 'hide' has been deprecated and will be removed in plone.portlet.static 2.0. Instead, use the new generic built-in show/hide setting of plone.portlets.
  testMethod()
  Ran 165 tests with 0 failures and 0 errors in 14.836 seconds.
Running plone.app.portlets.tests.test_configuration.TestPortletZCMLLayer tests:
  Set up plone.app.portlets.tests.test_configuration.TestPortletZCMLLayer in 0.006 seconds.
  Ran 5 tests with 0 failures and 0 errors in 0.042 seconds.
Running plone.app.portlets.tests.test_configuration.TestPortletGSLayer tests:
  Set up plone.app.portlets.tests.test_configuration.TestPortletGSLayer in 1.354 seconds.
  Ran 13 tests with 0 failures and 0 errors in 3.719 seconds.
Running zope.testing.testrunner.layer.UnitTests tests:
  Tear down plone.app.portlets.tests.test_configuration.TestPortletGSLayer in 0.000 seconds.
  Tear down plone.app.portlets.tests.test_configuration.TestPortletZCMLLayer in 0.000 seconds.
  Tear down Products.PloneTestCase.layer.PloneSite in 0.338 seconds.
  Tear down Products.PloneTestCase.layer.ZCML in 0.005 seconds.
  Tear down Testing.ZopeTestCase.layer.ZopeLite in 0.000 seconds.
  Set up zope.testing.testrunner.layer.UnitTests in 0.000 seconds.
  Ran 57 tests with 0 failures and 0 errors in 0.149 seconds.
Tearing down left over layers:
  Tear down zope.testing.testrunner.layer.UnitTests in 0.000 seconds.
Total: 240 tests, 0 failures, 0 errors in 28.545 seconds.
Running zope.testing.testrunner.layer.UnitTests tests:
  Set up zope.testing.testrunner.layer.UnitTests in 0.000 seconds.
  Ran 3 tests with 0 failures and 0 errors in 12.393 seconds.
Tearing down left over layers:
  Tear down zope.testing.testrunner.layer.UnitTests in 0.000 seconds.
Running Products.PloneTestCase.layer.PloneSite tests:
  Set up Testing.ZopeTestCase.layer.ZopeLite in 0.000 seconds.
  Set up Products.PloneTestCase.layer.ZCML in 1.895 seconds.
  Set up Products.PloneTestCase.layer.PloneSite in 4.519 seconds.
  Ran 23 tests with 0 failures and 0 errors in 2.738 seconds.
Running Products.CMFPlacefulWorkflow.tests.test_exportimport.ExportImportLayer tests:
  Set up Products.CMFPlacefulWorkflow.tests.test_exportimport.ExportImportLayer in 0.001 seconds.
  Ran 12 tests with 0 failures and 0 errors in 0.911 seconds.
Tearing down left over layers:
  Tear down Products.CMFPlacefulWorkflow.tests.test_exportimport.ExportImportLayer in 0.000 seconds.
  Tear down Products.PloneTestCase.layer.PloneSite in 0.340 seconds.
  Tear down Products.PloneTestCase.layer.ZCML in 0.004 seconds.
  Tear down Testing.ZopeTestCase.layer.ZopeLite in 0.000 seconds.
Total: 35 tests, 0 failures, 0 errors in 10.850 seconds.
Running Products.CMFTestCase.layer.CMFSite tests:
  Set up Testing.ZopeTestCase.layer.ZopeLite in 0.235 seconds.
  Set up Products.CMFTestCase.layer.ZCML in 0.391 seconds.
  Set up Products.CMFTestCase.layer.CMFSite in 0.210 seconds.
  Ran 58 tests with 0 failures and 0 errors in 0.227 seconds.
Tearing down left over layers:
  Tear down Products.CMFTestCase.layer.CMFSite in 0.025 seconds.
  Tear down Products.CMFTestCase.layer.ZCML in 0.001 seconds.
  Tear down Testing.ZopeTestCase.layer.ZopeLite in 0.000 seconds.
Running zope.testing.testrunner.layer.UnitTests tests:
  Set up zope.testing.testrunner.layer.UnitTests in 0.000 seconds.
  Ran 35 tests with 0 failures and 0 errors in 0.026 seconds.
Tearing down left over layers:
  Tear down zope.testing.testrunner.layer.UnitTests in 0.000 seconds.
Running Products.PloneTestCase.layer.PloneSite tests:
  Set up Testing.ZopeTestCase.layer.ZopeLite in 1.367 seconds.
  Set up Products.PloneTestCase.layer.ZCML in 2.457 seconds.
  Set up Products.PloneTestCase.layer.PloneSite in 3.870 seconds.
  Ran 38 tests with 0 failures and 0 errors in 3.961 seconds.
Tearing down left over layers:
  Tear down Products.PloneTestCase.layer.PloneSite in 0.337 seconds.
  Tear down Products.PloneTestCase.layer.ZCML in 0.006 seconds.
  Tear down Testing.ZopeTestCase.layer.ZopeLite in 0.000 seconds.
Running Products.PloneTestCase.layer.PloneSite tests:
  Set up Testing.ZopeTestCase.layer.ZopeLite in 1.465 seconds.
  Set up Products.PloneTestCase.layer.ZCML in 2.461 seconds.
  Set up Products.PloneTestCase.layer.PloneSite in 3.882 seconds.
/home/stefan/autotest/temp/python26-zope212-cmf22-plone40/src/Products.PlonePAS/Products/PlonePAS/tools/membership.py:555: DeprecationWarning: credentialsChanged should be called with 'REQUEST' as second argument. The BBB code will be removed in CMF 2.3.
  self.credentialsChanged(password, REQUEST=REQUEST)
  Ran 61 tests with 0 failures and 0 errors in 1.280 seconds.
Tearing down left over layers:
  Tear down Products.PloneTestCase.layer.PloneSite in 0.336 seconds.
  Tear down Products.PloneTestCase.layer.ZCML in 0.004 seconds.
  Tear down Testing.ZopeTestCase.layer.ZopeLite in 0.000 seconds.
Running Products.PloneTestCase.layer.PloneSite tests:
  Set up Testing.ZopeTestCase.layer.ZopeLite in 1.433 seconds.
  Set up Products.PloneTestCase.layer.ZCML in 2.496 seconds.
  Set up Products.PloneTestCase.layer.PloneSite in 3.989 seconds.
  Ran 245 tests with 0 failures and 0 errors in 15.314 seconds.
Running zope.testing.testrunner.layer.UnitTests tests:
  Tear down Products.PloneTestCase.layer.PloneSite in 0.342 seconds.
  Tear down Products.PloneTestCase.layer.ZCML in 0.004 seconds.
  Tear down Testing.ZopeTestCase.layer.ZopeLite in 0.000 seconds.
  Set up zope.testing.testrunner.layer.UnitTests in 0.000 seconds.
  Ran 59 tests with 0 failures and 0 errors in 0.013 seconds.
Tearing down left over layers:
  Tear down zope.testing.testrunner.layer.UnitTests in 0.000 seconds.
Total: 304 tests, 0 failures, 0 errors in 24.019 seconds.
Running Products.PloneTestCase.layer.PloneSite tests:
  Set up Testing.ZopeTestCase.layer.ZopeLite in 1.418 seconds.
  Set up Products.PloneTestCase.layer.ZCML in 2.606 seconds.
  Set up Products.PloneTestCase.layer.PloneSite in 3.885 seconds.
  Ran 78 tests with 0 failures and 0 errors in 2.701 seconds.
Tearing down left over layers:
  Tear down Products.PloneTestCase.layer.PloneSite in 0.333 seconds.
  Tear down Products.PloneTestCase.layer.ZCML in 0.007 seconds.
  Tear down Testing.ZopeTestCase.layer.ZopeLite in 0.000 seconds.
Running zope.testing.testrunner.layer.UnitTests tests:
  Set up zope.testing.testrunner.layer.UnitTests in 0.000 seconds.
  Ran 76 tests with 0 failures and 0 errors in 1.584 seconds.
Tearing down left over layers:
  Tear down zope.testing.testrunner.layer.UnitTests in 0.000 seconds.
Running Products.contentmigration.tests.layer.TestLayer tests:
  Set up Testing.ZopeTestCase.layer.ZopeLite in 1.407 seconds.
  Set up Products.PloneTestCase.layer.ZCML in 2.448 seconds.
  Set up Products.PloneTestCase.layer.PloneSite in 3.878 seconds.
  Set up Products.contentmigration.tests.layer.TestLayer in 0.002 seconds.
  Ran 18 tests with 0 failures and 0 errors in 4.189 seconds.
Tearing down left over layers:
  Tear down Products.contentmigration.tests.layer.TestLayer in 0.000 seconds.
  Tear down Products.PloneTestCase.layer.PloneSite in 0.330 seconds.
  Tear down Products.PloneTestCase.layer.ZCML in 0.004 seconds.
  Tear down Testing.ZopeTestCase.layer.ZopeLite in 0.000 seconds.
Total: 0 tests, 0 failures, 0 errors in 0.000 seconds.
Running archetypes.referencebrowserwidget.tests.base.layer tests:
  Set up Testing.ZopeTestCase.layer.ZopeLite in 0.000 seconds.
  Set up Products.PloneTestCase.layer.ZCML in 1.899 seconds.
  Set up Products.PloneTestCase.layer.PloneSite in 4.066 seconds.
  Set up archetypes.referencebrowserwidget.tests.base.layer in 0.000 seconds.
  Ran 43 tests with 0 failures and 0 errors in 7.431 seconds.
Running zope.testing.testrunner.layer.UnitTests tests:
  Tear down archetypes.referencebrowserwidget.tests.base.layer in 0.000 seconds.
  Tear down Products.PloneTestCase.layer.PloneSite in 0.346 seconds.
  Tear down Products.PloneTestCase.layer.ZCML in 0.007 seconds.
  Tear down Testing.ZopeTestCase.layer.ZopeLite in 0.000 seconds.
  Set up zope.testing.testrunner.layer.UnitTests in 0.000 seconds.
  Ran 4 tests with 0 failures and 0 errors in 0.001 seconds.
Tearing down left over layers:
  Tear down zope.testing.testrunner.layer.UnitTests in 0.000 seconds.
Total: 47 tests, 0 failures, 0 errors in 14.211 seconds.
Running archetypes.schemaextender.tests.testIntegration.layer tests:
  Set up Testing.ZopeTestCase.layer.ZopeLite in 1.328 seconds.
  Set up Products.PloneTestCase.layer.ZCML in 2.469 seconds.
  Set up Products.PloneTestCase.layer.PloneSite in 3.856 seconds.
  Set up archetypes.schemaextender.tests.testIntegration.layer in 0.000 seconds.
  Ran 17 tests with 0 failures and 0 errors in 2.935 seconds.
Running zope.testing.testrunner.layer.UnitTests tests:
  Tear down archetypes.schemaextender.tests.testIntegration.layer in 0.000 seconds.
  Tear down Products.PloneTestCase.layer.PloneSite in 0.335 seconds.
  Tear down Products.PloneTestCase.layer.ZCML in 0.007 seconds.
  Tear down Testing.ZopeTestCase.layer.ZopeLite in 0.000 seconds.
  Set up zope.testing.testrunner.layer.UnitTests in 0.000 seconds.
  Ran 19 tests with 0 failures and 0 errors in 0.006 seconds.
Tearing down left over layers:
  Tear down zope.testing.testrunner.layer.UnitTests in 0.000 seconds.
Total: 36 tests, 0 failures, 0 errors in 11.371 seconds.
Running zope.testing.testrunner.layer.UnitTests tests:
  Set up zope.testing.testrunner.layer.UnitTests in 0.000 seconds.
  Ran 4 tests with 0 failures and 0 errors in 0.039 seconds.
Tearing down left over layers:
  Tear down zope.testing.testrunner.layer.UnitTests in 0.000 seconds.
Running Testing.ZopeTestCase.layer.ZopeLite tests:
  Set up Testing.ZopeTestCase.layer.ZopeLite in 0.068 seconds.
  Ran 40 tests with 0 failures and 0 errors in 0.791 seconds.
Tearing down left over layers:
  Tear down Testing.ZopeTestCase.layer.ZopeLite in 0.000 seconds.
Running Testing.ZopeTestCase.layer.ZopeLite tests:
  Set up Testing.ZopeTestCase.layer.ZopeLite in 0.035 seconds.
  Ran 40 tests with 0 failures and 0 errors in 0.968 seconds.
Running zope.testing.testrunner.layer.UnitTests tests:
  Tear down Testing.ZopeTestCase.layer.ZopeLite in 0.000 seconds.
  Set up zope.testing.testrunner.layer.UnitTests in 0.000 seconds.
  Ran 1 tests with 0 failures and 0 errors in 0.099 seconds.
Tearing down left over layers:
  Tear down zope.testing.testrunner.layer.UnitTests in 0.000 seconds.
Total: 41 tests, 0 failures, 0 errors in 1.278 seconds.
/home/stefan/autotest/temp/python26-zope212-cmf22-plone40/src/kss.core/kss/core/tests/test_kssview_core.py:165: UserWarning: The test_class you are using doesn't subclass from ZopeTestCase.Functional. Please fix that.
  tearDown=KSSViewTestCase.beforeTearDown.im_func))
Running Testing.ZopeTestCase.layer.ZopeLite tests:
  Set up Testing.ZopeTestCase.layer.ZopeLite in 0.047 seconds.
  Ran 1 tests with 0 failures and 0 errors in 0.261 seconds.
Running kss.core.tests.base.KSSLayer tests:
  Tear down Testing.ZopeTestCase.layer.ZopeLite in 0.000 seconds.
  Set up kss.core.tests.base.KSSCoreLayer in 0.031 seconds.
  Set up kss.core.tests.base.KSSLayer in 0.056 seconds.
  Ran 29 tests with 0 failures and 0 errors in 0.154 seconds.
Running kss.core.tests.test_ttwapi.layer tests:
  Set up kss.core.tests.test_ttwapi.layer in 0.001 seconds.
  Ran 3 tests with 0 failures and 0 errors in 0.026 seconds.
Running zope.testing.testrunner.layer.UnitTests tests:
  Tear down kss.core.tests.test_ttwapi.layer in 0.000 seconds.
  Tear down kss.core.tests.base.KSSLayer in 0.000 seconds.
  Tear down kss.core.tests.base.KSSCoreLayer in 0.000 seconds.
  Set up zope.testing.testrunner.layer.UnitTests in 0.000 seconds.
/home/stefan/autotest/temp/python26-zope212-cmf22-plone40/src/kss.core/kss/core/siteview.txt:1: DeprecationWarning: ISite is deprecated. Moved to zope.location.interfaces. Importing from here will stop working in Zope 3.6
  =========
  Ran 14 tests with 0 failures and 0 errors in 0.009 seconds.
Tearing down left over layers:
  Tear down zope.testing.testrunner.layer.UnitTests in 0.000 seconds.
Total: 47 tests, 0 failures, 0 errors in 0.892 seconds.
***********************************************
WARNING: LinguaPlone not found. Skipping tests.
***********************************************
***********************************************
WARNING: LinguaPlone not found. Skipping tests.
***********************************************
Running plone.app.blob.tests.layer.BlobLayer tests:
  Set up Testing.ZopeTestCase.layer.ZopeLite in 0.927 seconds.
  Set up Products.PloneTestCase.layer.ZCML in 2.432 seconds.
  Set up Products.PloneTestCase.layer.PloneSite in 3.851 seconds.
  Set up plone.app.blob.tests.layer.BlobLayer in 0.089 seconds.
/home/stefan/autotest/temp/python26-zope212-cmf22-plone40/src/Products.PortalTransforms/Products/PortalTransforms/libtransforms/commandtransform.py:97: DeprecationWarning: os.popen4 is deprecated.  Use the subprocess module.
  cin, couterr = os.popen4(command, 'b')
  Ran 29 tests with 0 failures and 0 errors in 6.494 seconds.
Running plone.app.blob.tests.layer.BlobReplacementLayer tests:
  Set up plone.app.blob.tests.layer.BlobReplacementLayer in 0.192 seconds.
  Ran 45 tests with 0 failures and 0 errors in 10.330 seconds.
Running zope.testing.testrunner.layer.UnitTests tests:
  Tear down plone.app.blob.tests.layer.BlobReplacementLayer in 0.000 seconds.
  Tear down plone.app.blob.tests.layer.BlobLayer in 0.000 seconds.
  Tear down Products.PloneTestCase.layer.PloneSite in 0.332 seconds.
  Tear down Products.PloneTestCase.layer.ZCML in 0.009 seconds.
  Tear down Testing.ZopeTestCase.layer.ZopeLite in 0.000 seconds.
  Set up zope.testing.testrunner.layer.UnitTests in 0.000 seconds.
  Ran 2 tests with 0 failures and 0 errors in 0.001 seconds.
Tearing down left over layers:
  Tear down zope.testing.testrunner.layer.UnitTests in 0.000 seconds.
Total: 76 tests, 0 failures, 0 errors in 25.401 seconds.
Running Testing.ZopeTestCase.layer.ZopeLite tests:
  Set up Testing.ZopeTestCase.layer.ZopeLite in 0.933 seconds.
  Ran 2 tests with 0 failures and 0 errors in 0.008 seconds.
Running plone.app.folder.tests.layer.IntegrationLayer tests:
  Set up Products.PloneTestCase.layer.ZCML in 2.765 seconds.
  Set up Products.PloneTestCase.layer.PloneSite in 3.758 seconds.
  Set up plone.app.folder.tests.layer.IntegrationLayer in 0.085 seconds.
  Ran 22 tests with 0 failures and 0 errors in 4.922 seconds.
Running plone.app.folder.tests.layer.PartialOrderingIntegrationLayer tests:
  Set up plone.app.folder.tests.layer.PartialOrderingIntegrationLayer in 0.000 seconds.
  Ran 3 tests with 0 failures and 0 errors in 0.318 seconds.
Tearing down left over layers:
  Tear down plone.app.folder.tests.layer.PartialOrderingIntegrationLayer in 0.000 seconds.
  Tear down plone.app.folder.tests.layer.IntegrationLayer in 0.000 seconds.
  Tear down Products.PloneTestCase.layer.PloneSite in 0.339 seconds.
  Tear down Products.PloneTestCase.layer.ZCML in 0.004 seconds.
  Tear down Testing.ZopeTestCase.layer.ZopeLite in 0.000 seconds.
Total: 27 tests, 0 failures, 0 errors in 13.709 seconds.
Running plone.app.imaging.tests.layer.ImagingLayer tests:
  Set up Testing.ZopeTestCase.layer.ZopeLite in 0.973 seconds.
  Set up Products.PloneTestCase.layer.ZCML in 2.465 seconds.
  Set up Products.PloneTestCase.layer.PloneSite in 3.897 seconds.
  Set up plone.app.imaging.tests.layer.ImagingLayer in 0.084 seconds.
  Ran 37 tests with 0 failures and 0 errors in 3.665 seconds.
Running zope.testing.testrunner.layer.UnitTests tests:
  Tear down plone.app.imaging.tests.layer.ImagingLayer in 0.000 seconds.
  Tear down Products.PloneTestCase.layer.PloneSite in 0.350 seconds.
  Tear down Products.PloneTestCase.layer.ZCML in 0.005 seconds.
  Tear down Testing.ZopeTestCase.layer.ZopeLite in 0.000 seconds.
  Set up zope.testing.testrunner.layer.UnitTests in 0.000 seconds.
  Ran 7 tests with 0 failures and 0 errors in 0.001 seconds.
Tearing down left over layers:
  Tear down zope.testing.testrunner.layer.UnitTests in 0.000 seconds.
Total: 44 tests, 0 failures, 0 errors in 11.880 seconds.
Running Products.PloneTestCase.layer.PloneSite tests:
  Set up Testing.ZopeTestCase.layer.ZopeLite in 1.478 seconds.
  Set up Products.PloneTestCase.layer.ZCML in 2.602 seconds.
  Set up Products.PloneTestCase.layer.PloneSite in 3.854 seconds.
  Ran 9 tests with 0 failures and 0 errors in 0.116 seconds.
Tearing down left over layers:
  Tear down Products.PloneTestCase.layer.PloneSite in 0.331 seconds.
  Tear down Products.PloneTestCase.layer.ZCML in 0.004 seconds.
  Tear down Testing.ZopeTestCase.layer.ZopeLite in 0.000 seconds.
Running plone.app.linkintegrity.tests.layer.PloneLinkintegrity tests:
  Set up Testing.ZopeTestCase.layer.ZopeLite in 1.942 seconds.
  Set up Products.PloneTestCase.layer.ZCML in 2.479 seconds.
  Set up Products.PloneTestCase.layer.PloneSite in 3.890 seconds.
  Set up collective.testcaselayer.ptc.PTCLayer in 0.028 seconds.
  Set up plone.app.linkintegrity.tests.layer.PloneLinkintegrity in 0.486 seconds.
  Ran 117 tests with 0 failures and 0 errors in 26.246 seconds.
Running zope.testing.testrunner.layer.UnitTests tests:
  Tear down plone.app.linkintegrity.tests.layer.PloneLinkintegrity in 0.000 seconds.
  Tear down collective.testcaselayer.ptc.PTCLayer in 0.000 seconds.
  Tear down Products.PloneTestCase.layer.PloneSite in 0.335 seconds.
  Tear down Products.PloneTestCase.layer.ZCML in 0.006 seconds.
  Tear down Testing.ZopeTestCase.layer.ZopeLite in 0.000 seconds.
  Set up zope.testing.testrunner.layer.UnitTests in 0.000 seconds.
  Ran 1 tests with 0 failures and 0 errors in 0.001 seconds.
Tearing down left over layers:
  Tear down zope.testing.testrunner.layer.UnitTests in 0.000 seconds.
Total: 118 tests, 0 failures, 0 errors in 36.018 seconds.
Total: 0 tests, 0 failures, 0 errors in 0.000 seconds.
Running Products.PloneTestCase.layer.PloneSite tests:
  Set up Testing.ZopeTestCase.layer.ZopeLite in 1.980 seconds.
  Set up Products.PloneTestCase.layer.ZCML in 2.411 seconds.
  Set up Products.PloneTestCase.layer.PloneSite in 3.947 seconds.
  Ran 3 tests with 0 failures and 0 errors in 0.695 seconds.
Tearing down left over layers:
  Tear down Products.PloneTestCase.layer.PloneSite in 0.338 seconds.
  Tear down Products.PloneTestCase.layer.ZCML in 0.004 seconds.
  Tear down Testing.ZopeTestCase.layer.ZopeLite in 0.000 seconds.
Running Products.PloneTestCase.layer.PloneSite tests:
  Set up Testing.ZopeTestCase.layer.ZopeLite in 1.384 seconds.
  Set up Products.PloneTestCase.layer.ZCML in 2.492 seconds.
  Set up Products.PloneTestCase.layer.PloneSite in 3.891 seconds.
  Ran 38 tests with 0 failures and 0 errors in 7.929 seconds.
Tearing down left over layers:
  Tear down Products.PloneTestCase.layer.PloneSite in 0.334 seconds.
  Tear down Products.PloneTestCase.layer.ZCML in 0.006 seconds.
  Tear down Testing.ZopeTestCase.layer.ZopeLite in 0.000 seconds.
Running plone.folder.tests.layer.PloneFolderLayer tests:
  Set up plone.folder.tests.layer.PloneFolderLayer in 0.007 seconds.
  Ran 70 tests with 0 failures and 0 errors in 5.590 seconds.
Tearing down left over layers:
  Tear down plone.folder.tests.layer.PloneFolderLayer in 0.000 seconds.
Running Products.PloneTestCase.layer.PloneSite tests:
  Set up Testing.ZopeTestCase.layer.ZopeLite in 1.512 seconds.
  Set up Products.PloneTestCase.layer.ZCML in 2.490 seconds.
  Set up Products.PloneTestCase.layer.PloneSite in 4.079 seconds.
  Ran 41 tests with 0 failures and 0 errors in 0.315 seconds.
Tearing down left over layers:
  Tear down Products.PloneTestCase.layer.PloneSite in 0.329 seconds.
  Tear down Products.PloneTestCase.layer.ZCML in 0.004 seconds.
  Tear down Testing.ZopeTestCase.layer.ZopeLite in 0.000 seconds.
Total: 0 tests, 0 failures, 0 errors in 0.000 seconds.
Total: 0 tests, 0 failures, 0 errors in 0.000 seconds.
Running Products.PloneTestCase.layer.ZCML tests:
  Set up Testing.ZopeTestCase.layer.ZopeLite in 0.949 seconds.
  Set up Products.PloneTestCase.layer.ZCML in 2.511 seconds.
/home/stefan/autotest/temp/python26-zope212-cmf22-plone40/eggs/wicked-1.1.8alpha1-py2.6.egg/wicked/cache.py:34: DeprecationWarning: object.__init__() takes no parameters
  super(CacheStore, self).__init__(self)
  Ran 16 tests with 0 failures and 0 errors in 0.050 seconds.
Running wicked.at.tests.wickedtestcase.WickedSite tests:
  Set up Products.PloneTestCase.layer.PloneSite in 4.658 seconds.
  Set up wicked.at.tests.wickedtestcase.WickedSite in 0.002 seconds.
/home/stefan/autotest/temp/python26-zope212-cmf22-plone40/eggs/Zope2-2.12.3-py2.6-linux-x86_64.egg/OFS/subscribers.py:73: DeprecationWarning: wicked.atcontent.ironicwiki.IronicWiki.manage_afterAdd is discouraged. You should use event subscribers instead.
  DeprecationWarning)
/home/stefan/autotest/temp/python26-zope212-cmf22-plone40/eggs/Zope2-2.12.3-py2.6-linux-x86_64.egg/OFS/subscribers.py:73: DeprecationWarning: wicked.atcontent.ironicwiki.IronicWiki.manage_beforeDelete is discouraged. You should use event subscribers instead.
  DeprecationWarning)
/home/stefan/autotest/temp/python26-zope212-cmf22-plone40/eggs/Zope2-2.12.3-py2.6-linux-x86_64.egg/OFS/subscribers.py:73: DeprecationWarning: wicked.atcontent.ironicwiki.IronicWiki.manage_afterClone is discouraged. You should use event subscribers instead.
  DeprecationWarning)
  Ran 23 tests with 0 failures and 0 errors in 5.464 seconds.
Running wicked.at.tests.test_scope.Scoped tests:
  Set up wicked.at.tests.test_scope.Scoped in 0.000 seconds.
  Ran 3 tests with 0 failures and 0 errors in 0.601 seconds.
Running wicked.plone.tests.SelectiveATCT tests:
  Tear down wicked.at.tests.test_scope.Scoped in 0.000 seconds.
  Tear down wicked.at.tests.wickedtestcase.WickedSite in 0.002 seconds.
  Set up wicked.plone.tests.SelectiveATCT in 0.003 seconds.
  Ran 22 tests with 0 failures and 0 errors in 5.645 seconds.
Running wicked.plone.tests.ZCMLLayer tests:
  Tear down wicked.plone.tests.SelectiveATCT in 0.004 seconds.
  Set up wicked.plone.tests.ZCMLLayer in 0.020 seconds.
  Ran 8 tests with 0 failures and 0 errors in 0.662 seconds.
Running zope.testing.testrunner.layer.UnitTests tests:
  Tear down wicked.plone.tests.ZCMLLayer in 0.356 seconds.
  Tear down Products.PloneTestCase.layer.PloneSite in 0.001 seconds.
  Tear down Products.PloneTestCase.layer.ZCML in 0.004 seconds.
  Tear down Testing.ZopeTestCase.layer.ZopeLite in 0.000 seconds.
  Set up zope.testing.testrunner.layer.UnitTests in 0.000 seconds.
  Ran 34 tests with 0 failures and 0 errors in 0.016 seconds.
Tearing down left over layers:
  Tear down zope.testing.testrunner.layer.UnitTests in 0.000 seconds.
Total: 106 tests, 0 failures, 0 errors in 22.208 seconds.
#### Running tests for group ATCT ####
#### Finished tests for group ATCT ####

#### Running tests for group Archetypes ####
#### Finished tests for group Archetypes ####

#### Running tests for group CMF ####
#### Finished tests for group CMF ####

#### Running tests for group CMFEditions ####
#### Finished tests for group CMFEditions ####

#### Running tests for group Plone ####
#### Finished tests for group Plone ####

#### Running tests for group PlonePAS ####
#### Finished tests for group PlonePAS ####

#### Running tests for group plone ####
#### Finished tests for group plone ####

#### Running tests for group portlets ####
#### Finished tests for group portlets ####

#### Running tests for group z3c.autoinclude ####
#### Finished tests for group z3c.autoinclude ####

#### Running tests for Products.CMFPlacefulWorkflow ####
#### Finished tests for Products.CMFPlacefulWorkflow ####

#### Running tests for Products.CMFTestCase ####
#### Finished tests for Products.CMFTestCase ####

#### Running tests for Products.ExtendedPathIndex ####
#### Finished tests for Products.ExtendedPathIndex ####

#### Running tests for Products.PasswordResetTool ####
#### Finished tests for Products.PasswordResetTool ####

#### Running tests for Products.PloneTestCase ####
#### Finished tests for Products.PloneTestCase ####

#### Running tests for Products.ResourceRegistries ####
#### Finished tests for Products.ResourceRegistries ####

#### Running tests for Products.TinyMCE ####
#### Finished tests for Products.TinyMCE ####

#### Running tests for Products.ZopeVersionControl ####
#### Finished tests for Products.ZopeVersionControl ####

#### Running tests for Products.contentmigration ####
#### Finished tests for Products.contentmigration ####

#### Running tests for Products.i18ntestcase ####
#### Finished tests for Products.i18ntestcase ####

#### Running tests for archetypes.referencebrowserwidget ####
#### Finished tests for archetypes.referencebrowserwidget ####

#### Running tests for archetypes.schemaextender ####
#### Finished tests for archetypes.schemaextender ####

#### Running tests for collective.monkeypatcher ####
#### Finished tests for collective.monkeypatcher ####

#### Running tests for five.customerize ####
#### Finished tests for five.customerize ####

#### Running tests for five.formlib ####
#### Finished tests for five.formlib ####

#### Running tests for kss.core ####
#### Finished tests for kss.core ####

#### Running tests for plone.app.blob ####
#### Finished tests for plone.app.blob ####

#### Running tests for plone.app.folder ####
#### Finished tests for plone.app.folder ####

#### Running tests for plone.app.imaging ####
#### Finished tests for plone.app.imaging ####

#### Running tests for plone.app.jquerytools ####
#### Finished tests for plone.app.jquerytools ####

#### Running tests for plone.app.linkintegrity ####
#### Finished tests for plone.app.linkintegrity ####

#### Running tests for plone.app.locales ####
#### Finished tests for plone.app.locales ####

#### Running tests for plone.app.openid ####
#### Finished tests for plone.app.openid ####

#### Running tests for plone.app.users ####
#### Finished tests for plone.app.users ####

#### Running tests for plone.folder ####
#### Finished tests for plone.folder ####

#### Running tests for plone.stringinterp ####
#### Finished tests for plone.stringinterp ####

#### Running tests for plonetheme.classic ####
#### Finished tests for plonetheme.classic ####

#### Running tests for plonetheme.sunburst ####
#### Finished tests for plonetheme.sunburst ####

#### Running tests for wicked ####
#### Finished tests for wicked ####

Packages with test failures:

Failing tests in group Archetypes
Failing tests in group Plone

Total time elapsed: 922.289 seconds

Grand total: 90 packages, 2 failures


FAILED (90 packages, 2 failures)




More information about the Testbot mailing list