[Testbot] FAILED (90 packages, 2 failures) : Plone-4.0 Zope-2.12 Python-2.6.4

Plone Tests plone-tests at epy.co.at
Wed Feb 24 02:39:01 UTC 2010


Plone Tests : FAILED (90 packages, 2 failures)
Plone-4.0 Zope-2.12 Python-2.6.4

Running ./bin/alltests -q --no-color --no-progress
Running Products.CMFTestCase.layer.CMFSite tests:
  Set up Testing.ZopeTestCase.layer.ZopeLite in 1.045 seconds.
  Set up Products.CMFTestCase.layer.ZCML in 3.349 seconds.
  Set up Products.CMFTestCase.layer.CMFSite in 1.473 seconds.
  Ran 31 tests with 0 failures and 0 errors in 0.540 seconds.
Running Products.PloneTestCase.layer.PloneSite tests:
  Tear down Products.CMFTestCase.layer.CMFSite in 0.064 seconds.
  Tear down Products.CMFTestCase.layer.ZCML in 0.004 seconds.
  Set up Products.PloneTestCase.layer.ZCML in 1.764 seconds.
  Set up Products.PloneTestCase.layer.PloneSite in 3.709 seconds.
  Ran 712 tests with 0 failures and 0 errors in 1 minutes 6.209 seconds.
Tearing down left over layers:
  Tear down Products.PloneTestCase.layer.PloneSite in 0.341 seconds.
  Tear down Products.PloneTestCase.layer.ZCML in 0.010 seconds.
  Tear down Testing.ZopeTestCase.layer.ZopeLite in 0.000 seconds.
Total: 743 tests, 0 failures, 0 errors in 1 minutes 19.023 seconds.
Running Testing.ZopeTestCase.layer.ZopeLite tests:
  Set up Testing.ZopeTestCase.layer.ZopeLite in 0.822 seconds.
  Ran 43 tests with 0 failures and 0 errors in 0.106 seconds.
Running Products.Archetypes.tests.layer.ZCML tests:
  Set up Products.CMFCore.testing.FunctionalZCMLLayer in 0.191 seconds.
  Set up Products.Archetypes.tests.layer.ZCML in 0.180 seconds.
  Ran 59 tests with 0 failures and 0 errors in 1.128 seconds.
Running Products.Archetypes.tests.layer.ArchetypesSite tests:
  Set up Products.Archetypes.tests.layer.ArchetypesSite in 1.410 seconds.
/home/stefan/autotest/temp/python26-zope212-cmf22-plone40/eggs/Zope2-2.12.3-py2.6-linux-x86_64.egg/OFS/subscribers.py:73: DeprecationWarning: Products.Archetypes.tests.test_classgen.Dummy.manage_afterAdd is discouraged. You should use event subscribers instead.
  DeprecationWarning)
/home/stefan/autotest/temp/python26-zope212-cmf22-plone40/eggs/Zope2-2.12.3-py2.6-linux-x86_64.egg/OFS/subscribers.py:73: DeprecationWarning: Products.Archetypes.tests.test_annotation.AnnDummy.manage_afterAdd is discouraged. You should use event subscribers instead.
  DeprecationWarning)
/home/stefan/autotest/temp/python26-zope212-cmf22-plone40/eggs/Zope2-2.12.3-py2.6-linux-x86_64.egg/OFS/subscribers.py:73: DeprecationWarning: Products.Archetypes.tests.test_event.Dummy.manage_afterAdd is discouraged. You should use event subscribers instead.
  DeprecationWarning)
  Ran 517 tests with 0 failures and 0 errors in 34.682 seconds.
Running Products.PloneTestCase.layer.PloneSite tests:
  Tear down Products.Archetypes.tests.layer.ArchetypesSite in 0.061 seconds.
  Tear down Products.Archetypes.tests.layer.ZCML in 0.004 seconds.
  Tear down Products.CMFCore.testing.FunctionalZCMLLayer in 0.000 seconds.
  Set up Products.PloneTestCase.layer.ZCML in 2.398 seconds.
  Set up Products.PloneTestCase.layer.PloneSite in 3.688 seconds.
  Ran 9 tests with 0 failures and 0 errors in 0.974 seconds.
Running plone.app.kss.tests.kss_and_plone_layer.KSSAndPloneLayer tests:
  Set up plone.app.kss.tests.kss_and_plone_layer.KSSAndPloneLayer in 0.005 seconds.


Failure in test testVersionPreviewIsNotInlineEditable (archetypes.kss.tests.test_fields.FieldsViewTestCase)
Traceback (most recent call last):
  File "/usr/local/python2.6/lib/python2.6/unittest.py", line 279, in run
    testMethod()
  File "/home/stefan/autotest/temp/python26-zope212-cmf22-plone40/src/archetypes.kss/archetypes/kss/tests/test_fields.py", line 279, in testVersionPreviewIsNotInlineEditable
    self.fail("The version form doesn't contain the title anymore, see "
  File "/usr/local/python2.6/lib/python2.6/unittest.py", line 317, in fail
    raise self.failureException, msg
AssertionError: The version form doesn't contain the title anymore, see http://dev.plone.org/plone/ticket/10234.

  Ran 19 tests with 1 failures and 0 errors in 1.334 seconds.
Running zope.testing.testrunner.layer.UnitTests tests:
  Tear down plone.app.kss.tests.kss_and_plone_layer.KSSAndPloneLayer in 0.000 seconds.
  Tear down Products.PloneTestCase.layer.PloneSite in 0.336 seconds.
  Tear down Products.PloneTestCase.layer.ZCML in 0.005 seconds.
  Tear down Testing.ZopeTestCase.layer.ZopeLite in 0.000 seconds.
  Set up zope.testing.testrunner.layer.UnitTests in 0.000 seconds.
/home/stefan/autotest/temp/python26-zope212-cmf22-plone40/eggs/Products.Archetypes-1.6b3-py2.6.egg/Products/Archetypes/ClassGen.py:152: UserWarning: The method 'makeFoo' was already protected by a different permission than the one declared on the field. Assuming that the explicit permission declared is the correct one and has preference over the permission declared on the field.
  self.handle_mode(klass, generator, type, field, mode)
  Ran 28 tests with 0 failures and 0 errors in 0.132 seconds.
Tearing down left over layers:
  Tear down zope.testing.testrunner.layer.UnitTests in 0.000 seconds.
Total: 675 tests, 1 failures, 0 errors in 48.841 seconds.
Running Testing.ZopeTestCase.layer.ZopeLite tests:
  Set up Testing.ZopeTestCase.layer.ZopeLite in 0.092 seconds.
  Ran 283 tests with 0 failures and 0 errors in 1.300 seconds.
Running Products.CMFCalendar.testing.FunctionalLayer tests:
  Set up Products.CMFCore.testing.FunctionalZCMLLayer in 0.169 seconds.
  Set up Products.CMFCalendar.testing.FunctionalLayer in 0.328 seconds.
  Ran 24 tests with 0 failures and 0 errors in 1.455 seconds.
Running Products.CMFCore.testing.EventZCMLLayer tests:
  Tear down Products.CMFCalendar.testing.FunctionalLayer in 0.026 seconds.
  Tear down Products.CMFCore.testing.FunctionalZCMLLayer in 0.001 seconds.
  Set up Products.CMFCore.testing.EventZCMLLayer in 0.001 seconds.
  Ran 8 tests with 0 failures and 0 errors in 0.200 seconds.
Running Products.CMFCore.testing.ExportImportZCMLLayer tests:
  Tear down Products.CMFCore.testing.EventZCMLLayer in 0.000 seconds.
  Set up Products.CMFCore.testing.ExportImportZCMLLayer in 0.001 seconds.
  Ran 10 tests with 0 failures and 0 errors in 0.931 seconds.
Running Products.CMFCore.testing.TraversingEventZCMLLayer tests:
  Tear down Products.CMFCore.testing.ExportImportZCMLLayer in 0.000 seconds.
  Set up Products.CMFCore.testing.TraversingEventZCMLLayer in 0.001 seconds.
  Ran 5 tests with 0 failures and 0 errors in 0.159 seconds.
Running Products.CMFDefault.testing.FunctionalLayer tests:
  Tear down Products.CMFCore.testing.TraversingEventZCMLLayer in 0.000 seconds.
  Set up Products.CMFCore.testing.FunctionalZCMLLayer in 0.154 seconds.
  Set up Products.CMFDefault.testing.FunctionalLayer in 0.247 seconds.
  Ran 76 tests with 0 failures and 0 errors in 3.745 seconds.
Running Products.CMFUid.testing.UidEventZCMLLayer tests:
  Tear down Products.CMFDefault.testing.FunctionalLayer in 0.023 seconds.
  Tear down Products.CMFCore.testing.FunctionalZCMLLayer in 0.002 seconds.
  Set up Products.CMFUid.testing.UidEventZCMLLayer in 0.001 seconds.
  Ran 12 tests with 0 failures and 0 errors in 0.317 seconds.
Running Products.DCWorkflow.testing.ExportImportZCMLLayer tests:
  Tear down Products.CMFUid.testing.UidEventZCMLLayer in 0.000 seconds.
  Set up Products.DCWorkflow.testing.ExportImportZCMLLayer in 0.141 seconds.
  Ran 38 tests with 0 failures and 0 errors in 0.732 seconds.
Running Products.GenericSetup.testing.ExportImportZCMLLayer tests:
  Tear down Products.DCWorkflow.testing.ExportImportZCMLLayer in 0.000 seconds.
  Set up Products.GenericSetup.testing.ExportImportZCMLLayer in 0.082 seconds.
  Ran 186 tests with 0 failures and 0 errors in 0.581 seconds.
Running zope.testing.testrunner.layer.UnitTests tests:
  Tear down Products.GenericSetup.testing.ExportImportZCMLLayer in 0.000 seconds.
  Tear down Testing.ZopeTestCase.layer.ZopeLite in 0.000 seconds.
  Set up zope.testing.testrunner.layer.UnitTests in 0.000 seconds.
  Ran 346 tests with 0 failures and 0 errors in 0.257 seconds.
Tearing down left over layers:
  Tear down zope.testing.testrunner.layer.UnitTests in 0.000 seconds.
Total: 988 tests, 0 failures, 0 errors in 12.227 seconds.
Running Testing.ZopeTestCase.layer.ZopeLite tests:
  Set up Testing.ZopeTestCase.layer.ZopeLite in 0.922 seconds.
  Ran 27 tests with 0 failures and 0 errors in 0.056 seconds.
Running Products.PloneTestCase.layer.PloneSite tests:
  Set up Products.PloneTestCase.layer.ZCML in 2.489 seconds.
  Set up Products.PloneTestCase.layer.PloneSite in 4.773 seconds.
/home/stefan/autotest/temp/python26-zope212-cmf22-plone40/eggs/Zope2-2.12.3-py2.6-linux-x86_64.egg/OFS/subscribers.py:73: DeprecationWarning: Products.FAQ.FAQ.FAQ.manage_afterAdd is discouraged. You should use event subscribers instead.
  DeprecationWarning)
/home/stefan/autotest/temp/python26-zope212-cmf22-plone40/eggs/Zope2-2.12.3-py2.6-linux-x86_64.egg/OFS/subscribers.py:73: DeprecationWarning: Products.FAQ.FAQQuestion.FAQQuestion.manage_afterAdd is discouraged. You should use event subscribers instead.
  DeprecationWarning)
  Ran 139 tests with 0 failures and 0 errors in 21.174 seconds.
Running Products.CMFDiffTool.tests.BaseTestCase.CMFDiffToolLayer tests:
  Set up Products.CMFDiffTool.tests.BaseTestCase.CMFDiffToolLayer in 0.013 seconds.
  Ran 2 tests with 0 failures and 0 errors in 0.216 seconds.
Running Products.CMFTestCase.layer.CMFSite tests:
  Tear down Products.CMFDiffTool.tests.BaseTestCase.CMFDiffToolLayer in 0.350 seconds.
  Tear down Products.PloneTestCase.layer.PloneSite in 0.006 seconds.
  Tear down Products.PloneTestCase.layer.ZCML in 0.004 seconds.
  Set up Products.CMFTestCase.layer.ZCML in 1.785 seconds.
  Set up Products.CMFTestCase.layer.CMFSite in 1.327 seconds.
  Ran 20 tests with 0 failures and 0 errors in 0.393 seconds.
Running plone.app.blob.tests.layer.BlobReplacementLayer tests:
  Tear down Products.CMFTestCase.layer.CMFSite in 0.064 seconds.
  Tear down Products.CMFTestCase.layer.ZCML in 0.003 seconds.
  Set up Products.PloneTestCase.layer.ZCML in 1.806 seconds.
  Set up Products.PloneTestCase.layer.PloneSite in 3.856 seconds.
  Set up plone.app.blob.tests.layer.BlobLayer in 0.080 seconds.
  Set up plone.app.blob.tests.layer.BlobReplacementLayer in 0.194 seconds.
  Ran 6 tests with 0 failures and 0 errors in 1.786 seconds.
Running zope.testing.testrunner.layer.UnitTests tests:
  Tear down plone.app.blob.tests.layer.BlobReplacementLayer in 0.000 seconds.
  Tear down plone.app.blob.tests.layer.BlobLayer in 0.000 seconds.
  Tear down Products.PloneTestCase.layer.PloneSite in 0.361 seconds.
  Tear down Products.PloneTestCase.layer.ZCML in 0.004 seconds.
  Tear down Testing.ZopeTestCase.layer.ZopeLite in 0.000 seconds.
  Set up zope.testing.testrunner.layer.UnitTests in 0.000 seconds.
  Ran 10 tests with 0 failures and 0 errors in 0.005 seconds.
Tearing down left over layers:
  Tear down zope.testing.testrunner.layer.UnitTests in 0.000 seconds.
Total: 204 tests, 0 failures, 0 errors in 42.910 seconds.
Running Testing.ZopeTestCase.layer.ZopeLite tests:
  Set up Testing.ZopeTestCase.layer.ZopeLite in 0.572 seconds.
  Ran 126 tests with 0 failures and 0 errors in 0.755 seconds.
Running Products.CMFTestCase.layer.CMFSite tests:
  Set up Products.CMFTestCase.layer.ZCML in 2.369 seconds.
  Set up Products.CMFTestCase.layer.CMFSite in 0.234 seconds.
  Ran 58 tests with 0 failures and 0 errors in 1.881 seconds.
Running Products.PloneTestCase.layer.ZCML tests:
  Tear down Products.CMFTestCase.layer.CMFSite in 0.039 seconds.
  Tear down Products.CMFTestCase.layer.ZCML in 0.004 seconds.
  Set up Products.PloneTestCase.layer.ZCML in 1.780 seconds.
  Ran 12 tests with 0 failures and 0 errors in 0.016 seconds.
Running Products.PloneTestCase.layer.PloneSite tests:
  Set up Products.PloneTestCase.layer.PloneSite in 3.986 seconds.
/home/stefan/autotest/temp/python26-zope212-cmf22-plone40/src/Products.PortalTransforms/Products/PortalTransforms/libtransforms/commandtransform.py:97: DeprecationWarning: os.popen4 is deprecated.  Use the subprocess module.
  cin, couterr = os.popen4(command, 'b')
  Ran 1842 tests with 0 failures and 0 errors in 3 minutes 38.278 seconds.
Running plone.app.contentrules.tests.test_configuration.TestContentrulesGSLayer tests:
  Set up plone.app.contentrules.tests.test_configuration.TestContentrulesGSLayer in 0.002 seconds.
  Ran 6 tests with 0 failures and 0 errors in 2.430 seconds.
Running plone.app.customerize.tests.layer.PloneCustomerize tests:
  Tear down plone.app.contentrules.tests.test_configuration.TestContentrulesGSLayer in 0.000 seconds.
  Set up plone.app.customerize.tests.layer.PloneCustomerize in 0.000 seconds.
  Ran 27 tests with 0 failures and 0 errors in 2.590 seconds.
Running plone.app.kss.tests.kss_and_plone_layer.KSSAndPloneLayer tests:
  Tear down plone.app.customerize.tests.layer.PloneCustomerize in 0.000 seconds.
  Set up plone.app.kss.tests.kss_and_plone_layer.KSSAndPloneLayer in 0.004 seconds.
  Ran 13 tests with 0 failures and 0 errors in 1.131 seconds.
Running plone.app.upgrade.tests.base.FunctionalUpgradeLayer tests:
  Tear down plone.app.kss.tests.kss_and_plone_layer.KSSAndPloneLayer in 0.000 seconds.
  Set up plone.app.upgrade.tests.base.FunctionalUpgradeLayer in 0.000 seconds.
  Ran 11 tests with 0 failures and 0 errors in 55.802 seconds.
Running plone.app.viewletmanager.tests.test_exportimport.Layer tests:
  Tear down plone.app.upgrade.tests.base.FunctionalUpgradeLayer in 0.000 seconds.
  Tear down Products.PloneTestCase.layer.PloneSite in 0.365 seconds.
  Tear down Products.PloneTestCase.layer.ZCML in 0.015 seconds.
  Tear down Testing.ZopeTestCase.layer.ZopeLite in 0.000 seconds.
  Set up plone.app.viewletmanager.tests.test_exportimport.Layer in 0.000 seconds.
  Ran 16 tests with 0 failures and 0 errors in 0.050 seconds.
Running zope.testing.testrunner.layer.UnitTests tests:
  Tear down plone.app.viewletmanager.tests.test_exportimport.Layer in 0.000 seconds.
  Set up zope.testing.testrunner.layer.UnitTests in 0.000 seconds.
  Ran 144 tests with 0 failures and 0 errors in 0.854 seconds.
Tearing down left over layers:
  Tear down zope.testing.testrunner.layer.UnitTests in 0.000 seconds.
Total: 2255 tests, 0 failures, 0 errors in 4 minutes 56.782 seconds.
Running Testing.ZopeTestCase.layer.ZopeLite tests:
  Set up Testing.ZopeTestCase.layer.ZopeLite in 1.471 seconds.
  Ran 165 tests with 0 failures and 0 errors in 0.629 seconds.
Running Products.PloneTestCase.layer.ZCML tests:
  Set up Products.PloneTestCase.layer.ZCML in 2.398 seconds.
  Ran 34 tests with 0 failures and 0 errors in 0.208 seconds.
Running Products.PlonePAS.tests.layer.PlonePASLayer tests:
  Set up Products.PloneTestCase.layer.PloneSite in 3.632 seconds.
  Set up Products.PlonePAS.tests.layer.PlonePASLayer in 0.000 seconds.
  Ran 153 tests with 0 failures and 0 errors in 1.893 seconds.
Running zope.testing.testrunner.layer.UnitTests tests:
  Tear down Products.PlonePAS.tests.layer.PlonePASLayer in 0.000 seconds.
  Tear down Products.PloneTestCase.layer.PloneSite in 0.330 seconds.
  Tear down Products.PloneTestCase.layer.ZCML in 0.004 seconds.
  Tear down Testing.ZopeTestCase.layer.ZopeLite in 0.000 seconds.
  Set up zope.testing.testrunner.layer.UnitTests in 0.000 seconds.
  Ran 337 tests with 0 failures and 0 errors in 0.713 seconds.
Tearing down left over layers:
  Tear down zope.testing.testrunner.layer.UnitTests in 0.000 seconds.
Total: 689 tests, 0 failures, 0 errors in 12.057 seconds.
Running Products.PloneTestCase.layer.PloneSite tests:
  Set up Testing.ZopeTestCase.layer.ZopeLite in 1.421 seconds.
  Set up Products.PloneTestCase.layer.ZCML in 2.458 seconds.
  Set up Products.PloneTestCase.layer.PloneSite in 4.133 seconds.
/home/stefan/autotest/temp/python26-zope212-cmf22-plone40/eggs/borg.localrole-3.0a1-py2.6.egg/borg/localrole/bbb/bbb.txt:1: DeprecationWarning: IWorkspace is deprecated. Please use borg.localrole.interfaces.ILocalRoleProvider instead
  =========
/home/stefan/autotest/temp/python26-zope212-cmf22-plone40/eggs/borg.localrole-3.0a1-py2.6.egg/borg/localrole/bbb/bbb.txt:1: DeprecationWarning: IGroupAwareWorkspace is deprecated. Please use borg.localrole.interfaces.ILocalRoleProvider instead
  =========
  Ran 39 tests with 0 failures and 0 errors in 0.192 seconds.
Running plone.browserlayer.tests.test_doctest.PloneBrowserLayerLayer tests:
  Set up plone.browserlayer.tests.test_doctest.PloneBrowserLayerLayer in 0.003 seconds.
  Ran 9 tests with 0 failures and 0 errors in 0.708 seconds.
Running plone.theme.tests.test_doctest.PloneThemeLayer tests:
  Tear down plone.browserlayer.tests.test_doctest.PloneBrowserLayerLayer in 0.000 seconds.
  Set up plone.theme.tests.test_doctest.PloneThemeLayer in 0.003 seconds.
  Ran 5 tests with 0 failures and 0 errors in 0.044 seconds.
Running zope.testing.testrunner.layer.UnitTests tests:
  Tear down plone.theme.tests.test_doctest.PloneThemeLayer in 0.000 seconds.
  Tear down Products.PloneTestCase.layer.PloneSite in 0.328 seconds.
  Tear down Products.PloneTestCase.layer.ZCML in 0.004 seconds.
  Tear down Testing.ZopeTestCase.layer.ZopeLite in 0.000 seconds.
  Set up zope.testing.testrunner.layer.UnitTests in 0.000 seconds.
/usr/local/python2.6/lib/python2.6/mhlib.py:83: DeprecationWarning: the multifile module has been deprecated since Python 2.5
  import multifile
  Ran 252 tests with 0 failures and 0 errors in 0.833 seconds.
Tearing down left over layers:
  Tear down zope.testing.testrunner.layer.UnitTests in 0.000 seconds.
Total: 305 tests, 0 failures, 0 errors in 11.021 seconds.
Running Products.PloneTestCase.layer.PloneSite tests:
  Set up Testing.ZopeTestCase.layer.ZopeLite in 0.902 seconds.
  Set up Products.PloneTestCase.layer.ZCML in 2.387 seconds.
  Set up Products.PloneTestCase.layer.PloneSite in 4.076 seconds.
/usr/local/python2.6/lib/python2.6/unittest.py:279: DeprecationWarning: The use of 'hide' has been deprecated and will be removed in plone.portlet.static 2.0. Instead, use the new generic built-in show/hide setting of plone.portlets.
  testMethod()
  Ran 165 tests with 0 failures and 0 errors in 14.699 seconds.
Running plone.app.portlets.tests.test_configuration.TestPortletZCMLLayer tests:
  Set up plone.app.portlets.tests.test_configuration.TestPortletZCMLLayer in 0.006 seconds.
  Ran 5 tests with 0 failures and 0 errors in 0.039 seconds.
Running plone.app.portlets.tests.test_configuration.TestPortletGSLayer tests:
  Set up plone.app.portlets.tests.test_configuration.TestPortletGSLayer in 1.348 seconds.


Failure in test testExport (plone.app.portlets.tests.test_configuration.TestGenericSetup)
Traceback (most recent call last):
  File "/usr/local/python2.6/lib/python2.6/unittest.py", line 279, in run
    testMethod()
  File "/home/stefan/autotest/temp/python26-zope212-cmf22-plone40/src/plone.app.portlets/plone/app/portlets/tests/test_configuration.py", line 563, in testExport
    self.assertEquals(expected.strip(), body.strip(), body)
  File "/usr/local/python2.6/lib/python2.6/unittest.py", line 350, in failUnlessEqual
    (msg or '%r != %r' % (first, second))
AssertionError: <?xml version="1.0"?>
<portlets>
 <portletmanager name="test.testcolumn"
    type="plone.app.portlets.tests.test_configuration.ITestColumn"/>
 <portletmanager name="test.testcolumn2"
    type="plone.app.portlets.tests.test_configuration.ITestColumn"/>
 <portlet title="Test portlet" addview="portlets.test.Test"
    description="A test portlet"/>
 <assignment name="test.portlet6" category="group" key="Reviewers"
    manager="test.testcolumn" type="portlets.test.Test" visible="True">
  <property name="test_bool"/>
  <property name="test_tuple"/>
  <property name="test_text"/>
 </assignment>
 <assignment name="test.portlet4" category="content_type" key="Folder"
    manager="test.testcolumn" type="portlets.test.Test" visible="True">
  <property name="test_bool"/>
  <property name="test_tuple"/>
  <property name="test_text"/>
 </assignment>
 <assignment name="test.portlet5" category="content_type" key="Folder"
    manager="test.testcolumn" type="portlets.test.Test" visible="True">
  <property name="test_bool"/>
  <property name="test_tuple"/>
  <property name="test_text"/>
 </assignment>
 <assignment name="test.portlet3" category="context" key="/"
    manager="test.testcolumn" type="portlets.test.Test" visible="True">
  <property name="test_bool"/>
  <property name="test_tuple"/>
  <property name="test_text"/>
 </assignment>
 <assignment name="test.portlet2" category="context" key="/"
    manager="test.testcolumn" type="portlets.test.Test" visible="False">
  <property name="test_bool">True</property>
  <property name="test_tuple"/>
  <property name="test_text">Test prop 2</property>
 </assignment>
 <assignment name="test.portlet1" category="context" key="/"
    manager="test.testcolumn" type="portlets.test.Test" visible="True">
  <property name="test_bool">False</property>
  <property name="test_tuple"/>
  <property name="test_text">Test pröp 1</property>
 </assignment>
 <assignment name="navigation" category="context" key="/"
    manager="test.testcolumn2" type="portlets.Navigation" visible="True">
  <property name="topLevel">1</property>
  <property name="currentFolderOnly">False</property>
  <property name="name"></property>
  <property name="includeTop">False</property>
  <property name="bottomLevel">0</property>
  <property name="root"></property>
 </assignment>
 <blacklist category="user" location="/" manager="test.testcolumn"
    status="acquire"/>
 <blacklist category="group" location="/" manager="test.testcolumn"
    status="show"/>
 <blacklist category="content_type" location="/" manager="test.testcolumn"
    status="block"/>
 <blacklist category="context" location="/" manager="test.testcolumn"
    status="acquire"/>
 <blacklist category="user" location="/" manager="test.testcolumn2"
    status="acquire"/>
 <blacklist category="group" location="/" manager="test.testcolumn2"
    status="acquire"/>
 <blacklist category="content_type" location="/" manager="test.testcolumn2"
    status="acquire"/>
 <blacklist category="context" location="/" manager="test.testcolumn2"
    status="acquire"/>
</portlets>


  Ran 13 tests with 1 failures and 0 errors in 3.698 seconds.
Running zope.testing.testrunner.layer.UnitTests tests:
  Tear down plone.app.portlets.tests.test_configuration.TestPortletGSLayer in 0.000 seconds.
  Tear down plone.app.portlets.tests.test_configuration.TestPortletZCMLLayer in 0.000 seconds.
  Tear down Products.PloneTestCase.layer.PloneSite in 0.335 seconds.
  Tear down Products.PloneTestCase.layer.ZCML in 0.005 seconds.
  Tear down Testing.ZopeTestCase.layer.ZopeLite in 0.000 seconds.
  Set up zope.testing.testrunner.layer.UnitTests in 0.000 seconds.
  Ran 57 tests with 0 failures and 0 errors in 0.149 seconds.
Tearing down left over layers:
  Tear down zope.testing.testrunner.layer.UnitTests in 0.000 seconds.
Total: 240 tests, 1 failures, 0 errors in 28.490 seconds.
Running zope.testing.testrunner.layer.UnitTests tests:
  Set up zope.testing.testrunner.layer.UnitTests in 0.000 seconds.
  Ran 3 tests with 0 failures and 0 errors in 12.547 seconds.
Tearing down left over layers:
  Tear down zope.testing.testrunner.layer.UnitTests in 0.000 seconds.
Running Products.PloneTestCase.layer.PloneSite tests:
  Set up Testing.ZopeTestCase.layer.ZopeLite in 0.000 seconds.
  Set up Products.PloneTestCase.layer.ZCML in 1.880 seconds.
  Set up Products.PloneTestCase.layer.PloneSite in 4.525 seconds.
  Ran 23 tests with 0 failures and 0 errors in 2.632 seconds.
Running Products.CMFPlacefulWorkflow.tests.test_exportimport.ExportImportLayer tests:
  Set up Products.CMFPlacefulWorkflow.tests.test_exportimport.ExportImportLayer in 0.001 seconds.
  Ran 12 tests with 0 failures and 0 errors in 0.911 seconds.
Tearing down left over layers:
  Tear down Products.CMFPlacefulWorkflow.tests.test_exportimport.ExportImportLayer in 0.000 seconds.
  Tear down Products.PloneTestCase.layer.PloneSite in 0.337 seconds.
  Tear down Products.PloneTestCase.layer.ZCML in 0.004 seconds.
  Tear down Testing.ZopeTestCase.layer.ZopeLite in 0.000 seconds.
Total: 35 tests, 0 failures, 0 errors in 10.734 seconds.
Running Products.CMFTestCase.layer.CMFSite tests:
  Set up Testing.ZopeTestCase.layer.ZopeLite in 0.235 seconds.
  Set up Products.CMFTestCase.layer.ZCML in 0.370 seconds.
  Set up Products.CMFTestCase.layer.CMFSite in 0.211 seconds.
  Ran 58 tests with 0 failures and 0 errors in 0.229 seconds.
Tearing down left over layers:
  Tear down Products.CMFTestCase.layer.CMFSite in 0.026 seconds.
  Tear down Products.CMFTestCase.layer.ZCML in 0.001 seconds.
  Tear down Testing.ZopeTestCase.layer.ZopeLite in 0.000 seconds.
Running zope.testing.testrunner.layer.UnitTests tests:
  Set up zope.testing.testrunner.layer.UnitTests in 0.000 seconds.
  Ran 35 tests with 0 failures and 0 errors in 0.026 seconds.
Tearing down left over layers:
  Tear down zope.testing.testrunner.layer.UnitTests in 0.000 seconds.
Running Products.PloneTestCase.layer.PloneSite tests:
  Set up Testing.ZopeTestCase.layer.ZopeLite in 1.362 seconds.
  Set up Products.PloneTestCase.layer.ZCML in 2.475 seconds.
  Set up Products.PloneTestCase.layer.PloneSite in 3.878 seconds.
  Ran 38 tests with 0 failures and 0 errors in 3.945 seconds.
Tearing down left over layers:
  Tear down Products.PloneTestCase.layer.PloneSite in 0.336 seconds.
  Tear down Products.PloneTestCase.layer.ZCML in 0.006 seconds.
  Tear down Testing.ZopeTestCase.layer.ZopeLite in 0.000 seconds.
Running Products.PloneTestCase.layer.PloneSite tests:
  Set up Testing.ZopeTestCase.layer.ZopeLite in 1.447 seconds.
  Set up Products.PloneTestCase.layer.ZCML in 2.469 seconds.
  Set up Products.PloneTestCase.layer.PloneSite in 3.858 seconds.
/home/stefan/autotest/temp/python26-zope212-cmf22-plone40/eggs/Products.PlonePAS-4.0b4-py2.6.egg/Products/PlonePAS/tools/membership.py:555: DeprecationWarning: credentialsChanged should be called with 'REQUEST' as second argument. The BBB code will be removed in CMF 2.3.
  self.credentialsChanged(password, REQUEST=REQUEST)
  Ran 61 tests with 0 failures and 0 errors in 1.242 seconds.
Tearing down left over layers:
  Tear down Products.PloneTestCase.layer.PloneSite in 0.337 seconds.
  Tear down Products.PloneTestCase.layer.ZCML in 0.004 seconds.
  Tear down Testing.ZopeTestCase.layer.ZopeLite in 0.000 seconds.
Running Products.PloneTestCase.layer.PloneSite tests:
  Set up Testing.ZopeTestCase.layer.ZopeLite in 1.434 seconds.
  Set up Products.PloneTestCase.layer.ZCML in 2.493 seconds.
  Set up Products.PloneTestCase.layer.PloneSite in 4.012 seconds.
  Ran 245 tests with 0 failures and 0 errors in 15.220 seconds.
Running zope.testing.testrunner.layer.UnitTests tests:
  Tear down Products.PloneTestCase.layer.PloneSite in 0.344 seconds.
  Tear down Products.PloneTestCase.layer.ZCML in 0.005 seconds.
  Tear down Testing.ZopeTestCase.layer.ZopeLite in 0.000 seconds.
  Set up zope.testing.testrunner.layer.UnitTests in 0.000 seconds.
  Ran 59 tests with 0 failures and 0 errors in 0.013 seconds.
Tearing down left over layers:
  Tear down zope.testing.testrunner.layer.UnitTests in 0.000 seconds.
Total: 304 tests, 0 failures, 0 errors in 23.951 seconds.
Running Products.PloneTestCase.layer.PloneSite tests:
  Set up Testing.ZopeTestCase.layer.ZopeLite in 1.420 seconds.
  Set up Products.PloneTestCase.layer.ZCML in 2.487 seconds.
  Set up Products.PloneTestCase.layer.PloneSite in 3.873 seconds.
  Ran 78 tests with 0 failures and 0 errors in 2.701 seconds.
Tearing down left over layers:
  Tear down Products.PloneTestCase.layer.PloneSite in 0.332 seconds.
  Tear down Products.PloneTestCase.layer.ZCML in 0.007 seconds.
  Tear down Testing.ZopeTestCase.layer.ZopeLite in 0.000 seconds.
Running zope.testing.testrunner.layer.UnitTests tests:
  Set up zope.testing.testrunner.layer.UnitTests in 0.000 seconds.
  Ran 76 tests with 0 failures and 0 errors in 1.587 seconds.
Tearing down left over layers:
  Tear down zope.testing.testrunner.layer.UnitTests in 0.000 seconds.
Running Products.contentmigration.tests.layer.TestLayer tests:
  Set up Testing.ZopeTestCase.layer.ZopeLite in 1.406 seconds.
  Set up Products.PloneTestCase.layer.ZCML in 2.458 seconds.
  Set up Products.PloneTestCase.layer.PloneSite in 3.845 seconds.
  Set up Products.contentmigration.tests.layer.TestLayer in 0.002 seconds.
  Ran 18 tests with 0 failures and 0 errors in 4.184 seconds.
Tearing down left over layers:
  Tear down Products.contentmigration.tests.layer.TestLayer in 0.000 seconds.
  Tear down Products.PloneTestCase.layer.PloneSite in 0.329 seconds.
  Tear down Products.PloneTestCase.layer.ZCML in 0.004 seconds.
  Tear down Testing.ZopeTestCase.layer.ZopeLite in 0.000 seconds.
Total: 0 tests, 0 failures, 0 errors in 0.000 seconds.
Running archetypes.referencebrowserwidget.tests.base.layer tests:
  Set up Testing.ZopeTestCase.layer.ZopeLite in 0.000 seconds.
  Set up Products.PloneTestCase.layer.ZCML in 1.900 seconds.
  Set up Products.PloneTestCase.layer.PloneSite in 4.059 seconds.
  Set up archetypes.referencebrowserwidget.tests.base.layer in 0.000 seconds.
  Ran 43 tests with 0 failures and 0 errors in 7.443 seconds.
Running zope.testing.testrunner.layer.UnitTests tests:
  Tear down archetypes.referencebrowserwidget.tests.base.layer in 0.000 seconds.
  Tear down Products.PloneTestCase.layer.PloneSite in 0.342 seconds.
  Tear down Products.PloneTestCase.layer.ZCML in 0.007 seconds.
  Tear down Testing.ZopeTestCase.layer.ZopeLite in 0.000 seconds.
  Set up zope.testing.testrunner.layer.UnitTests in 0.000 seconds.
  Ran 4 tests with 0 failures and 0 errors in 0.001 seconds.
Tearing down left over layers:
  Tear down zope.testing.testrunner.layer.UnitTests in 0.000 seconds.
Total: 47 tests, 0 failures, 0 errors in 14.213 seconds.
Running archetypes.schemaextender.tests.testIntegration.layer tests:
  Set up Testing.ZopeTestCase.layer.ZopeLite in 1.323 seconds.
  Set up Products.PloneTestCase.layer.ZCML in 2.491 seconds.
  Set up Products.PloneTestCase.layer.PloneSite in 3.863 seconds.
  Set up archetypes.schemaextender.tests.testIntegration.layer in 0.000 seconds.
  Ran 17 tests with 0 failures and 0 errors in 2.918 seconds.
Running zope.testing.testrunner.layer.UnitTests tests:
  Tear down archetypes.schemaextender.tests.testIntegration.layer in 0.000 seconds.
  Tear down Products.PloneTestCase.layer.PloneSite in 0.334 seconds.
  Tear down Products.PloneTestCase.layer.ZCML in 0.007 seconds.
  Tear down Testing.ZopeTestCase.layer.ZopeLite in 0.000 seconds.
  Set up zope.testing.testrunner.layer.UnitTests in 0.000 seconds.
  Ran 19 tests with 0 failures and 0 errors in 0.006 seconds.
Tearing down left over layers:
  Tear down zope.testing.testrunner.layer.UnitTests in 0.000 seconds.
Total: 36 tests, 0 failures, 0 errors in 11.377 seconds.
Running zope.testing.testrunner.layer.UnitTests tests:
  Set up zope.testing.testrunner.layer.UnitTests in 0.000 seconds.
  Ran 4 tests with 0 failures and 0 errors in 0.040 seconds.
Tearing down left over layers:
  Tear down zope.testing.testrunner.layer.UnitTests in 0.000 seconds.
Running Testing.ZopeTestCase.layer.ZopeLite tests:
  Set up Testing.ZopeTestCase.layer.ZopeLite in 0.067 seconds.
  Ran 40 tests with 0 failures and 0 errors in 0.772 seconds.
Tearing down left over layers:
  Tear down Testing.ZopeTestCase.layer.ZopeLite in 0.000 seconds.
Running Testing.ZopeTestCase.layer.ZopeLite tests:
  Set up Testing.ZopeTestCase.layer.ZopeLite in 0.035 seconds.
  Ran 40 tests with 0 failures and 0 errors in 0.987 seconds.
Running zope.testing.testrunner.layer.UnitTests tests:
  Tear down Testing.ZopeTestCase.layer.ZopeLite in 0.000 seconds.
  Set up zope.testing.testrunner.layer.UnitTests in 0.000 seconds.
  Ran 1 tests with 0 failures and 0 errors in 0.099 seconds.
Tearing down left over layers:
  Tear down zope.testing.testrunner.layer.UnitTests in 0.000 seconds.
Total: 41 tests, 0 failures, 0 errors in 1.296 seconds.
/home/stefan/autotest/temp/python26-zope212-cmf22-plone40/src/kss.core/kss/core/tests/test_kssview_core.py:165: UserWarning: The test_class you are using doesn't subclass from ZopeTestCase.Functional. Please fix that.
  tearDown=KSSViewTestCase.beforeTearDown.im_func))
Running Testing.ZopeTestCase.layer.ZopeLite tests:
  Set up Testing.ZopeTestCase.layer.ZopeLite in 0.046 seconds.
  Ran 1 tests with 0 failures and 0 errors in 0.263 seconds.
Running kss.core.tests.base.KSSLayer tests:
  Tear down Testing.ZopeTestCase.layer.ZopeLite in 0.000 seconds.
  Set up kss.core.tests.base.KSSCoreLayer in 0.031 seconds.
  Set up kss.core.tests.base.KSSLayer in 0.056 seconds.
  Ran 29 tests with 0 failures and 0 errors in 0.154 seconds.
Running kss.core.tests.test_ttwapi.layer tests:
  Set up kss.core.tests.test_ttwapi.layer in 0.001 seconds.
  Ran 3 tests with 0 failures and 0 errors in 0.026 seconds.
Running zope.testing.testrunner.layer.UnitTests tests:
  Tear down kss.core.tests.test_ttwapi.layer in 0.000 seconds.
  Tear down kss.core.tests.base.KSSLayer in 0.000 seconds.
  Tear down kss.core.tests.base.KSSCoreLayer in 0.000 seconds.
  Set up zope.testing.testrunner.layer.UnitTests in 0.000 seconds.
/home/stefan/autotest/temp/python26-zope212-cmf22-plone40/src/kss.core/kss/core/siteview.txt:1: DeprecationWarning: ISite is deprecated. Moved to zope.location.interfaces. Importing from here will stop working in Zope 3.6
  =========
  Ran 14 tests with 0 failures and 0 errors in 0.020 seconds.
Tearing down left over layers:
  Tear down zope.testing.testrunner.layer.UnitTests in 0.000 seconds.
Total: 47 tests, 0 failures, 0 errors in 0.907 seconds.
***********************************************
WARNING: LinguaPlone not found. Skipping tests.
***********************************************
***********************************************
WARNING: LinguaPlone not found. Skipping tests.
***********************************************
Running plone.app.blob.tests.layer.BlobLayer tests:
  Set up Testing.ZopeTestCase.layer.ZopeLite in 0.921 seconds.
  Set up Products.PloneTestCase.layer.ZCML in 2.466 seconds.
  Set up Products.PloneTestCase.layer.PloneSite in 3.837 seconds.
  Set up plone.app.blob.tests.layer.BlobLayer in 0.088 seconds.
/home/stefan/autotest/temp/python26-zope212-cmf22-plone40/src/Products.PortalTransforms/Products/PortalTransforms/libtransforms/commandtransform.py:97: DeprecationWarning: os.popen4 is deprecated.  Use the subprocess module.
  cin, couterr = os.popen4(command, 'b')
  Ran 29 tests with 0 failures and 0 errors in 6.445 seconds.
Running plone.app.blob.tests.layer.BlobReplacementLayer tests:
  Set up plone.app.blob.tests.layer.BlobReplacementLayer in 0.192 seconds.
  Ran 45 tests with 0 failures and 0 errors in 10.261 seconds.
Running zope.testing.testrunner.layer.UnitTests tests:
  Tear down plone.app.blob.tests.layer.BlobReplacementLayer in 0.000 seconds.
  Tear down plone.app.blob.tests.layer.BlobLayer in 0.000 seconds.
  Tear down Products.PloneTestCase.layer.PloneSite in 0.332 seconds.
  Tear down Products.PloneTestCase.layer.ZCML in 0.009 seconds.
  Tear down Testing.ZopeTestCase.layer.ZopeLite in 0.000 seconds.
  Set up zope.testing.testrunner.layer.UnitTests in 0.000 seconds.
  Ran 2 tests with 0 failures and 0 errors in 0.001 seconds.
Tearing down left over layers:
  Tear down zope.testing.testrunner.layer.UnitTests in 0.000 seconds.
Total: 76 tests, 0 failures, 0 errors in 25.297 seconds.
Running Testing.ZopeTestCase.layer.ZopeLite tests:
  Set up Testing.ZopeTestCase.layer.ZopeLite in 0.929 seconds.
  Ran 2 tests with 0 failures and 0 errors in 0.008 seconds.
Running plone.app.folder.tests.layer.IntegrationLayer tests:
  Set up Products.PloneTestCase.layer.ZCML in 2.468 seconds.
  Set up Products.PloneTestCase.layer.PloneSite in 3.751 seconds.
  Set up plone.app.folder.tests.layer.IntegrationLayer in 0.084 seconds.
  Ran 22 tests with 0 failures and 0 errors in 4.961 seconds.
Running plone.app.folder.tests.layer.PartialOrderingIntegrationLayer tests:
  Set up plone.app.folder.tests.layer.PartialOrderingIntegrationLayer in 0.000 seconds.
  Ran 3 tests with 0 failures and 0 errors in 0.312 seconds.
Tearing down left over layers:
  Tear down plone.app.folder.tests.layer.PartialOrderingIntegrationLayer in 0.000 seconds.
  Tear down plone.app.folder.tests.layer.IntegrationLayer in 0.000 seconds.
  Tear down Products.PloneTestCase.layer.PloneSite in 0.340 seconds.
  Tear down Products.PloneTestCase.layer.ZCML in 0.004 seconds.
  Tear down Testing.ZopeTestCase.layer.ZopeLite in 0.000 seconds.
Total: 27 tests, 0 failures, 0 errors in 13.433 seconds.
Running plone.app.imaging.tests.layer.ImagingLayer tests:
  Set up Testing.ZopeTestCase.layer.ZopeLite in 0.933 seconds.
  Set up Products.PloneTestCase.layer.ZCML in 2.476 seconds.
  Set up Products.PloneTestCase.layer.PloneSite in 3.917 seconds.
  Set up plone.app.imaging.tests.layer.ImagingLayer in 0.086 seconds.
  Ran 37 tests with 0 failures and 0 errors in 3.647 seconds.
Running zope.testing.testrunner.layer.UnitTests tests:
  Tear down plone.app.imaging.tests.layer.ImagingLayer in 0.000 seconds.
  Tear down Products.PloneTestCase.layer.PloneSite in 0.355 seconds.
  Tear down Products.PloneTestCase.layer.ZCML in 0.005 seconds.
  Tear down Testing.ZopeTestCase.layer.ZopeLite in 0.000 seconds.
  Set up zope.testing.testrunner.layer.UnitTests in 0.000 seconds.
  Ran 7 tests with 0 failures and 0 errors in 0.001 seconds.
Tearing down left over layers:
  Tear down zope.testing.testrunner.layer.UnitTests in 0.000 seconds.
Total: 44 tests, 0 failures, 0 errors in 11.871 seconds.
Running Products.PloneTestCase.layer.PloneSite tests:
  Set up Testing.ZopeTestCase.layer.ZopeLite in 1.440 seconds.
  Set up Products.PloneTestCase.layer.ZCML in 2.491 seconds.
  Set up Products.PloneTestCase.layer.PloneSite in 3.914 seconds.
  Ran 9 tests with 0 failures and 0 errors in 0.117 seconds.
Tearing down left over layers:
  Tear down Products.PloneTestCase.layer.PloneSite in 0.331 seconds.
  Tear down Products.PloneTestCase.layer.ZCML in 0.004 seconds.
  Tear down Testing.ZopeTestCase.layer.ZopeLite in 0.000 seconds.
Running plone.app.linkintegrity.tests.layer.PloneLinkintegrity tests:
  Set up Testing.ZopeTestCase.layer.ZopeLite in 1.436 seconds.
  Set up Products.PloneTestCase.layer.ZCML in 3.388 seconds.
  Set up Products.PloneTestCase.layer.PloneSite in 4.189 seconds.
  Set up collective.testcaselayer.ptc.PTCLayer in 0.027 seconds.
  Set up plone.app.linkintegrity.tests.layer.PloneLinkintegrity in 0.523 seconds.
  Ran 117 tests with 0 failures and 0 errors in 26.677 seconds.
Running zope.testing.testrunner.layer.UnitTests tests:
  Tear down plone.app.linkintegrity.tests.layer.PloneLinkintegrity in 0.000 seconds.
  Tear down collective.testcaselayer.ptc.PTCLayer in 0.000 seconds.
  Tear down Products.PloneTestCase.layer.PloneSite in 0.351 seconds.
  Tear down Products.PloneTestCase.layer.ZCML in 0.006 seconds.
  Tear down Testing.ZopeTestCase.layer.ZopeLite in 0.000 seconds.
  Set up zope.testing.testrunner.layer.UnitTests in 0.000 seconds.
  Ran 1 tests with 0 failures and 0 errors in 0.001 seconds.
Tearing down left over layers:
  Tear down zope.testing.testrunner.layer.UnitTests in 0.000 seconds.
Total: 118 tests, 0 failures, 0 errors in 37.229 seconds.
Total: 0 tests, 0 failures, 0 errors in 0.000 seconds.
Running Products.PloneTestCase.layer.PloneSite tests:
  Set up Testing.ZopeTestCase.layer.ZopeLite in 2.391 seconds.
  Set up Products.PloneTestCase.layer.ZCML in 2.482 seconds.
  Set up Products.PloneTestCase.layer.PloneSite in 3.939 seconds.
  Ran 3 tests with 0 failures and 0 errors in 0.692 seconds.
Tearing down left over layers:
  Tear down Products.PloneTestCase.layer.PloneSite in 0.336 seconds.
  Tear down Products.PloneTestCase.layer.ZCML in 0.004 seconds.
  Tear down Testing.ZopeTestCase.layer.ZopeLite in 0.000 seconds.
Running Products.PloneTestCase.layer.PloneSite tests:
  Set up Testing.ZopeTestCase.layer.ZopeLite in 1.415 seconds.
  Set up Products.PloneTestCase.layer.ZCML in 2.507 seconds.
  Set up Products.PloneTestCase.layer.PloneSite in 3.922 seconds.
  Ran 38 tests with 0 failures and 0 errors in 7.833 seconds.
Tearing down left over layers:
  Tear down Products.PloneTestCase.layer.PloneSite in 0.335 seconds.
  Tear down Products.PloneTestCase.layer.ZCML in 0.006 seconds.
  Tear down Testing.ZopeTestCase.layer.ZopeLite in 0.000 seconds.
Running plone.folder.tests.layer.PloneFolderLayer tests:
  Set up plone.folder.tests.layer.PloneFolderLayer in 0.007 seconds.
  Ran 70 tests with 0 failures and 0 errors in 6.242 seconds.
Tearing down left over layers:
  Tear down plone.folder.tests.layer.PloneFolderLayer in 0.000 seconds.
Running Products.PloneTestCase.layer.PloneSite tests:
  Set up Testing.ZopeTestCase.layer.ZopeLite in 1.446 seconds.
  Set up Products.PloneTestCase.layer.ZCML in 2.506 seconds.
  Set up Products.PloneTestCase.layer.PloneSite in 4.086 seconds.
  Ran 41 tests with 0 failures and 0 errors in 0.316 seconds.
Tearing down left over layers:
  Tear down Products.PloneTestCase.layer.PloneSite in 0.331 seconds.
  Tear down Products.PloneTestCase.layer.ZCML in 0.004 seconds.
  Tear down Testing.ZopeTestCase.layer.ZopeLite in 0.000 seconds.
Total: 0 tests, 0 failures, 0 errors in 0.000 seconds.
Total: 0 tests, 0 failures, 0 errors in 0.000 seconds.
Running Products.PloneTestCase.layer.ZCML tests:
  Set up Testing.ZopeTestCase.layer.ZopeLite in 0.933 seconds.
  Set up Products.PloneTestCase.layer.ZCML in 2.470 seconds.
/home/stefan/autotest/temp/python26-zope212-cmf22-plone40/eggs/wicked-1.1.8alpha1-py2.6.egg/wicked/cache.py:34: DeprecationWarning: object.__init__() takes no parameters
  super(CacheStore, self).__init__(self)
  Ran 16 tests with 0 failures and 0 errors in 0.141 seconds.
Running wicked.at.tests.wickedtestcase.WickedSite tests:
  Set up Products.PloneTestCase.layer.PloneSite in 4.606 seconds.
  Set up wicked.at.tests.wickedtestcase.WickedSite in 0.002 seconds.
/home/stefan/autotest/temp/python26-zope212-cmf22-plone40/eggs/Zope2-2.12.3-py2.6-linux-x86_64.egg/OFS/subscribers.py:73: DeprecationWarning: wicked.atcontent.ironicwiki.IronicWiki.manage_afterAdd is discouraged. You should use event subscribers instead.
  DeprecationWarning)
/home/stefan/autotest/temp/python26-zope212-cmf22-plone40/eggs/Zope2-2.12.3-py2.6-linux-x86_64.egg/OFS/subscribers.py:73: DeprecationWarning: wicked.atcontent.ironicwiki.IronicWiki.manage_beforeDelete is discouraged. You should use event subscribers instead.
  DeprecationWarning)
/home/stefan/autotest/temp/python26-zope212-cmf22-plone40/eggs/Zope2-2.12.3-py2.6-linux-x86_64.egg/OFS/subscribers.py:73: DeprecationWarning: wicked.atcontent.ironicwiki.IronicWiki.manage_afterClone is discouraged. You should use event subscribers instead.
  DeprecationWarning)
  Ran 23 tests with 0 failures and 0 errors in 5.445 seconds.
Running wicked.at.tests.test_scope.Scoped tests:
  Set up wicked.at.tests.test_scope.Scoped in 0.000 seconds.
  Ran 3 tests with 0 failures and 0 errors in 0.597 seconds.
Running wicked.plone.tests.SelectiveATCT tests:
  Tear down wicked.at.tests.test_scope.Scoped in 0.000 seconds.
  Tear down wicked.at.tests.wickedtestcase.WickedSite in 0.002 seconds.
  Set up wicked.plone.tests.SelectiveATCT in 0.003 seconds.
  Ran 22 tests with 0 failures and 0 errors in 5.633 seconds.
Running wicked.plone.tests.ZCMLLayer tests:
  Tear down wicked.plone.tests.SelectiveATCT in 0.004 seconds.
  Set up wicked.plone.tests.ZCMLLayer in 0.020 seconds.
  Ran 8 tests with 0 failures and 0 errors in 0.661 seconds.
Running zope.testing.testrunner.layer.UnitTests tests:
  Tear down wicked.plone.tests.ZCMLLayer in 0.358 seconds.
  Tear down Products.PloneTestCase.layer.PloneSite in 0.001 seconds.
  Tear down Products.PloneTestCase.layer.ZCML in 0.004 seconds.
  Tear down Testing.ZopeTestCase.layer.ZopeLite in 0.000 seconds.
  Set up zope.testing.testrunner.layer.UnitTests in 0.000 seconds.
  Ran 34 tests with 0 failures and 0 errors in 0.016 seconds.
Tearing down left over layers:
  Tear down zope.testing.testrunner.layer.UnitTests in 0.000 seconds.
Total: 106 tests, 0 failures, 0 errors in 22.154 seconds.
#### Running tests for group ATCT ####
#### Finished tests for group ATCT ####

#### Running tests for group Archetypes ####
#### Finished tests for group Archetypes ####

#### Running tests for group CMF ####
#### Finished tests for group CMF ####

#### Running tests for group CMFEditions ####
#### Finished tests for group CMFEditions ####

#### Running tests for group Plone ####
#### Finished tests for group Plone ####

#### Running tests for group PlonePAS ####
#### Finished tests for group PlonePAS ####

#### Running tests for group plone ####
#### Finished tests for group plone ####

#### Running tests for group portlets ####
#### Finished tests for group portlets ####

#### Running tests for group z3c.autoinclude ####
#### Finished tests for group z3c.autoinclude ####

#### Running tests for Products.CMFPlacefulWorkflow ####
#### Finished tests for Products.CMFPlacefulWorkflow ####

#### Running tests for Products.CMFTestCase ####
#### Finished tests for Products.CMFTestCase ####

#### Running tests for Products.ExtendedPathIndex ####
#### Finished tests for Products.ExtendedPathIndex ####

#### Running tests for Products.PasswordResetTool ####
#### Finished tests for Products.PasswordResetTool ####

#### Running tests for Products.PloneTestCase ####
#### Finished tests for Products.PloneTestCase ####

#### Running tests for Products.ResourceRegistries ####
#### Finished tests for Products.ResourceRegistries ####

#### Running tests for Products.TinyMCE ####
#### Finished tests for Products.TinyMCE ####

#### Running tests for Products.ZopeVersionControl ####
#### Finished tests for Products.ZopeVersionControl ####

#### Running tests for Products.contentmigration ####
#### Finished tests for Products.contentmigration ####

#### Running tests for Products.i18ntestcase ####
#### Finished tests for Products.i18ntestcase ####

#### Running tests for archetypes.referencebrowserwidget ####
#### Finished tests for archetypes.referencebrowserwidget ####

#### Running tests for archetypes.schemaextender ####
#### Finished tests for archetypes.schemaextender ####

#### Running tests for collective.monkeypatcher ####
#### Finished tests for collective.monkeypatcher ####

#### Running tests for five.customerize ####
#### Finished tests for five.customerize ####

#### Running tests for five.formlib ####
#### Finished tests for five.formlib ####

#### Running tests for kss.core ####
#### Finished tests for kss.core ####

#### Running tests for plone.app.blob ####
#### Finished tests for plone.app.blob ####

#### Running tests for plone.app.folder ####
#### Finished tests for plone.app.folder ####

#### Running tests for plone.app.imaging ####
#### Finished tests for plone.app.imaging ####

#### Running tests for plone.app.jquerytools ####
#### Finished tests for plone.app.jquerytools ####

#### Running tests for plone.app.linkintegrity ####
#### Finished tests for plone.app.linkintegrity ####

#### Running tests for plone.app.locales ####
#### Finished tests for plone.app.locales ####

#### Running tests for plone.app.openid ####
#### Finished tests for plone.app.openid ####

#### Running tests for plone.app.users ####
#### Finished tests for plone.app.users ####

#### Running tests for plone.folder ####
#### Finished tests for plone.folder ####

#### Running tests for plone.stringinterp ####
#### Finished tests for plone.stringinterp ####

#### Running tests for plonetheme.classic ####
#### Finished tests for plonetheme.classic ####

#### Running tests for plonetheme.sunburst ####
#### Finished tests for plonetheme.sunburst ####

#### Running tests for wicked ####
#### Finished tests for wicked ####

Packages with test failures:

Failing tests in group Archetypes
Failing tests in group portlets

Total time elapsed: 920.806 seconds

Grand total: 90 packages, 2 failures


FAILED (90 packages, 2 failures)




More information about the Testbot mailing list