[Testbot] FAILED (90 packages, 1 failures) : Plone-4.0 Zope-2.12 Python-2.6.4

Plone Tests plone-tests at epy.co.at
Mon Feb 22 02:41:11 UTC 2010


Plone Tests : FAILED (90 packages, 1 failures)
Plone-4.0 Zope-2.12 Python-2.6.4

Running ./bin/alltests -q --no-color --no-progress
Running Products.CMFTestCase.layer.CMFSite tests:
  Set up Testing.ZopeTestCase.layer.ZopeLite in 1.004 seconds.
  Set up Products.CMFTestCase.layer.ZCML in 3.009 seconds.
  Set up Products.CMFTestCase.layer.CMFSite in 1.466 seconds.
  Ran 31 tests with 0 failures and 0 errors in 0.560 seconds.
Running Products.PloneTestCase.layer.PloneSite tests:
  Tear down Products.CMFTestCase.layer.CMFSite in 0.064 seconds.
  Tear down Products.CMFTestCase.layer.ZCML in 0.004 seconds.
  Set up Products.PloneTestCase.layer.ZCML in 1.768 seconds.
  Set up Products.PloneTestCase.layer.PloneSite in 3.682 seconds.
  Ran 712 tests with 0 failures and 0 errors in 1 minutes 10.239 seconds.
Tearing down left over layers:
  Tear down Products.PloneTestCase.layer.PloneSite in 0.353 seconds.
  Tear down Products.PloneTestCase.layer.ZCML in 0.010 seconds.
  Tear down Testing.ZopeTestCase.layer.ZopeLite in 0.000 seconds.
Total: 743 tests, 0 failures, 0 errors in 1 minutes 22.670 seconds.
Running Testing.ZopeTestCase.layer.ZopeLite tests:
  Set up Testing.ZopeTestCase.layer.ZopeLite in 0.828 seconds.
  Ran 36 tests with 0 failures and 0 errors in 0.081 seconds.
Running Products.Archetypes.tests.layer.ZCML tests:
  Set up Products.CMFCore.testing.FunctionalZCMLLayer in 0.191 seconds.
  Set up Products.Archetypes.tests.layer.ZCML in 0.179 seconds.
  Ran 59 tests with 0 failures and 0 errors in 1.161 seconds.
Running Products.Archetypes.tests.layer.ArchetypesSite tests:
  Set up Products.Archetypes.tests.layer.ArchetypesSite in 1.403 seconds.
/home/stefan/autotest/temp/python26-zope212-cmf22-plone40/eggs/Zope2-2.12.3-py2.6-linux-x86_64.egg/OFS/subscribers.py:73: DeprecationWarning: Products.Archetypes.tests.test_classgen.Dummy.manage_afterAdd is discouraged. You should use event subscribers instead.
  DeprecationWarning)
/home/stefan/autotest/temp/python26-zope212-cmf22-plone40/eggs/Zope2-2.12.3-py2.6-linux-x86_64.egg/OFS/subscribers.py:73: DeprecationWarning: Products.Archetypes.tests.test_annotation.AnnDummy.manage_afterAdd is discouraged. You should use event subscribers instead.
  DeprecationWarning)
/home/stefan/autotest/temp/python26-zope212-cmf22-plone40/eggs/Zope2-2.12.3-py2.6-linux-x86_64.egg/OFS/subscribers.py:73: DeprecationWarning: Products.Archetypes.tests.test_event.Dummy.manage_afterAdd is discouraged. You should use event subscribers instead.
  DeprecationWarning)


Failure in test testSame (Products.PortalTransforms.tests.test_transforms.TransformTestSubclass)
Traceback (most recent call last):
  File "/usr/local/python2.6/lib/python2.6/unittest.py", line 279, in run
    testMethod()
  File "/home/stefan/autotest/temp/python26-zope212-cmf22-plone40/eggs/Products.PortalTransforms-2.0b3-py2.6.egg/Products/PortalTransforms/tests/test_transforms.py", line 68, in testSame
    self.do_convert(filename=self.input)
  File "/home/stefan/autotest/temp/python26-zope212-cmf22-plone40/eggs/Products.PortalTransforms-2.0b3-py2.6.egg/Products/PortalTransforms/tests/test_transforms.py", line 60, in do_convert
    got, expected, self.transform.name(), self.input))
  File "/usr/local/python2.6/lib/python2.6/unittest.py", line 350, in failUnlessEqual
    (msg or '%r != %r' % (first, second))
AssertionError: [BM®      6   (               x                ÿÿÿûùøþýùÿÿûÿÿøóñéóòèÿÿöòòæîîâÞÜÒØÕÍÖÒÍìèãøóðÿýùÿÿþíîìÿÿþÿÿþóôòÿÿþüýûüýûÿýüÿÿþÿüøòïêúøðÿÿù÷öìÕÔÊ×ÖÌåäÚôòêìêâëèãàÝØÖÓÏÆÂÁâàßÿÿþîïíúûùÿÿþòóñûüúþÿýüø÷ùöòÿÿûÿÿûöôìÐÎÆÏÎÄêéßæåÛÛÚÐÛÙÑÈƾØÕÐØÕÑñíìôòñåãâÉÊÈýþüÿÿþïðîÿÿþúûùõöôÿú÷ÿÿüúöñáÝØàÝÕñïåèçÝÌËÁõôêíìâÿýõÿÿ÷ÿÿûéæâÛ×ÖËÉÈÍËÊïðîÏÐÎãäâÿÿþóôòüýûüýûÿÿüöñîðìçîëãÝÚÒÎÌÂãâØÿÿøçæÜÞÝÓåãÛñïçÿÿüÿþúÿÿþÿÿþòóñÉÊÈßàÞÚÛÙ×ØÖüýûÿÿþÿÿþÿÿüùôñáÝØÑÎÆßÜÔüúðÿÿöööêèçÝëêàßÝÕÜÚÒÝÜØø÷óÿÿþÿÿÿóôòùúøÓÔÒÑÒÐäåãæçåúûùÿÿþÿýøíéäÝÙÔáÞÖïìä÷õíúøðùúñÐÑÈíîåéçßãàÛÛØÓÿÿûÿÿüú÷óÿÿüòóïëìèßàÜÛÜØéêæóôðûüøÿüó×ÒÉîëãÑÎÆÿýøÿÿüüýùøù÷ÞßÝàáÝàßÛíêåÕÓËÿÿøöñèÿÿõþüôÿÿùÿÿùÄżëìãÊËÂÿÿûÿÿùùóèÜØÍêåÜÝÛÓÿýøÿÿûÿÿþøúú¼¾¾ßàÞåäàÙÙÓÜÙÑþüòÿüñÿÿ÷ÿÿ÷ÿÿøö÷í÷øîâãÙàá×âãÚýþõéãÖåáÖâÝÔðîæÿþùýüøÿÿþüýûÿÿþö÷õâáÝììæÿÿùçåÛ×ÐÇÓÎÅÞÝÓüýóÿÿøÿÿøÂúòóêÜÝÔüýôÜÖÉíêÜØÖËÿÿöÿÿøúúôÿÿüýþüýþüòóñîíéÿÿüÿÿûÏÌÄâÜÕïéâÛÚÐàá×ÿÿøôõëÅƽñòéáâÙúûò×ÔÅïìÞÔÒÇÿÿøÿÿøùùóÿÿüÿÿûÿÿþÿÿþÿÿþÿÿûÑÌÉÒÎÉùóîãßÚýûóÉÊÀ÷øïýþõåæÝèéàÏÏÉýý÷ÝÚËêéÛÓÒÄÿÿöÿÿ÷ûùñÿÿûÿþúÿýüòðïõñðÿþýäßÜïêçüõòÜ×ÔäâÚØÙÏÿÿ÷ÿÿù×ØÏæçÞÈÈÂÿÿûæå×åäÖÔÓÅøøìÿÿöüúòÿÿûÿýøÿÿüøõñÿÿþÿÿþüø÷ÔÐÏËÆÅÛÖÕÐÍÈö÷îÿÿùúûòÃýêêäÕÕÏÿÿûîìááàÒÕÕÉððäÿÿöýüòÿþöÿü÷æãßÖÓÏØÔÓ¸´³ÿÿþÿÿþðêëû÷öÿÿûÿÿùûüóæçÞÛÛÕîîèÚÚÔýý÷ÿÿøÌÌÀüûñ¾½³ýüòúùïÿÿùÿþöÎÊÅùõðâßÛìéåÉÅÄÿÿþÿúûþúùÿÿüööðÿÿûËËÅîîèÍÍÇÿÿüúùõðîæòðèáß×åãÛø÷íÿÿöîëãõòêàÝÕîêåÛ×ÒñîêÜÙÕÿþýöòñÿûúÿÿüèèâÿÿûÆÆÀììæààÚýüøÿÿûÿÿüÿÿûÍÊÅòïêÊÇ¿æãÛÿÿøúõìËƽñîæòïçåáÜÓÐËÿüøÿÿüÿÿüøøòüüöÇÇÁééãÞÝÙòñíÿÿûÿÿüøööÿÿÿóïîÇÄÀÿÿûÄÁ¹úõìñìãøóêÍÈ¿º¸®ÛØÐýûóÿÿûþþøÿÿûööðÍÍÇççáÔÔÎõôðÿþú÷öòÿÿüþýÿþýÿæãåÿþÿÆÁ¾îêåäÞ×äÝÔêäÙÿÿöÿÿ÷ÿÿøýüòö÷îéêáËÍÇ××ÑéèäÈÇÃýüø÷öòûúöÿÿþþüûÿüÿÿýÿÿûÿðíïîéèñíèÒÊÃîèÝëåÚËȺÀ½¯ÌÌÀÚÚÎÓÔÊÝáÖóöíããÝÍÌÈÿÿüäãßÿÿüûúöýûúÿýü÷öÿòïøÿýÿÿýÿý÷øÿÿüìäÝßÙÎÚÔÉõòäÿüîòòäßßÑßáÕ×ÛÏÐÔÉççáûúöñðìÿÿüþýùüû÷ÿÿþûùøýüÿýüÿü÷ÿõñöÿþÿÿüùÿýöÿþóý÷ìéæØÌɺÏÐÀÕÕÇìñâíñåïõêýý÷ÿÿûÿÿüúùõúùõÿÿüÿþýþüû]

!=

[BM®      6   (               x                ÿÿþûùøÿüûÿÿüÿÿúóñéóòèÿÿöòòæîíãÞÜÒØÕÍÖÓËìèãøóðÿüùÿÿþíîìÿÿþÿÿþóôòÿÿþüýûüýûÿýüÿÿþÿüøòïêúøðÿÿù÷öìÕÔÊ×ÖÌåäÚôóéìêâëèãáÜÙ×ÒÏÇ¿àáßÿÿþîïíúûùÿÿþòóñûüúþÿýüø÷ùöòÿÿüÿÿûöôìÐÏÅÏÎÄêéßæåÛÛÚÐÛÙÑÈƾØÕÐØÕÑñíìöòñãäâÉÊÈýþüÿÿþïðîÿÿþúûùõöôÿú÷ÿÿüúöñáÝØàÝÕðïåèçÝÌÌÀõôêíìâÿýõÿþùÿÿûéæâÛ×ÖÍÉÈËÌÊïðîÏÐÎãäâÿÿþóôòüýûüýûÿÿüöñîðìçîëãÝÚÒÎÌÂãâØÿÿ÷çæÜÞÝÓåãÛñîéÿÿüÿýüÿÿþÿÿÿòóñÉÊÈßàÞÚÛÙ×ØÖüýûÿÿþÿÿþÿÿüùõðáÝØÑÎÆßÜÔüúðÿÿ÷ööêèçÝëêàßÝÕÜÙÔÝÜØøöõÿÿþÿÿÿóôòùúøÓÔÒÑÒÐäåãæçåúûùÿÿþÿüùíéäÝÙÔáÞÖïíãøöìûùïûûïÒÑÇïîäéçßãàÛÙØÔÿÿþÿÿþøööÿÿþòóñëìêßàÞÛÜÚéêèóôòûüúÿýòÙÓÈðëâÑÎÆÿýùÿÿþüýûöøøÜÞÞàáßÞßÛíêåÖÓËÿÿ÷øòçÿÿòüýóÿÿøÿÿøÄÅ»ëìâÊËÁÿÿùÿÿ÷ùóèÞØÍêåÜÞÛÓÿýøÿÿûÿÿþøúú¼¾¾ßàÞåäàÛØÓÜÙÑÿûòÿüñÿÿ÷ÿÿ÷ÿÿøö÷í÷øîâãÙàá×âãÚýþõéãÖçáÖâÞÓñîæÿþùýüøÿÿþúýûýÿÿö÷õâàßîëçÿÿûéãÜ×ÐÇÕÏÄÜÝÓüýóÿÿøÿÿøÂùòóêÜÝÔüýôÜÖÉíêÜÚÖËÿÿöÿÿøúúôÿÿüýþüýþüòóñîìëÿÿüÿÿûÑËÆâÜÕñéâÙÚÐàá×ÿÿøôõëÅƽñòéáâÙúûò×ÔÅïìÞÔÓÅÿÿ÷ÿÿøùùóÿÿüþÿûÿÿþÿÿþÿÿþÿþýÑÌÉÒÍÊùóîåßÚûüòÉÊÀ÷øîýþõåæÝèéàÏÐÇýý÷ÝÚËìéÚÓÒÄÿÿöÿÿ÷ùúñÿÿûÿþúÿþúòðïóñðÿþýäßÞïêçüõòÞ×ÔâãÙØÙÏÿÿ÷ÿÿù×ØÏæçÞÈÈÂÿÿûææÖåäÖÔÓÅøøìÿÿöüûñÿÿùþþøÿÿüöõñÿÿþÿÿþüø÷ÕÐÏËÆÅÛÖÕÎÏÆö÷îÿÿùúûòÃÄ»êêäÕÕÏÿÿûîíßáàÒÕÕÇððäÿÿõýüòÿþöÿü÷æãÞÖÓÏØÕѸ´³ÿÿþÿÿþðêëüö÷ÿÿùÿÿùûüóæçÞÛÛÕîîèÚÚÔýý÷ÿÿ÷ÌÌÀüüð¾¾²ýüòúùïÿÿùÿþöÎÊÅùõðâßÛìéåÉÅÄÿÿþÿúûþùúÿÿùö÷îÿÿûËËÅîîèÍÍÇÿÿûúùõîïæðñèáàÖåäÚø÷íÿÿöîìâõòêàÝÕîëãÛ×ÒñîêÜÙÕÿþýôòñýûúÿÿûèèâÿÿûÆÆÀììæààÚýüøÿÿûÿÿüÿÿúËËÅòïêÊÇ¿æãÛÿÿøúõìËƽóîåòïçåáÜÓÐËýüøÿÿüÿÿþøøòüüöÇÇÁééãÞÞØòñíÿÿûÿÿüöööÿÿþñïîÇÄÀÿÿûÄÁ¹úõìñìãøôéÍÈ¿º¸®ÛØÐýûóÿÿûþþøÿÿüööðÍÍÇççáÔÓÏõôðÿþú÷öòÿÿþþýÿþýÿæääÿÿþÆÁ¾ðêåäßÖäÞÓêäÙÿÿöÿÿ÷ÿÿ÷ýüòö÷îçêáËÎÅ××ÑééãÈÇÃýüø÷öòûúöÿÿþþüûýüÿÿýÿÿûÿòíîîéèóíèÒËÂîèÝëåØÍǺÀ½¯Í̾ÚÚÎÓÕÉÝáÖñ÷ìãâÞÍÌÈÿÿüäãßÿÿüûúöýûúÿýü÷öÿòïøÿýÿÿþÿýø÷ÿÿûìäÝßÙÎÚÔÇ÷ñäÿüíóòäßßÑßáÕ×ÛÏÎÕÈçæâûúöñðìÿÿüþýùüúùÿÿþûùøýûÿÿûÿú÷ÿ÷ñöÿþÿÿüùÿýöÿþóý÷êëæ×ÌɺÐÐÀÕÕÇìñâíñåïöéýüøÿÿûÿÿüúùõúùõÿÿþÿþýþüû]

IN image_to_bmp(/home/stefan/autotest/temp/python26-zope212-cmf22-plone40/eggs/Products.PortalTransforms-2.0b3-py2.6.egg/Products/PortalTransforms/tests/input/logo.jpg)



Failure in test testSameNoFilename (Products.PortalTransforms.tests.test_transforms.TransformTestSubclass)
Traceback (most recent call last):
  File "/usr/local/python2.6/lib/python2.6/unittest.py", line 279, in run
    testMethod()
  File "/home/stefan/autotest/temp/python26-zope212-cmf22-plone40/eggs/Products.PortalTransforms-2.0b3-py2.6.egg/Products/PortalTransforms/tests/test_transforms.py", line 74, in testSameNoFilename
    self.do_convert()
  File "/home/stefan/autotest/temp/python26-zope212-cmf22-plone40/eggs/Products.PortalTransforms-2.0b3-py2.6.egg/Products/PortalTransforms/tests/test_transforms.py", line 60, in do_convert
    got, expected, self.transform.name(), self.input))
  File "/usr/local/python2.6/lib/python2.6/unittest.py", line 350, in failUnlessEqual
    (msg or '%r != %r' % (first, second))
AssertionError: [BM®      6   (               x                ÿÿÿûùøþýùÿÿûÿÿøóñéóòèÿÿöòòæîîâÞÜÒØÕÍÖÒÍìèãøóðÿýùÿÿþíîìÿÿþÿÿþóôòÿÿþüýûüýûÿýüÿÿþÿüøòïêúøðÿÿù÷öìÕÔÊ×ÖÌåäÚôòêìêâëèãàÝØÖÓÏÆÂÁâàßÿÿþîïíúûùÿÿþòóñûüúþÿýüø÷ùöòÿÿûÿÿûöôìÐÎÆÏÎÄêéßæåÛÛÚÐÛÙÑÈƾØÕÐØÕÑñíìôòñåãâÉÊÈýþüÿÿþïðîÿÿþúûùõöôÿú÷ÿÿüúöñáÝØàÝÕñïåèçÝÌËÁõôêíìâÿýõÿÿ÷ÿÿûéæâÛ×ÖËÉÈÍËÊïðîÏÐÎãäâÿÿþóôòüýûüýûÿÿüöñîðìçîëãÝÚÒÎÌÂãâØÿÿøçæÜÞÝÓåãÛñïçÿÿüÿþúÿÿþÿÿþòóñÉÊÈßàÞÚÛÙ×ØÖüýûÿÿþÿÿþÿÿüùôñáÝØÑÎÆßÜÔüúðÿÿöööêèçÝëêàßÝÕÜÚÒÝÜØø÷óÿÿþÿÿÿóôòùúøÓÔÒÑÒÐäåãæçåúûùÿÿþÿýøíéäÝÙÔáÞÖïìä÷õíúøðùúñÐÑÈíîåéçßãàÛÛØÓÿÿûÿÿüú÷óÿÿüòóïëìèßàÜÛÜØéêæóôðûüøÿüó×ÒÉîëãÑÎÆÿýøÿÿüüýùøù÷ÞßÝàáÝàßÛíêåÕÓËÿÿøöñèÿÿõþüôÿÿùÿÿùÄżëìãÊËÂÿÿûÿÿùùóèÜØÍêåÜÝÛÓÿýøÿÿûÿÿþøúú¼¾¾ßàÞåäàÙÙÓÜÙÑþüòÿüñÿÿ÷ÿÿ÷ÿÿøö÷í÷øîâãÙàá×âãÚýþõéãÖåáÖâÝÔðîæÿþùýüøÿÿþüýûÿÿþö÷õâáÝììæÿÿùçåÛ×ÐÇÓÎÅÞÝÓüýóÿÿøÿÿøÂúòóêÜÝÔüýôÜÖÉíêÜØÖËÿÿöÿÿøúúôÿÿüýþüýþüòóñîíéÿÿüÿÿûÏÌÄâÜÕïéâÛÚÐàá×ÿÿøôõëÅƽñòéáâÙúûò×ÔÅïìÞÔÒÇÿÿøÿÿøùùóÿÿüÿÿûÿÿþÿÿþÿÿþÿÿûÑÌÉÒÎÉùóîãßÚýûóÉÊÀ÷øïýþõåæÝèéàÏÏÉýý÷ÝÚËêéÛÓÒÄÿÿöÿÿ÷ûùñÿÿûÿþúÿýüòðïõñðÿþýäßÜïêçüõòÜ×ÔäâÚØÙÏÿÿ÷ÿÿù×ØÏæçÞÈÈÂÿÿûæå×åäÖÔÓÅøøìÿÿöüúòÿÿûÿýøÿÿüøõñÿÿþÿÿþüø÷ÔÐÏËÆÅÛÖÕÐÍÈö÷îÿÿùúûòÃýêêäÕÕÏÿÿûîìááàÒÕÕÉððäÿÿöýüòÿþöÿü÷æãßÖÓÏØÔÓ¸´³ÿÿþÿÿþðêëû÷öÿÿûÿÿùûüóæçÞÛÛÕîîèÚÚÔýý÷ÿÿøÌÌÀüûñ¾½³ýüòúùïÿÿùÿþöÎÊÅùõðâßÛìéåÉÅÄÿÿþÿúûþúùÿÿüööðÿÿûËËÅîîèÍÍÇÿÿüúùõðîæòðèáß×åãÛø÷íÿÿöîëãõòêàÝÕîêåÛ×ÒñîêÜÙÕÿþýöòñÿûúÿÿüèèâÿÿûÆÆÀììæààÚýüøÿÿûÿÿüÿÿûÍÊÅòïêÊÇ¿æãÛÿÿøúõìËƽñîæòïçåáÜÓÐËÿüøÿÿüÿÿüøøòüüöÇÇÁééãÞÝÙòñíÿÿûÿÿüøööÿÿÿóïîÇÄÀÿÿûÄÁ¹úõìñìãøóêÍÈ¿º¸®ÛØÐýûóÿÿûþþøÿÿûööðÍÍÇççáÔÔÎõôðÿþú÷öòÿÿüþýÿþýÿæãåÿþÿÆÁ¾îêåäÞ×äÝÔêäÙÿÿöÿÿ÷ÿÿøýüòö÷îéêáËÍÇ××ÑéèäÈÇÃýüø÷öòûúöÿÿþþüûÿüÿÿýÿÿûÿðíïîéèñíèÒÊÃîèÝëåÚËȺÀ½¯ÌÌÀÚÚÎÓÔÊÝáÖóöíããÝÍÌÈÿÿüäãßÿÿüûúöýûúÿýü÷öÿòïøÿýÿÿýÿý÷øÿÿüìäÝßÙÎÚÔÉõòäÿüîòòäßßÑßáÕ×ÛÏÐÔÉççáûúöñðìÿÿüþýùüû÷ÿÿþûùøýüÿýüÿü÷ÿõñöÿþÿÿüùÿýöÿþóý÷ìéæØÌɺÏÐÀÕÕÇìñâíñåïõêýý÷ÿÿûÿÿüúùõúùõÿÿüÿþýþüû]

!=

[BM®      6   (               x                ÿÿþûùøÿüûÿÿüÿÿúóñéóòèÿÿöòòæîíãÞÜÒØÕÍÖÓËìèãøóðÿüùÿÿþíîìÿÿþÿÿþóôòÿÿþüýûüýûÿýüÿÿþÿüøòïêúøðÿÿù÷öìÕÔÊ×ÖÌåäÚôóéìêâëèãáÜÙ×ÒÏÇ¿àáßÿÿþîïíúûùÿÿþòóñûüúþÿýüø÷ùöòÿÿüÿÿûöôìÐÏÅÏÎÄêéßæåÛÛÚÐÛÙÑÈƾØÕÐØÕÑñíìöòñãäâÉÊÈýþüÿÿþïðîÿÿþúûùõöôÿú÷ÿÿüúöñáÝØàÝÕðïåèçÝÌÌÀõôêíìâÿýõÿþùÿÿûéæâÛ×ÖÍÉÈËÌÊïðîÏÐÎãäâÿÿþóôòüýûüýûÿÿüöñîðìçîëãÝÚÒÎÌÂãâØÿÿ÷çæÜÞÝÓåãÛñîéÿÿüÿýüÿÿþÿÿÿòóñÉÊÈßàÞÚÛÙ×ØÖüýûÿÿþÿÿþÿÿüùõðáÝØÑÎÆßÜÔüúðÿÿ÷ööêèçÝëêàßÝÕÜÙÔÝÜØøöõÿÿþÿÿÿóôòùúøÓÔÒÑÒÐäåãæçåúûùÿÿþÿüùíéäÝÙÔáÞÖïíãøöìûùïûûïÒÑÇïîäéçßãàÛÙØÔÿÿþÿÿþøööÿÿþòóñëìêßàÞÛÜÚéêèóôòûüúÿýòÙÓÈðëâÑÎÆÿýùÿÿþüýûöøøÜÞÞàáßÞßÛíêåÖÓËÿÿ÷øòçÿÿòüýóÿÿøÿÿøÄÅ»ëìâÊËÁÿÿùÿÿ÷ùóèÞØÍêåÜÞÛÓÿýøÿÿûÿÿþøúú¼¾¾ßàÞåäàÛØÓÜÙÑÿûòÿüñÿÿ÷ÿÿ÷ÿÿøö÷í÷øîâãÙàá×âãÚýþõéãÖçáÖâÞÓñîæÿþùýüøÿÿþúýûýÿÿö÷õâàßîëçÿÿûéãÜ×ÐÇÕÏÄÜÝÓüýóÿÿøÿÿøÂùòóêÜÝÔüýôÜÖÉíêÜÚÖËÿÿöÿÿøúúôÿÿüýþüýþüòóñîìëÿÿüÿÿûÑËÆâÜÕñéâÙÚÐàá×ÿÿøôõëÅƽñòéáâÙúûò×ÔÅïìÞÔÓÅÿÿ÷ÿÿøùùóÿÿüþÿûÿÿþÿÿþÿÿþÿþýÑÌÉÒÍÊùóîåßÚûüòÉÊÀ÷øîýþõåæÝèéàÏÐÇýý÷ÝÚËìéÚÓÒÄÿÿöÿÿ÷ùúñÿÿûÿþúÿþúòðïóñðÿþýäßÞïêçüõòÞ×ÔâãÙØÙÏÿÿ÷ÿÿù×ØÏæçÞÈÈÂÿÿûææÖåäÖÔÓÅøøìÿÿöüûñÿÿùþþøÿÿüöõñÿÿþÿÿþüø÷ÕÐÏËÆÅÛÖÕÎÏÆö÷îÿÿùúûòÃÄ»êêäÕÕÏÿÿûîíßáàÒÕÕÇððäÿÿõýüòÿþöÿü÷æãÞÖÓÏØÕѸ´³ÿÿþÿÿþðêëüö÷ÿÿùÿÿùûüóæçÞÛÛÕîîèÚÚÔýý÷ÿÿ÷ÌÌÀüüð¾¾²ýüòúùïÿÿùÿþöÎÊÅùõðâßÛìéåÉÅÄÿÿþÿúûþùúÿÿùö÷îÿÿûËËÅîîèÍÍÇÿÿûúùõîïæðñèáàÖåäÚø÷íÿÿöîìâõòêàÝÕîëãÛ×ÒñîêÜÙÕÿþýôòñýûúÿÿûèèâÿÿûÆÆÀììæààÚýüøÿÿûÿÿüÿÿúËËÅòïêÊÇ¿æãÛÿÿøúõìËƽóîåòïçåáÜÓÐËýüøÿÿüÿÿþøøòüüöÇÇÁééãÞÞØòñíÿÿûÿÿüöööÿÿþñïîÇÄÀÿÿûÄÁ¹úõìñìãøôéÍÈ¿º¸®ÛØÐýûóÿÿûþþøÿÿüööðÍÍÇççáÔÓÏõôðÿþú÷öòÿÿþþýÿþýÿæääÿÿþÆÁ¾ðêåäßÖäÞÓêäÙÿÿöÿÿ÷ÿÿ÷ýüòö÷îçêáËÎÅ××ÑééãÈÇÃýüø÷öòûúöÿÿþþüûýüÿÿýÿÿûÿòíîîéèóíèÒËÂîèÝëåØÍǺÀ½¯Í̾ÚÚÎÓÕÉÝáÖñ÷ìãâÞÍÌÈÿÿüäãßÿÿüûúöýûúÿýü÷öÿòïøÿýÿÿþÿýø÷ÿÿûìäÝßÙÎÚÔÇ÷ñäÿüíóòäßßÑßáÕ×ÛÏÎÕÈçæâûúöñðìÿÿüþýùüúùÿÿþûùøýûÿÿûÿú÷ÿ÷ñöÿþÿÿüùÿýöÿþóý÷êëæ×ÌɺÐÐÀÕÕÇìñâíñåïöéýüøÿÿûÿÿüúùõúùõÿÿþÿþýþüû]

IN image_to_bmp(/home/stefan/autotest/temp/python26-zope212-cmf22-plone40/eggs/Products.PortalTransforms-2.0b3-py2.6.egg/Products/PortalTransforms/tests/input/logo.jpg)



Failure in test testSame (Products.PortalTransforms.tests.test_transforms.TransformTestSubclass)
Traceback (most recent call last):
  File "/usr/local/python2.6/lib/python2.6/unittest.py", line 279, in run
    testMethod()
  File "/home/stefan/autotest/temp/python26-zope212-cmf22-plone40/eggs/Products.PortalTransforms-2.0b3-py2.6.egg/Products/PortalTransforms/tests/test_transforms.py", line 68, in testSame
    self.do_convert(filename=self.input)
  File "/home/stefan/autotest/temp/python26-zope212-cmf22-plone40/eggs/Products.PortalTransforms-2.0b3-py2.6.egg/Products/PortalTransforms/tests/test_transforms.py", line 60, in do_convert
    got, expected, self.transform.name(), self.input))
  File "/usr/local/python2.6/lib/python2.6/unittest.py", line 350, in failUnlessEqual
    (msg or '%r != %r' % (first, second))
AssertionError: [ÿØÿà JFIF      ÿÛ C     $.' ",#(7),01444'9=82<.342ÿÛ C  2!!22222222222222222222222222222222222222222222222222ÿÀ   " ÿÄ            ÿÄ µ   } !1AQa"q2‘¡#B±ÁRÑð$3br‚ %&'()*456789:CDEFGHIJSTUVWXYZcdefghijstuvwxyzƒ„…†‡ˆ‰Š’“”•–—˜™š¢£¤¥¦§¨©ª²³´µ¶·¸¹ºÂÃÄÅÆÇÈÉÊÒÓÔÕÖ×ØÙÚáâãäåæçèéêñòóôõö÷øùúÿÄ         ÿÄ µ  w !1AQaq"2B‘¡±Á #3RðbrÑ $4á%ñ&'()*56789:CDEFGHIJSTUVWXYZcdefghijstuvwxyz‚ƒ„…†‡ˆ‰Š’“”•–—˜™š¢£¤¥¦§¨©ª²³´µ¶·¸¹ºÂÃÄÅÆÇÈÉÊÒÓÔÕÖ×ØÙÚâãäåæçèéêòóôõö÷øùúÿÚ    ? ÷ ¦šâw‚±T|Î?ϨÇý1UmbYåÆéÙ7ÇxÓ¹ïÍYÓ0¢elyŠÿ 1ü1ŸÌ5Dí»VÑJC2 Ø]qÁÏUäA=´ò¤æÚ|ÏÊÜò9#úþGêJ…ÑĶi!&p>nrq¸OÐ7äh¤ÊD÷Ò¤­qlØr>e=ùÀôÍS¶™’R–ñ/™ŒmÜ[hüp=;þ´QM+’ôeÛ{WIL³îß’ý?Ï­QRZ?ÿÙ]

!=

[ÿØÿà JFIF      ÿÛ C     $.' ",#(7),01444'9=82<.342ÿÛ C  2!!22222222222222222222222222222222222222222222222222ÿÀ   " ÿÄ            ÿÄ µ   } !1AQa"q2‘¡#B±ÁRÑð$3br‚ %&'()*456789:CDEFGHIJSTUVWXYZcdefghijstuvwxyzƒ„…†‡ˆ‰Š’“”•–—˜™š¢£¤¥¦§¨©ª²³´µ¶·¸¹ºÂÃÄÅÆÇÈÉÊÒÓÔÕÖ×ØÙÚáâãäåæçèéêñòóôõö÷øùúÿÄ         ÿÄ µ  w !1AQaq"2B‘¡±Á #3RðbrÑ $4á%ñ&'()*56789:CDEFGHIJSTUVWXYZcdefghijstuvwxyz‚ƒ„…†‡ˆ‰Š’“”•–—˜™š¢£¤¥¦§¨©ª²³´µ¶·¸¹ºÂÃÄÅÆÇÈÉÊÒÓÔÕÖ×ØÙÚâãäåæçèéêòóôõö÷øùúÿÚ    ? ÷ ¦šâw‚±T|Î?ϨÇý1UmbYåÆéÙ7ÇxÓ¹ïÍYÓ0¢elyŠÿ 1ü1ŸÌ5Dí»VÑJC2 Ø]qÁÏUäC'¶žTœÛO‚Ùù[žG$_ÈýIPº8–Í$$ÎÍÎN7Éúü™HžâÚT•®-›Ģ¡ÿ 8™ªvÓ2JRÞ%ó1»‹mŽ§ÖŠ)­Izmí]%2Ìw»~Kôÿ <~´QEIgÿÙ]

IN image_to_jpeg(/home/stefan/autotest/temp/python26-zope212-cmf22-plone40/eggs/Products.PortalTransforms-2.0b3-py2.6.egg/Products/PortalTransforms/tests/input/logo.gif)



Failure in test testSameNoFilename (Products.PortalTransforms.tests.test_transforms.TransformTestSubclass)
Traceback (most recent call last):
  File "/usr/local/python2.6/lib/python2.6/unittest.py", line 279, in run
    testMethod()
  File "/home/stefan/autotest/temp/python26-zope212-cmf22-plone40/eggs/Products.PortalTransforms-2.0b3-py2.6.egg/Products/PortalTransforms/tests/test_transforms.py", line 74, in testSameNoFilename
    self.do_convert()
  File "/home/stefan/autotest/temp/python26-zope212-cmf22-plone40/eggs/Products.PortalTransforms-2.0b3-py2.6.egg/Products/PortalTransforms/tests/test_transforms.py", line 60, in do_convert
    got, expected, self.transform.name(), self.input))
  File "/usr/local/python2.6/lib/python2.6/unittest.py", line 350, in failUnlessEqual
    (msg or '%r != %r' % (first, second))
AssertionError: [ÿØÿà JFIF      ÿÛ C     $.' ",#(7),01444'9=82<.342ÿÛ C  2!!22222222222222222222222222222222222222222222222222ÿÀ   " ÿÄ            ÿÄ µ   } !1AQa"q2‘¡#B±ÁRÑð$3br‚ %&'()*456789:CDEFGHIJSTUVWXYZcdefghijstuvwxyzƒ„…†‡ˆ‰Š’“”•–—˜™š¢£¤¥¦§¨©ª²³´µ¶·¸¹ºÂÃÄÅÆÇÈÉÊÒÓÔÕÖ×ØÙÚáâãäåæçèéêñòóôõö÷øùúÿÄ         ÿÄ µ  w !1AQaq"2B‘¡±Á #3RðbrÑ $4á%ñ&'()*56789:CDEFGHIJSTUVWXYZcdefghijstuvwxyz‚ƒ„…†‡ˆ‰Š’“”•–—˜™š¢£¤¥¦§¨©ª²³´µ¶·¸¹ºÂÃÄÅÆÇÈÉÊÒÓÔÕÖ×ØÙÚâãäåæçèéêòóôõö÷øùúÿÚ    ? ÷ ¦šâw‚±T|Î?ϨÇý1UmbYåÆéÙ7ÇxÓ¹ïÍYÓ0¢elyŠÿ 1ü1ŸÌ5Dí»VÑJC2 Ø]qÁÏUäA=´ò¤æÚ|ÏÊÜò9#úþGêJ…ÑĶi!&p>nrq¸OÐ7äh¤ÊD÷Ò¤­qlØr>e=ùÀôÍS¶™’R–ñ/™ŒmÜ[hüp=;þ´QM+’ôeÛ{WIL³îß’ý?Ï­QRZ?ÿÙ]

!=

[ÿØÿà JFIF      ÿÛ C     $.' ",#(7),01444'9=82<.342ÿÛ C  2!!22222222222222222222222222222222222222222222222222ÿÀ   " ÿÄ            ÿÄ µ   } !1AQa"q2‘¡#B±ÁRÑð$3br‚ %&'()*456789:CDEFGHIJSTUVWXYZcdefghijstuvwxyzƒ„…†‡ˆ‰Š’“”•–—˜™š¢£¤¥¦§¨©ª²³´µ¶·¸¹ºÂÃÄÅÆÇÈÉÊÒÓÔÕÖ×ØÙÚáâãäåæçèéêñòóôõö÷øùúÿÄ         ÿÄ µ  w !1AQaq"2B‘¡±Á #3RðbrÑ $4á%ñ&'()*56789:CDEFGHIJSTUVWXYZcdefghijstuvwxyz‚ƒ„…†‡ˆ‰Š’“”•–—˜™š¢£¤¥¦§¨©ª²³´µ¶·¸¹ºÂÃÄÅÆÇÈÉÊÒÓÔÕÖ×ØÙÚâãäåæçèéêòóôõö÷øùúÿÚ    ? ÷ ¦šâw‚±T|Î?ϨÇý1UmbYåÆéÙ7ÇxÓ¹ïÍYÓ0¢elyŠÿ 1ü1ŸÌ5Dí»VÑJC2 Ø]qÁÏUäC'¶žTœÛO‚Ùù[žG$_ÈýIPº8–Í$$ÎÍÎN7Éúü™HžâÚT•®-›Ģ¡ÿ 8™ªvÓ2JRÞ%ó1»‹mŽ§ÖŠ)­Izmí]%2Ìw»~Kôÿ <~´QEIgÿÙ]

IN image_to_jpeg(/home/stefan/autotest/temp/python26-zope212-cmf22-plone40/eggs/Products.PortalTransforms-2.0b3-py2.6.egg/Products/PortalTransforms/tests/input/logo.gif)

  Ran 517 tests with 4 failures and 0 errors in 35.921 seconds.
Running Products.PloneTestCase.layer.PloneSite tests:
  Tear down Products.Archetypes.tests.layer.ArchetypesSite in 0.069 seconds.
  Tear down Products.Archetypes.tests.layer.ZCML in 0.004 seconds.
  Tear down Products.CMFCore.testing.FunctionalZCMLLayer in 0.000 seconds.
  Set up Products.PloneTestCase.layer.ZCML in 2.374 seconds.
  Set up Products.PloneTestCase.layer.PloneSite in 3.692 seconds.
  Ran 9 tests with 0 failures and 0 errors in 1.072 seconds.
Running plone.app.kss.tests.kss_and_plone_layer.KSSAndPloneLayer tests:
  Set up plone.app.kss.tests.kss_and_plone_layer.KSSAndPloneLayer in 0.005 seconds.


Failure in test testVersionPreviewIsNotInlineEditable (archetypes.kss.tests.test_fields.FieldsViewTestCase)
Traceback (most recent call last):
  File "/usr/local/python2.6/lib/python2.6/unittest.py", line 279, in run
    testMethod()
  File "/home/stefan/autotest/temp/python26-zope212-cmf22-plone40/src/archetypes.kss/archetypes/kss/tests/test_fields.py", line 279, in testVersionPreviewIsNotInlineEditable
    self.fail("The version form doesn't contain the title anymore, see "
  File "/usr/local/python2.6/lib/python2.6/unittest.py", line 317, in fail
    raise self.failureException, msg
AssertionError: The version form doesn't contain the title anymore, see http://dev.plone.org/plone/ticket/10234.

  Ran 19 tests with 1 failures and 0 errors in 1.341 seconds.
Running zope.testing.testrunner.layer.UnitTests tests:
  Tear down plone.app.kss.tests.kss_and_plone_layer.KSSAndPloneLayer in 0.000 seconds.
  Tear down Products.PloneTestCase.layer.PloneSite in 0.345 seconds.
  Tear down Products.PloneTestCase.layer.ZCML in 0.005 seconds.
  Tear down Testing.ZopeTestCase.layer.ZopeLite in 0.000 seconds.
  Set up zope.testing.testrunner.layer.UnitTests in 0.000 seconds.
/home/stefan/autotest/temp/python26-zope212-cmf22-plone40/eggs/Products.Archetypes-1.6b3-py2.6.egg/Products/Archetypes/ClassGen.py:152: UserWarning: The method 'makeFoo' was already protected by a different permission than the one declared on the field. Assuming that the explicit permission declared is the correct one and has preference over the permission declared on the field.
  self.handle_mode(klass, generator, type, field, mode)
  Ran 28 tests with 0 failures and 0 errors in 0.181 seconds.
Tearing down left over layers:
  Tear down zope.testing.testrunner.layer.UnitTests in 0.000 seconds.
Total: 668 tests, 5 failures, 0 errors in 50.238 seconds.
Running Testing.ZopeTestCase.layer.ZopeLite tests:
  Set up Testing.ZopeTestCase.layer.ZopeLite in 0.090 seconds.
  Ran 283 tests with 0 failures and 0 errors in 1.303 seconds.
Running Products.CMFCalendar.testing.FunctionalLayer tests:
  Set up Products.CMFCore.testing.FunctionalZCMLLayer in 0.168 seconds.
  Set up Products.CMFCalendar.testing.FunctionalLayer in 0.325 seconds.
  Ran 24 tests with 0 failures and 0 errors in 1.524 seconds.
Running Products.CMFCore.testing.EventZCMLLayer tests:
  Tear down Products.CMFCalendar.testing.FunctionalLayer in 0.026 seconds.
  Tear down Products.CMFCore.testing.FunctionalZCMLLayer in 0.001 seconds.
  Set up Products.CMFCore.testing.EventZCMLLayer in 0.001 seconds.
  Ran 8 tests with 0 failures and 0 errors in 0.200 seconds.
Running Products.CMFCore.testing.ExportImportZCMLLayer tests:
  Tear down Products.CMFCore.testing.EventZCMLLayer in 0.000 seconds.
  Set up Products.CMFCore.testing.ExportImportZCMLLayer in 0.001 seconds.
  Ran 10 tests with 0 failures and 0 errors in 0.931 seconds.
Running Products.CMFCore.testing.TraversingEventZCMLLayer tests:
  Tear down Products.CMFCore.testing.ExportImportZCMLLayer in 0.000 seconds.
  Set up Products.CMFCore.testing.TraversingEventZCMLLayer in 0.001 seconds.
  Ran 5 tests with 0 failures and 0 errors in 0.159 seconds.
Running Products.CMFDefault.testing.FunctionalLayer tests:
  Tear down Products.CMFCore.testing.TraversingEventZCMLLayer in 0.000 seconds.
  Set up Products.CMFCore.testing.FunctionalZCMLLayer in 0.153 seconds.
  Set up Products.CMFDefault.testing.FunctionalLayer in 0.242 seconds.
  Ran 76 tests with 0 failures and 0 errors in 3.909 seconds.
Running Products.CMFUid.testing.UidEventZCMLLayer tests:
  Tear down Products.CMFDefault.testing.FunctionalLayer in 0.023 seconds.
  Tear down Products.CMFCore.testing.FunctionalZCMLLayer in 0.002 seconds.
  Set up Products.CMFUid.testing.UidEventZCMLLayer in 0.001 seconds.
  Ran 12 tests with 0 failures and 0 errors in 0.322 seconds.
Running Products.DCWorkflow.testing.ExportImportZCMLLayer tests:
  Tear down Products.CMFUid.testing.UidEventZCMLLayer in 0.000 seconds.
  Set up Products.DCWorkflow.testing.ExportImportZCMLLayer in 0.141 seconds.
  Ran 38 tests with 0 failures and 0 errors in 0.733 seconds.
Running Products.GenericSetup.testing.ExportImportZCMLLayer tests:
  Tear down Products.DCWorkflow.testing.ExportImportZCMLLayer in 0.000 seconds.
  Set up Products.GenericSetup.testing.ExportImportZCMLLayer in 0.082 seconds.
  Ran 186 tests with 0 failures and 0 errors in 0.586 seconds.
Running zope.testing.testrunner.layer.UnitTests tests:
  Tear down Products.GenericSetup.testing.ExportImportZCMLLayer in 0.000 seconds.
  Tear down Testing.ZopeTestCase.layer.ZopeLite in 0.000 seconds.
  Set up zope.testing.testrunner.layer.UnitTests in 0.000 seconds.
  Ran 346 tests with 0 failures and 0 errors in 0.258 seconds.
Tearing down left over layers:
  Tear down zope.testing.testrunner.layer.UnitTests in 0.000 seconds.
Total: 988 tests, 0 failures, 0 errors in 12.462 seconds.
Running Testing.ZopeTestCase.layer.ZopeLite tests:
  Set up Testing.ZopeTestCase.layer.ZopeLite in 0.914 seconds.
  Ran 27 tests with 0 failures and 0 errors in 0.056 seconds.
Running Products.PloneTestCase.layer.PloneSite tests:
  Set up Products.PloneTestCase.layer.ZCML in 2.482 seconds.
  Set up Products.PloneTestCase.layer.PloneSite in 4.800 seconds.
/home/stefan/autotest/temp/python26-zope212-cmf22-plone40/eggs/Zope2-2.12.3-py2.6-linux-x86_64.egg/OFS/subscribers.py:73: DeprecationWarning: Products.FAQ.FAQ.FAQ.manage_afterAdd is discouraged. You should use event subscribers instead.
  DeprecationWarning)
/home/stefan/autotest/temp/python26-zope212-cmf22-plone40/eggs/Zope2-2.12.3-py2.6-linux-x86_64.egg/OFS/subscribers.py:73: DeprecationWarning: Products.FAQ.FAQQuestion.FAQQuestion.manage_afterAdd is discouraged. You should use event subscribers instead.
  DeprecationWarning)
  Ran 145 tests with 0 failures and 0 errors in 23.777 seconds.
Running Products.CMFDiffTool.tests.BaseTestCase.CMFDiffToolLayer tests:
  Set up Products.CMFDiffTool.tests.BaseTestCase.CMFDiffToolLayer in 0.013 seconds.
  Ran 2 tests with 0 failures and 0 errors in 0.218 seconds.
Running Products.CMFTestCase.layer.CMFSite tests:
  Tear down Products.CMFDiffTool.tests.BaseTestCase.CMFDiffToolLayer in 0.360 seconds.
  Tear down Products.PloneTestCase.layer.PloneSite in 0.006 seconds.
  Tear down Products.PloneTestCase.layer.ZCML in 0.004 seconds.
  Set up Products.CMFTestCase.layer.ZCML in 1.776 seconds.
  Set up Products.CMFTestCase.layer.CMFSite in 1.337 seconds.
  Ran 20 tests with 0 failures and 0 errors in 0.394 seconds.
Running zope.testing.testrunner.layer.UnitTests tests:
  Tear down Products.CMFTestCase.layer.CMFSite in 0.065 seconds.
  Tear down Products.CMFTestCase.layer.ZCML in 0.003 seconds.
  Tear down Testing.ZopeTestCase.layer.ZopeLite in 0.000 seconds.
  Set up zope.testing.testrunner.layer.UnitTests in 0.000 seconds.
  Ran 10 tests with 0 failures and 0 errors in 0.005 seconds.
Tearing down left over layers:
  Tear down zope.testing.testrunner.layer.UnitTests in 0.000 seconds.
Total: 204 tests, 0 failures, 0 errors in 37.195 seconds.
Running Testing.ZopeTestCase.layer.ZopeLite tests:
  Set up Testing.ZopeTestCase.layer.ZopeLite in 0.559 seconds.
  Ran 126 tests with 0 failures and 0 errors in 0.755 seconds.
Running Products.CMFTestCase.layer.CMFSite tests:
  Set up Products.CMFTestCase.layer.ZCML in 2.335 seconds.
  Set up Products.CMFTestCase.layer.CMFSite in 0.231 seconds.
  Ran 58 tests with 0 failures and 0 errors in 2.014 seconds.
Running Products.PloneTestCase.layer.ZCML tests:
  Tear down Products.CMFTestCase.layer.CMFSite in 0.039 seconds.
  Tear down Products.CMFTestCase.layer.ZCML in 0.004 seconds.
  Set up Products.PloneTestCase.layer.ZCML in 1.759 seconds.
  Ran 12 tests with 0 failures and 0 errors in 0.016 seconds.
Running Products.PloneTestCase.layer.PloneSite tests:
  Set up Products.PloneTestCase.layer.PloneSite in 4.008 seconds.
/home/stefan/autotest/temp/python26-zope212-cmf22-plone40/eggs/Products.PortalTransforms-2.0b3-py2.6.egg/Products/PortalTransforms/libtransforms/commandtransform.py:97: DeprecationWarning: os.popen4 is deprecated.  Use the subprocess module.
  cin, couterr = os.popen4(command, 'b')
  Ran 1842 tests with 0 failures and 0 errors in 3 minutes 45.753 seconds.
Running plone.app.contentrules.tests.test_configuration.TestContentrulesGSLayer tests:
  Set up plone.app.contentrules.tests.test_configuration.TestContentrulesGSLayer in 0.002 seconds.
  Ran 6 tests with 0 failures and 0 errors in 2.403 seconds.
Running plone.app.customerize.tests.layer.PloneCustomerize tests:
  Tear down plone.app.contentrules.tests.test_configuration.TestContentrulesGSLayer in 0.000 seconds.
  Set up plone.app.customerize.tests.layer.PloneCustomerize in 0.000 seconds.
  Ran 27 tests with 0 failures and 0 errors in 2.640 seconds.
Running plone.app.kss.tests.kss_and_plone_layer.KSSAndPloneLayer tests:
  Tear down plone.app.customerize.tests.layer.PloneCustomerize in 0.000 seconds.
  Set up plone.app.kss.tests.kss_and_plone_layer.KSSAndPloneLayer in 0.004 seconds.
  Ran 13 tests with 0 failures and 0 errors in 1.150 seconds.
Running plone.app.upgrade.tests.base.FunctionalUpgradeLayer tests:
  Tear down plone.app.kss.tests.kss_and_plone_layer.KSSAndPloneLayer in 0.000 seconds.
  Set up plone.app.upgrade.tests.base.FunctionalUpgradeLayer in 0.000 seconds.
  Ran 11 tests with 0 failures and 0 errors in 56.236 seconds.
Running plone.app.viewletmanager.tests.test_exportimport.Layer tests:
  Tear down plone.app.upgrade.tests.base.FunctionalUpgradeLayer in 0.000 seconds.
  Tear down Products.PloneTestCase.layer.PloneSite in 0.377 seconds.
  Tear down Products.PloneTestCase.layer.ZCML in 0.015 seconds.
  Tear down Testing.ZopeTestCase.layer.ZopeLite in 0.000 seconds.
  Set up plone.app.viewletmanager.tests.test_exportimport.Layer in 0.000 seconds.
  Ran 16 tests with 0 failures and 0 errors in 0.050 seconds.
Running zope.testing.testrunner.layer.UnitTests tests:
  Tear down plone.app.viewletmanager.tests.test_exportimport.Layer in 0.000 seconds.
  Set up zope.testing.testrunner.layer.UnitTests in 0.000 seconds.
  Ran 144 tests with 0 failures and 0 errors in 0.854 seconds.
Tearing down left over layers:
  Tear down zope.testing.testrunner.layer.UnitTests in 0.000 seconds.
Total: 2255 tests, 0 failures, 0 errors in 5 minutes 4.832 seconds.
Running Testing.ZopeTestCase.layer.ZopeLite tests:
  Set up Testing.ZopeTestCase.layer.ZopeLite in 1.450 seconds.
  Ran 165 tests with 0 failures and 0 errors in 0.626 seconds.
Running Products.PloneTestCase.layer.ZCML tests:
  Set up Products.PloneTestCase.layer.ZCML in 2.364 seconds.
  Ran 34 tests with 0 failures and 0 errors in 0.210 seconds.
Running Products.PlonePAS.tests.layer.PlonePASLayer tests:
  Set up Products.PloneTestCase.layer.PloneSite in 3.640 seconds.
  Set up Products.PlonePAS.tests.layer.PlonePASLayer in 0.000 seconds.
  Ran 153 tests with 0 failures and 0 errors in 1.912 seconds.
Running zope.testing.testrunner.layer.UnitTests tests:
  Tear down Products.PlonePAS.tests.layer.PlonePASLayer in 0.000 seconds.
  Tear down Products.PloneTestCase.layer.PloneSite in 0.338 seconds.
  Tear down Products.PloneTestCase.layer.ZCML in 0.004 seconds.
  Tear down Testing.ZopeTestCase.layer.ZopeLite in 0.000 seconds.
  Set up zope.testing.testrunner.layer.UnitTests in 0.000 seconds.
  Ran 337 tests with 0 failures and 0 errors in 0.843 seconds.
Tearing down left over layers:
  Tear down zope.testing.testrunner.layer.UnitTests in 0.000 seconds.
Total: 689 tests, 0 failures, 0 errors in 12.165 seconds.
Running Products.PloneTestCase.layer.PloneSite tests:
  Set up Testing.ZopeTestCase.layer.ZopeLite in 1.385 seconds.
  Set up Products.PloneTestCase.layer.ZCML in 2.429 seconds.
  Set up Products.PloneTestCase.layer.PloneSite in 4.134 seconds.
/home/stefan/autotest/temp/python26-zope212-cmf22-plone40/eggs/borg.localrole-3.0a1-py2.6.egg/borg/localrole/bbb/bbb.txt:1: DeprecationWarning: IWorkspace is deprecated. Please use borg.localrole.interfaces.ILocalRoleProvider instead
  =========
/home/stefan/autotest/temp/python26-zope212-cmf22-plone40/eggs/borg.localrole-3.0a1-py2.6.egg/borg/localrole/bbb/bbb.txt:1: DeprecationWarning: IGroupAwareWorkspace is deprecated. Please use borg.localrole.interfaces.ILocalRoleProvider instead
  =========
  Ran 39 tests with 0 failures and 0 errors in 0.235 seconds.
Running plone.browserlayer.tests.test_doctest.PloneBrowserLayerLayer tests:
  Set up plone.browserlayer.tests.test_doctest.PloneBrowserLayerLayer in 0.003 seconds.
  Ran 9 tests with 0 failures and 0 errors in 0.735 seconds.
Running plone.theme.tests.test_doctest.PloneThemeLayer tests:
  Tear down plone.browserlayer.tests.test_doctest.PloneBrowserLayerLayer in 0.000 seconds.
  Set up plone.theme.tests.test_doctest.PloneThemeLayer in 0.003 seconds.
  Ran 5 tests with 0 failures and 0 errors in 0.052 seconds.
Running zope.testing.testrunner.layer.UnitTests tests:
  Tear down plone.theme.tests.test_doctest.PloneThemeLayer in 0.000 seconds.
  Tear down Products.PloneTestCase.layer.PloneSite in 0.330 seconds.
  Tear down Products.PloneTestCase.layer.ZCML in 0.004 seconds.
  Tear down Testing.ZopeTestCase.layer.ZopeLite in 0.000 seconds.
  Set up zope.testing.testrunner.layer.UnitTests in 0.000 seconds.
/usr/local/python2.6/lib/python2.6/mhlib.py:83: DeprecationWarning: the multifile module has been deprecated since Python 2.5
  import multifile
  Ran 252 tests with 0 failures and 0 errors in 0.809 seconds.
Tearing down left over layers:
  Tear down zope.testing.testrunner.layer.UnitTests in 0.000 seconds.
Total: 305 tests, 0 failures, 0 errors in 11.016 seconds.
Running Products.PloneTestCase.layer.PloneSite tests:
  Set up Testing.ZopeTestCase.layer.ZopeLite in 0.890 seconds.
  Set up Products.PloneTestCase.layer.ZCML in 2.398 seconds.
  Set up Products.PloneTestCase.layer.PloneSite in 3.935 seconds.
/usr/local/python2.6/lib/python2.6/unittest.py:279: DeprecationWarning: The use of 'hide' has been deprecated and will be removed in plone.portlet.static 2.0. Instead, use the new generic built-in show/hide setting of plone.portlets.
  testMethod()
  Ran 165 tests with 0 failures and 0 errors in 14.721 seconds.
Running plone.app.portlets.tests.test_configuration.TestPortletZCMLLayer tests:
  Set up plone.app.portlets.tests.test_configuration.TestPortletZCMLLayer in 0.006 seconds.
  Ran 5 tests with 0 failures and 0 errors in 0.039 seconds.
Running plone.app.portlets.tests.test_configuration.TestPortletGSLayer tests:
  Set up plone.app.portlets.tests.test_configuration.TestPortletGSLayer in 1.355 seconds.
  Ran 13 tests with 0 failures and 0 errors in 3.698 seconds.
Running zope.testing.testrunner.layer.UnitTests tests:
  Tear down plone.app.portlets.tests.test_configuration.TestPortletGSLayer in 0.000 seconds.
  Tear down plone.app.portlets.tests.test_configuration.TestPortletZCMLLayer in 0.000 seconds.
  Tear down Products.PloneTestCase.layer.PloneSite in 0.340 seconds.
  Tear down Products.PloneTestCase.layer.ZCML in 0.005 seconds.
  Tear down Testing.ZopeTestCase.layer.ZopeLite in 0.000 seconds.
  Set up zope.testing.testrunner.layer.UnitTests in 0.000 seconds.
  Ran 57 tests with 0 failures and 0 errors in 0.149 seconds.
Tearing down left over layers:
  Tear down zope.testing.testrunner.layer.UnitTests in 0.000 seconds.
Total: 240 tests, 0 failures, 0 errors in 28.380 seconds.
Running zope.testing.testrunner.layer.UnitTests tests:
  Set up zope.testing.testrunner.layer.UnitTests in 0.000 seconds.
  Ran 3 tests with 0 failures and 0 errors in 12.377 seconds.
Tearing down left over layers:
  Tear down zope.testing.testrunner.layer.UnitTests in 0.000 seconds.
Running Products.PloneTestCase.layer.PloneSite tests:
  Set up Testing.ZopeTestCase.layer.ZopeLite in 0.000 seconds.
  Set up Products.PloneTestCase.layer.ZCML in 1.901 seconds.
  Set up Products.PloneTestCase.layer.PloneSite in 4.570 seconds.
  Ran 23 tests with 0 failures and 0 errors in 2.749 seconds.
Running Products.CMFPlacefulWorkflow.tests.test_exportimport.ExportImportLayer tests:
  Set up Products.CMFPlacefulWorkflow.tests.test_exportimport.ExportImportLayer in 0.001 seconds.
  Ran 12 tests with 0 failures and 0 errors in 0.933 seconds.
Tearing down left over layers:
  Tear down Products.CMFPlacefulWorkflow.tests.test_exportimport.ExportImportLayer in 0.000 seconds.
  Tear down Products.PloneTestCase.layer.PloneSite in 0.344 seconds.
  Tear down Products.PloneTestCase.layer.ZCML in 0.004 seconds.
  Tear down Testing.ZopeTestCase.layer.ZopeLite in 0.000 seconds.
Total: 35 tests, 0 failures, 0 errors in 10.945 seconds.
Running Products.CMFTestCase.layer.CMFSite tests:
  Set up Testing.ZopeTestCase.layer.ZopeLite in 0.229 seconds.
  Set up Products.CMFTestCase.layer.ZCML in 0.367 seconds.
  Set up Products.CMFTestCase.layer.CMFSite in 0.216 seconds.
  Ran 58 tests with 0 failures and 0 errors in 0.228 seconds.
Tearing down left over layers:
  Tear down Products.CMFTestCase.layer.CMFSite in 0.025 seconds.
  Tear down Products.CMFTestCase.layer.ZCML in 0.001 seconds.
  Tear down Testing.ZopeTestCase.layer.ZopeLite in 0.000 seconds.
Running zope.testing.testrunner.layer.UnitTests tests:
  Set up zope.testing.testrunner.layer.UnitTests in 0.000 seconds.
  Ran 35 tests with 0 failures and 0 errors in 0.026 seconds.
Tearing down left over layers:
  Tear down zope.testing.testrunner.layer.UnitTests in 0.000 seconds.
Running Products.PloneTestCase.layer.PloneSite tests:
  Set up Testing.ZopeTestCase.layer.ZopeLite in 1.366 seconds.
  Set up Products.PloneTestCase.layer.ZCML in 2.459 seconds.
  Set up Products.PloneTestCase.layer.PloneSite in 3.876 seconds.
  Ran 38 tests with 0 failures and 0 errors in 4.006 seconds.
Tearing down left over layers:
  Tear down Products.PloneTestCase.layer.PloneSite in 0.345 seconds.
  Tear down Products.PloneTestCase.layer.ZCML in 0.006 seconds.
  Tear down Testing.ZopeTestCase.layer.ZopeLite in 0.000 seconds.
Running Products.PloneTestCase.layer.PloneSite tests:
  Set up Testing.ZopeTestCase.layer.ZopeLite in 1.442 seconds.
  Set up Products.PloneTestCase.layer.ZCML in 2.454 seconds.
  Set up Products.PloneTestCase.layer.PloneSite in 3.867 seconds.
/home/stefan/autotest/temp/python26-zope212-cmf22-plone40/eggs/Products.PlonePAS-4.0b4-py2.6.egg/Products/PlonePAS/tools/membership.py:555: DeprecationWarning: credentialsChanged should be called with 'REQUEST' as second argument. The BBB code will be removed in CMF 2.3.
  self.credentialsChanged(password, REQUEST=REQUEST)
  Ran 61 tests with 0 failures and 0 errors in 1.246 seconds.
Tearing down left over layers:
  Tear down Products.PloneTestCase.layer.PloneSite in 0.348 seconds.
  Tear down Products.PloneTestCase.layer.ZCML in 0.004 seconds.
  Tear down Testing.ZopeTestCase.layer.ZopeLite in 0.000 seconds.
Running Products.PloneTestCase.layer.PloneSite tests:
  Set up Testing.ZopeTestCase.layer.ZopeLite in 1.409 seconds.
  Set up Products.PloneTestCase.layer.ZCML in 2.468 seconds.
  Set up Products.PloneTestCase.layer.PloneSite in 4.006 seconds.
  Ran 245 tests with 0 failures and 0 errors in 17.448 seconds.
Running zope.testing.testrunner.layer.UnitTests tests:
  Tear down Products.PloneTestCase.layer.PloneSite in 0.361 seconds.
  Tear down Products.PloneTestCase.layer.ZCML in 0.005 seconds.
  Tear down Testing.ZopeTestCase.layer.ZopeLite in 0.000 seconds.
  Set up zope.testing.testrunner.layer.UnitTests in 0.000 seconds.
  Ran 59 tests with 0 failures and 0 errors in 0.012 seconds.
Tearing down left over layers:
  Tear down zope.testing.testrunner.layer.UnitTests in 0.000 seconds.
Total: 304 tests, 0 failures, 0 errors in 26.136 seconds.
Running Products.PloneTestCase.layer.PloneSite tests:
  Set up Testing.ZopeTestCase.layer.ZopeLite in 1.408 seconds.
  Set up Products.PloneTestCase.layer.ZCML in 2.435 seconds.
  Set up Products.PloneTestCase.layer.PloneSite in 3.891 seconds.
  Ran 78 tests with 0 failures and 0 errors in 2.970 seconds.
Tearing down left over layers:
  Tear down Products.PloneTestCase.layer.PloneSite in 0.347 seconds.
  Tear down Products.PloneTestCase.layer.ZCML in 0.006 seconds.
  Tear down Testing.ZopeTestCase.layer.ZopeLite in 0.000 seconds.
Running zope.testing.testrunner.layer.UnitTests tests:
  Set up zope.testing.testrunner.layer.UnitTests in 0.000 seconds.
  Ran 76 tests with 0 failures and 0 errors in 1.525 seconds.
Tearing down left over layers:
  Tear down zope.testing.testrunner.layer.UnitTests in 0.000 seconds.
Running Products.contentmigration.tests.layer.TestLayer tests:
  Set up Testing.ZopeTestCase.layer.ZopeLite in 1.455 seconds.
  Set up Products.PloneTestCase.layer.ZCML in 2.459 seconds.
  Set up Products.PloneTestCase.layer.PloneSite in 3.880 seconds.
  Set up Products.contentmigration.tests.layer.TestLayer in 0.002 seconds.
  Ran 18 tests with 0 failures and 0 errors in 4.907 seconds.
Tearing down left over layers:
  Tear down Products.contentmigration.tests.layer.TestLayer in 0.000 seconds.
  Tear down Products.PloneTestCase.layer.PloneSite in 0.347 seconds.
  Tear down Products.PloneTestCase.layer.ZCML in 0.004 seconds.
  Tear down Testing.ZopeTestCase.layer.ZopeLite in 0.000 seconds.
Total: 0 tests, 0 failures, 0 errors in 0.000 seconds.
Running archetypes.referencebrowserwidget.tests.base.layer tests:
  Set up Testing.ZopeTestCase.layer.ZopeLite in 0.000 seconds.
  Set up Products.PloneTestCase.layer.ZCML in 1.885 seconds.
  Set up Products.PloneTestCase.layer.PloneSite in 4.191 seconds.
  Set up archetypes.referencebrowserwidget.tests.base.layer in 0.000 seconds.
  Ran 43 tests with 0 failures and 0 errors in 7.750 seconds.
Running zope.testing.testrunner.layer.UnitTests tests:
  Tear down archetypes.referencebrowserwidget.tests.base.layer in 0.000 seconds.
  Tear down Products.PloneTestCase.layer.PloneSite in 0.355 seconds.
  Tear down Products.PloneTestCase.layer.ZCML in 0.007 seconds.
  Tear down Testing.ZopeTestCase.layer.ZopeLite in 0.000 seconds.
  Set up zope.testing.testrunner.layer.UnitTests in 0.000 seconds.
  Ran 4 tests with 0 failures and 0 errors in 0.001 seconds.
Tearing down left over layers:
  Tear down zope.testing.testrunner.layer.UnitTests in 0.000 seconds.
Total: 47 tests, 0 failures, 0 errors in 14.651 seconds.
Running archetypes.schemaextender.tests.testIntegration.layer tests:
  Set up Testing.ZopeTestCase.layer.ZopeLite in 1.338 seconds.
  Set up Products.PloneTestCase.layer.ZCML in 3.273 seconds.
  Set up Products.PloneTestCase.layer.PloneSite in 3.981 seconds.
  Set up archetypes.schemaextender.tests.testIntegration.layer in 0.000 seconds.
  Ran 17 tests with 0 failures and 0 errors in 3.005 seconds.
Running zope.testing.testrunner.layer.UnitTests tests:
  Tear down archetypes.schemaextender.tests.testIntegration.layer in 0.000 seconds.
  Tear down Products.PloneTestCase.layer.PloneSite in 0.344 seconds.
  Tear down Products.PloneTestCase.layer.ZCML in 0.007 seconds.
  Tear down Testing.ZopeTestCase.layer.ZopeLite in 0.000 seconds.
  Set up zope.testing.testrunner.layer.UnitTests in 0.000 seconds.
  Ran 19 tests with 0 failures and 0 errors in 0.006 seconds.
Tearing down left over layers:
  Tear down zope.testing.testrunner.layer.UnitTests in 0.000 seconds.
Total: 36 tests, 0 failures, 0 errors in 12.483 seconds.
Running zope.testing.testrunner.layer.UnitTests tests:
  Set up zope.testing.testrunner.layer.UnitTests in 0.000 seconds.
  Ran 4 tests with 0 failures and 0 errors in 0.040 seconds.
Tearing down left over layers:
  Tear down zope.testing.testrunner.layer.UnitTests in 0.000 seconds.
Running Testing.ZopeTestCase.layer.ZopeLite tests:
  Set up Testing.ZopeTestCase.layer.ZopeLite in 0.073 seconds.
  Ran 40 tests with 0 failures and 0 errors in 0.781 seconds.
Tearing down left over layers:
  Tear down Testing.ZopeTestCase.layer.ZopeLite in 0.000 seconds.
Running Testing.ZopeTestCase.layer.ZopeLite tests:
  Set up Testing.ZopeTestCase.layer.ZopeLite in 0.034 seconds.
  Ran 40 tests with 0 failures and 0 errors in 0.993 seconds.
Running zope.testing.testrunner.layer.UnitTests tests:
  Tear down Testing.ZopeTestCase.layer.ZopeLite in 0.000 seconds.
  Set up zope.testing.testrunner.layer.UnitTests in 0.000 seconds.
  Ran 1 tests with 0 failures and 0 errors in 0.101 seconds.
Tearing down left over layers:
  Tear down zope.testing.testrunner.layer.UnitTests in 0.000 seconds.
Total: 41 tests, 0 failures, 0 errors in 1.309 seconds.
/home/stefan/autotest/temp/python26-zope212-cmf22-plone40/src/kss.core/kss/core/tests/test_kssview_core.py:165: UserWarning: The test_class you are using doesn't subclass from ZopeTestCase.Functional. Please fix that.
  tearDown=KSSViewTestCase.beforeTearDown.im_func))
Running Testing.ZopeTestCase.layer.ZopeLite tests:
  Set up Testing.ZopeTestCase.layer.ZopeLite in 0.046 seconds.
  Ran 1 tests with 0 failures and 0 errors in 0.264 seconds.
Running kss.core.tests.base.KSSLayer tests:
  Tear down Testing.ZopeTestCase.layer.ZopeLite in 0.000 seconds.
  Set up kss.core.tests.base.KSSCoreLayer in 0.031 seconds.
  Set up kss.core.tests.base.KSSLayer in 0.057 seconds.
  Ran 29 tests with 0 failures and 0 errors in 0.155 seconds.
Running kss.core.tests.test_ttwapi.layer tests:
  Set up kss.core.tests.test_ttwapi.layer in 0.001 seconds.
  Ran 3 tests with 0 failures and 0 errors in 0.027 seconds.
Running zope.testing.testrunner.layer.UnitTests tests:
  Tear down kss.core.tests.test_ttwapi.layer in 0.000 seconds.
  Tear down kss.core.tests.base.KSSLayer in 0.000 seconds.
  Tear down kss.core.tests.base.KSSCoreLayer in 0.000 seconds.
  Set up zope.testing.testrunner.layer.UnitTests in 0.000 seconds.
/home/stefan/autotest/temp/python26-zope212-cmf22-plone40/src/kss.core/kss/core/siteview.txt:1: DeprecationWarning: ISite is deprecated. Moved to zope.location.interfaces. Importing from here will stop working in Zope 3.6
  =========
  Ran 14 tests with 0 failures and 0 errors in 0.009 seconds.
Tearing down left over layers:
  Tear down zope.testing.testrunner.layer.UnitTests in 0.000 seconds.
Total: 47 tests, 0 failures, 0 errors in 0.903 seconds.
***********************************************
WARNING: LinguaPlone not found. Skipping tests.
***********************************************
***********************************************
WARNING: LinguaPlone not found. Skipping tests.
***********************************************
Running plone.app.blob.tests.layer.BlobLayer tests:
  Set up Testing.ZopeTestCase.layer.ZopeLite in 0.930 seconds.
  Set up Products.PloneTestCase.layer.ZCML in 2.481 seconds.
  Set up Products.PloneTestCase.layer.PloneSite in 3.923 seconds.
  Set up plone.app.blob.tests.layer.BlobLayer in 0.096 seconds.
/home/stefan/autotest/temp/python26-zope212-cmf22-plone40/eggs/Products.PortalTransforms-2.0b3-py2.6.egg/Products/PortalTransforms/libtransforms/commandtransform.py:97: DeprecationWarning: os.popen4 is deprecated.  Use the subprocess module.
  cin, couterr = os.popen4(command, 'b')
  Ran 29 tests with 0 failures and 0 errors in 7.490 seconds.
Running plone.app.blob.tests.layer.BlobReplacementLayer tests:
  Set up plone.app.blob.tests.layer.BlobReplacementLayer in 0.195 seconds.
  Ran 45 tests with 0 failures and 0 errors in 12.153 seconds.
Running zope.testing.testrunner.layer.UnitTests tests:
  Tear down plone.app.blob.tests.layer.BlobReplacementLayer in 0.000 seconds.
  Tear down plone.app.blob.tests.layer.BlobLayer in 0.000 seconds.
  Tear down Products.PloneTestCase.layer.PloneSite in 0.339 seconds.
  Tear down Products.PloneTestCase.layer.ZCML in 0.009 seconds.
  Tear down Testing.ZopeTestCase.layer.ZopeLite in 0.000 seconds.
  Set up zope.testing.testrunner.layer.UnitTests in 0.000 seconds.
  Ran 2 tests with 0 failures and 0 errors in 0.001 seconds.
Tearing down left over layers:
  Tear down zope.testing.testrunner.layer.UnitTests in 0.000 seconds.
Total: 76 tests, 0 failures, 0 errors in 28.371 seconds.
Running Testing.ZopeTestCase.layer.ZopeLite tests:
  Set up Testing.ZopeTestCase.layer.ZopeLite in 0.936 seconds.
  Ran 2 tests with 0 failures and 0 errors in 0.008 seconds.
Running plone.app.folder.tests.layer.IntegrationLayer tests:
  Set up Products.PloneTestCase.layer.ZCML in 2.480 seconds.
  Set up Products.PloneTestCase.layer.PloneSite in 3.787 seconds.
  Set up plone.app.folder.tests.layer.IntegrationLayer in 0.091 seconds.
  Ran 22 tests with 0 failures and 0 errors in 5.107 seconds.
Running plone.app.folder.tests.layer.PartialOrderingIntegrationLayer tests:
  Set up plone.app.folder.tests.layer.PartialOrderingIntegrationLayer in 0.000 seconds.
  Ran 3 tests with 0 failures and 0 errors in 0.318 seconds.
Tearing down left over layers:
  Tear down plone.app.folder.tests.layer.PartialOrderingIntegrationLayer in 0.000 seconds.
  Tear down plone.app.folder.tests.layer.IntegrationLayer in 0.000 seconds.
  Tear down Products.PloneTestCase.layer.PloneSite in 0.346 seconds.
  Tear down Products.PloneTestCase.layer.ZCML in 0.004 seconds.
  Tear down Testing.ZopeTestCase.layer.ZopeLite in 0.000 seconds.
Total: 27 tests, 0 failures, 0 errors in 13.656 seconds.
Running plone.app.imaging.tests.layer.ImagingLayer tests:
  Set up Testing.ZopeTestCase.layer.ZopeLite in 0.920 seconds.
  Set up Products.PloneTestCase.layer.ZCML in 2.692 seconds.
  Set up Products.PloneTestCase.layer.PloneSite in 3.942 seconds.
  Set up plone.app.imaging.tests.layer.ImagingLayer in 0.096 seconds.
  Ran 37 tests with 0 failures and 0 errors in 4.135 seconds.
Running zope.testing.testrunner.layer.UnitTests tests:
  Tear down plone.app.imaging.tests.layer.ImagingLayer in 0.000 seconds.
  Tear down Products.PloneTestCase.layer.PloneSite in 0.377 seconds.
  Tear down Products.PloneTestCase.layer.ZCML in 0.005 seconds.
  Tear down Testing.ZopeTestCase.layer.ZopeLite in 0.000 seconds.
  Set up zope.testing.testrunner.layer.UnitTests in 0.000 seconds.
  Ran 7 tests with 0 failures and 0 errors in 0.001 seconds.
Tearing down left over layers:
  Tear down zope.testing.testrunner.layer.UnitTests in 0.000 seconds.
Total: 44 tests, 0 failures, 0 errors in 12.625 seconds.
Running Products.PloneTestCase.layer.PloneSite tests:
  Set up Testing.ZopeTestCase.layer.ZopeLite in 1.438 seconds.
  Set up Products.PloneTestCase.layer.ZCML in 2.505 seconds.
  Set up Products.PloneTestCase.layer.PloneSite in 3.876 seconds.
  Ran 9 tests with 0 failures and 0 errors in 0.129 seconds.
Tearing down left over layers:
  Tear down Products.PloneTestCase.layer.PloneSite in 0.341 seconds.
  Tear down Products.PloneTestCase.layer.ZCML in 0.004 seconds.
  Tear down Testing.ZopeTestCase.layer.ZopeLite in 0.000 seconds.
Running plone.app.linkintegrity.tests.layer.PloneLinkintegrity tests:
  Set up Testing.ZopeTestCase.layer.ZopeLite in 1.450 seconds.
  Set up Products.PloneTestCase.layer.ZCML in 2.474 seconds.
  Set up Products.PloneTestCase.layer.PloneSite in 3.890 seconds.
  Set up collective.testcaselayer.ptc.PTCLayer in 0.036 seconds.
  Set up plone.app.linkintegrity.tests.layer.PloneLinkintegrity in 0.558 seconds.
  Ran 117 tests with 0 failures and 0 errors in 28.913 seconds.
Running zope.testing.testrunner.layer.UnitTests tests:
  Tear down plone.app.linkintegrity.tests.layer.PloneLinkintegrity in 0.000 seconds.
  Tear down collective.testcaselayer.ptc.PTCLayer in 0.000 seconds.
  Tear down Products.PloneTestCase.layer.PloneSite in 0.347 seconds.
  Tear down Products.PloneTestCase.layer.ZCML in 0.006 seconds.
  Tear down Testing.ZopeTestCase.layer.ZopeLite in 0.000 seconds.
  Set up zope.testing.testrunner.layer.UnitTests in 0.000 seconds.
  Ran 1 tests with 0 failures and 0 errors in 0.001 seconds.
Tearing down left over layers:
  Tear down zope.testing.testrunner.layer.UnitTests in 0.000 seconds.
Total: 118 tests, 0 failures, 0 errors in 38.284 seconds.
Total: 0 tests, 0 failures, 0 errors in 0.000 seconds.
Running Products.PloneTestCase.layer.PloneSite tests:
  Set up Testing.ZopeTestCase.layer.ZopeLite in 1.443 seconds.
  Set up Products.PloneTestCase.layer.ZCML in 2.400 seconds.
  Set up Products.PloneTestCase.layer.PloneSite in 3.935 seconds.
  Ran 3 tests with 0 failures and 0 errors in 0.696 seconds.
Tearing down left over layers:
  Tear down Products.PloneTestCase.layer.PloneSite in 0.339 seconds.
  Tear down Products.PloneTestCase.layer.ZCML in 0.004 seconds.
  Tear down Testing.ZopeTestCase.layer.ZopeLite in 0.000 seconds.
Running Products.PloneTestCase.layer.PloneSite tests:
  Set up Testing.ZopeTestCase.layer.ZopeLite in 1.366 seconds.
  Set up Products.PloneTestCase.layer.ZCML in 2.508 seconds.
  Set up Products.PloneTestCase.layer.PloneSite in 3.900 seconds.
  Ran 38 tests with 0 failures and 0 errors in 8.064 seconds.
Tearing down left over layers:
  Tear down Products.PloneTestCase.layer.PloneSite in 0.349 seconds.
  Tear down Products.PloneTestCase.layer.ZCML in 0.006 seconds.
  Tear down Testing.ZopeTestCase.layer.ZopeLite in 0.000 seconds.
Running plone.folder.tests.layer.PloneFolderLayer tests:
  Set up plone.folder.tests.layer.PloneFolderLayer in 0.007 seconds.
  Ran 70 tests with 0 failures and 0 errors in 5.480 seconds.
Tearing down left over layers:
  Tear down plone.folder.tests.layer.PloneFolderLayer in 0.000 seconds.
Running Products.PloneTestCase.layer.PloneSite tests:
  Set up Testing.ZopeTestCase.layer.ZopeLite in 1.436 seconds.
  Set up Products.PloneTestCase.layer.ZCML in 2.471 seconds.
  Set up Products.PloneTestCase.layer.PloneSite in 4.199 seconds.
  Ran 41 tests with 0 failures and 0 errors in 0.374 seconds.
Tearing down left over layers:
  Tear down Products.PloneTestCase.layer.PloneSite in 0.343 seconds.
  Tear down Products.PloneTestCase.layer.ZCML in 0.004 seconds.
  Tear down Testing.ZopeTestCase.layer.ZopeLite in 0.000 seconds.
Total: 0 tests, 0 failures, 0 errors in 0.000 seconds.
Total: 0 tests, 0 failures, 0 errors in 0.000 seconds.
Running Products.PloneTestCase.layer.ZCML tests:
  Set up Testing.ZopeTestCase.layer.ZopeLite in 0.926 seconds.
  Set up Products.PloneTestCase.layer.ZCML in 2.523 seconds.
/home/stefan/autotest/temp/python26-zope212-cmf22-plone40/eggs/wicked-1.1.8alpha1-py2.6.egg/wicked/cache.py:34: DeprecationWarning: object.__init__() takes no parameters
  super(CacheStore, self).__init__(self)
  Ran 16 tests with 0 failures and 0 errors in 0.085 seconds.
Running wicked.at.tests.wickedtestcase.WickedSite tests:
  Set up Products.PloneTestCase.layer.PloneSite in 4.666 seconds.
  Set up wicked.at.tests.wickedtestcase.WickedSite in 0.002 seconds.
/home/stefan/autotest/temp/python26-zope212-cmf22-plone40/eggs/Zope2-2.12.3-py2.6-linux-x86_64.egg/OFS/subscribers.py:73: DeprecationWarning: wicked.atcontent.ironicwiki.IronicWiki.manage_afterAdd is discouraged. You should use event subscribers instead.
  DeprecationWarning)
/home/stefan/autotest/temp/python26-zope212-cmf22-plone40/eggs/Zope2-2.12.3-py2.6-linux-x86_64.egg/OFS/subscribers.py:73: DeprecationWarning: wicked.atcontent.ironicwiki.IronicWiki.manage_beforeDelete is discouraged. You should use event subscribers instead.
  DeprecationWarning)
/home/stefan/autotest/temp/python26-zope212-cmf22-plone40/eggs/Zope2-2.12.3-py2.6-linux-x86_64.egg/OFS/subscribers.py:73: DeprecationWarning: wicked.atcontent.ironicwiki.IronicWiki.manage_afterClone is discouraged. You should use event subscribers instead.
  DeprecationWarning)
  Ran 23 tests with 0 failures and 0 errors in 5.865 seconds.
Running wicked.at.tests.test_scope.Scoped tests:
  Set up wicked.at.tests.test_scope.Scoped in 0.000 seconds.
  Ran 3 tests with 0 failures and 0 errors in 0.634 seconds.
Running wicked.plone.tests.SelectiveATCT tests:
  Tear down wicked.at.tests.test_scope.Scoped in 0.000 seconds.
  Tear down wicked.at.tests.wickedtestcase.WickedSite in 0.002 seconds.
  Set up wicked.plone.tests.SelectiveATCT in 0.003 seconds.
  Ran 22 tests with 0 failures and 0 errors in 5.992 seconds.
Running wicked.plone.tests.ZCMLLayer tests:
  Tear down wicked.plone.tests.SelectiveATCT in 0.004 seconds.
  Set up wicked.plone.tests.ZCMLLayer in 0.020 seconds.
  Ran 8 tests with 0 failures and 0 errors in 0.746 seconds.
Running zope.testing.testrunner.layer.UnitTests tests:
  Tear down wicked.plone.tests.ZCMLLayer in 0.374 seconds.
  Tear down Products.PloneTestCase.layer.PloneSite in 0.001 seconds.
  Tear down Products.PloneTestCase.layer.ZCML in 0.004 seconds.
  Tear down Testing.ZopeTestCase.layer.ZopeLite in 0.000 seconds.
  Set up zope.testing.testrunner.layer.UnitTests in 0.000 seconds.
  Ran 34 tests with 0 failures and 0 errors in 0.016 seconds.
Tearing down left over layers:
  Tear down zope.testing.testrunner.layer.UnitTests in 0.000 seconds.
Total: 106 tests, 0 failures, 0 errors in 23.128 seconds.
#### Running tests for group ATCT ####
#### Finished tests for group ATCT ####

#### Running tests for group Archetypes ####
#### Finished tests for group Archetypes ####

#### Running tests for group CMF ####
#### Finished tests for group CMF ####

#### Running tests for group CMFEditions ####
#### Finished tests for group CMFEditions ####

#### Running tests for group Plone ####
#### Finished tests for group Plone ####

#### Running tests for group PlonePAS ####
#### Finished tests for group PlonePAS ####

#### Running tests for group plone ####
#### Finished tests for group plone ####

#### Running tests for group portlets ####
#### Finished tests for group portlets ####

#### Running tests for group z3c.autoinclude ####
#### Finished tests for group z3c.autoinclude ####

#### Running tests for Products.CMFPlacefulWorkflow ####
#### Finished tests for Products.CMFPlacefulWorkflow ####

#### Running tests for Products.CMFTestCase ####
#### Finished tests for Products.CMFTestCase ####

#### Running tests for Products.ExtendedPathIndex ####
#### Finished tests for Products.ExtendedPathIndex ####

#### Running tests for Products.PasswordResetTool ####
#### Finished tests for Products.PasswordResetTool ####

#### Running tests for Products.PloneTestCase ####
#### Finished tests for Products.PloneTestCase ####

#### Running tests for Products.ResourceRegistries ####
#### Finished tests for Products.ResourceRegistries ####

#### Running tests for Products.TinyMCE ####
#### Finished tests for Products.TinyMCE ####

#### Running tests for Products.ZopeVersionControl ####
#### Finished tests for Products.ZopeVersionControl ####

#### Running tests for Products.contentmigration ####
#### Finished tests for Products.contentmigration ####

#### Running tests for Products.i18ntestcase ####
#### Finished tests for Products.i18ntestcase ####

#### Running tests for archetypes.referencebrowserwidget ####
#### Finished tests for archetypes.referencebrowserwidget ####

#### Running tests for archetypes.schemaextender ####
#### Finished tests for archetypes.schemaextender ####

#### Running tests for collective.monkeypatcher ####
#### Finished tests for collective.monkeypatcher ####

#### Running tests for five.customerize ####
#### Finished tests for five.customerize ####

#### Running tests for five.formlib ####
#### Finished tests for five.formlib ####

#### Running tests for kss.core ####
#### Finished tests for kss.core ####

#### Running tests for plone.app.blob ####
#### Finished tests for plone.app.blob ####

#### Running tests for plone.app.folder ####
#### Finished tests for plone.app.folder ####

#### Running tests for plone.app.imaging ####
#### Finished tests for plone.app.imaging ####

#### Running tests for plone.app.jquerytools ####
#### Finished tests for plone.app.jquerytools ####

#### Running tests for plone.app.linkintegrity ####
#### Finished tests for plone.app.linkintegrity ####

#### Running tests for plone.app.locales ####
#### Finished tests for plone.app.locales ####

#### Running tests for plone.app.openid ####
#### Finished tests for plone.app.openid ####

#### Running tests for plone.app.users ####
#### Finished tests for plone.app.users ####

#### Running tests for plone.folder ####
#### Finished tests for plone.folder ####

#### Running tests for plone.stringinterp ####
#### Finished tests for plone.stringinterp ####

#### Running tests for plonetheme.classic ####
#### Finished tests for plonetheme.classic ####

#### Running tests for plonetheme.sunburst ####
#### Finished tests for plonetheme.sunburst ####

#### Running tests for wicked ####
#### Finished tests for wicked ####

Packages with test failures:

Failing tests in group Archetypes

Total time elapsed: 935.162 seconds

Grand total: 90 packages, 1 failures


FAILED (90 packages, 1 failures)




More information about the Testbot mailing list