[Testbot] FAILED (90 packages, 4 failures) : Plone-4.0 Zope-2.12 Python-2.6.4

Plone Tests plone-tests at epy.co.at
Sat Feb 20 02:42:46 UTC 2010


Plone Tests : FAILED (90 packages, 4 failures)
Plone-4.0 Zope-2.12 Python-2.6.4

Running ./bin/alltests -q --no-color --no-progress
Running Products.CMFTestCase.layer.CMFSite tests:
  Set up Testing.ZopeTestCase.layer.ZopeLite in 1.028 seconds.
  Set up Products.CMFTestCase.layer.ZCML in 2.953 seconds.
  Set up Products.CMFTestCase.layer.CMFSite in 1.468 seconds.
  Ran 31 tests with 0 failures and 0 errors in 0.560 seconds.
Running Products.PloneTestCase.layer.PloneSite tests:
  Tear down Products.CMFTestCase.layer.CMFSite in 0.064 seconds.
  Tear down Products.CMFTestCase.layer.ZCML in 0.004 seconds.
  Set up Products.PloneTestCase.layer.ZCML in 1.773 seconds.
  Set up Products.PloneTestCase.layer.PloneSite in 3.692 seconds.
  Ran 712 tests with 0 failures and 0 errors in 1 minutes 10.454 seconds.
Tearing down left over layers:
  Tear down Products.PloneTestCase.layer.PloneSite in 0.353 seconds.
  Tear down Products.PloneTestCase.layer.ZCML in 0.010 seconds.
  Tear down Testing.ZopeTestCase.layer.ZopeLite in 0.000 seconds.
Total: 743 tests, 0 failures, 0 errors in 1 minutes 22.870 seconds.
Running Testing.ZopeTestCase.layer.ZopeLite tests:
  Set up Testing.ZopeTestCase.layer.ZopeLite in 0.827 seconds.
  Ran 36 tests with 0 failures and 0 errors in 0.082 seconds.
Running Products.Archetypes.tests.layer.ZCML tests:
  Set up Products.CMFCore.testing.FunctionalZCMLLayer in 0.190 seconds.
  Set up Products.Archetypes.tests.layer.ZCML in 0.179 seconds.
  Ran 59 tests with 0 failures and 0 errors in 1.159 seconds.
Running Products.Archetypes.tests.layer.ArchetypesSite tests:
  Set up Products.Archetypes.tests.layer.ArchetypesSite in 1.403 seconds.
/home/stefan/autotest/temp/python26-zope212-cmf22-plone40/eggs/Zope2-2.12.3-py2.6-linux-x86_64.egg/OFS/subscribers.py:73: DeprecationWarning: Products.Archetypes.tests.test_classgen.Dummy.manage_afterAdd is discouraged. You should use event subscribers instead.
  DeprecationWarning)
/home/stefan/autotest/temp/python26-zope212-cmf22-plone40/eggs/Zope2-2.12.3-py2.6-linux-x86_64.egg/OFS/subscribers.py:73: DeprecationWarning: Products.Archetypes.tests.test_annotation.AnnDummy.manage_afterAdd is discouraged. You should use event subscribers instead.
  DeprecationWarning)
/home/stefan/autotest/temp/python26-zope212-cmf22-plone40/eggs/Zope2-2.12.3-py2.6-linux-x86_64.egg/OFS/subscribers.py:73: DeprecationWarning: Products.Archetypes.tests.test_event.Dummy.manage_afterAdd is discouraged. You should use event subscribers instead.
  DeprecationWarning)


Failure in test testSame (Products.PortalTransforms.tests.test_transforms.TransformTestSubclass)
Traceback (most recent call last):
  File "/usr/local/python2.6/lib/python2.6/unittest.py", line 279, in run
    testMethod()
  File "/home/stefan/autotest/temp/python26-zope212-cmf22-plone40/eggs/Products.PortalTransforms-2.0b3-py2.6.egg/Products/PortalTransforms/tests/test_transforms.py", line 68, in testSame
    self.do_convert(filename=self.input)
  File "/home/stefan/autotest/temp/python26-zope212-cmf22-plone40/eggs/Products.PortalTransforms-2.0b3-py2.6.egg/Products/PortalTransforms/tests/test_transforms.py", line 60, in do_convert
    got, expected, self.transform.name(), self.input))
  File "/usr/local/python2.6/lib/python2.6/unittest.py", line 350, in failUnlessEqual
    (msg or '%r != %r' % (first, second))
AssertionError: [BM®      6   (               x                ÿÿÿûùøþýùÿÿûÿÿøóñéóòèÿÿöòòæîîâÞÜÒØÕÍÖÒÍìèãøóðÿýùÿÿþíîìÿÿþÿÿþóôòÿÿþüýûüýûÿýüÿÿþÿüøòïêúøðÿÿù÷öìÕÔÊ×ÖÌåäÚôòêìêâëèãàÝØÖÓÏÆÂÁâàßÿÿþîïíúûùÿÿþòóñûüúþÿýüø÷ùöòÿÿûÿÿûöôìÐÎÆÏÎÄêéßæåÛÛÚÐÛÙÑÈƾØÕÐØÕÑñíìôòñåãâÉÊÈýþüÿÿþïðîÿÿþúûùõöôÿú÷ÿÿüúöñáÝØàÝÕñïåèçÝÌËÁõôêíìâÿýõÿÿ÷ÿÿûéæâÛ×ÖËÉÈÍËÊïðîÏÐÎãäâÿÿþóôòüýûüýûÿÿüöñîðìçîëãÝÚÒÎÌÂãâØÿÿøçæÜÞÝÓåãÛñïçÿÿüÿþúÿÿþÿÿþòóñÉÊÈßàÞÚÛÙ×ØÖüýûÿÿþÿÿþÿÿüùôñáÝØÑÎÆßÜÔüúðÿÿöööêèçÝëêàßÝÕÜÚÒÝÜØø÷óÿÿþÿÿÿóôòùúøÓÔÒÑÒÐäåãæçåúûùÿÿþÿýøíéäÝÙÔáÞÖïìä÷õíúøðùúñÐÑÈíîåéçßãàÛÛØÓÿÿûÿÿüú÷óÿÿüòóïëìèßàÜÛÜØéêæóôðûüøÿüó×ÒÉîëãÑÎÆÿýøÿÿüüýùøù÷ÞßÝàáÝàßÛíêåÕÓËÿÿøöñèÿÿõþüôÿÿùÿÿùÄżëìãÊËÂÿÿûÿÿùùóèÜØÍêåÜÝÛÓÿýøÿÿûÿÿþøúú¼¾¾ßàÞåäàÙÙÓÜÙÑþüòÿüñÿÿ÷ÿÿ÷ÿÿøö÷í÷øîâãÙàá×âãÚýþõéãÖåáÖâÝÔðîæÿþùýüøÿÿþüýûÿÿþö÷õâáÝììæÿÿùçåÛ×ÐÇÓÎÅÞÝÓüýóÿÿøÿÿøÂúòóêÜÝÔüýôÜÖÉíêÜØÖËÿÿöÿÿøúúôÿÿüýþüýþüòóñîíéÿÿüÿÿûÏÌÄâÜÕïéâÛÚÐàá×ÿÿøôõëÅƽñòéáâÙúûò×ÔÅïìÞÔÒÇÿÿøÿÿøùùóÿÿüÿÿûÿÿþÿÿþÿÿþÿÿûÑÌÉÒÎÉùóîãßÚýûóÉÊÀ÷øïýþõåæÝèéàÏÏÉýý÷ÝÚËêéÛÓÒÄÿÿöÿÿ÷ûùñÿÿûÿþúÿýüòðïõñðÿþýäßÜïêçüõòÜ×ÔäâÚØÙÏÿÿ÷ÿÿù×ØÏæçÞÈÈÂÿÿûæå×åäÖÔÓÅøøìÿÿöüúòÿÿûÿýøÿÿüøõñÿÿþÿÿþüø÷ÔÐÏËÆÅÛÖÕÐÍÈö÷îÿÿùúûòÃýêêäÕÕÏÿÿûîìááàÒÕÕÉððäÿÿöýüòÿþöÿü÷æãßÖÓÏØÔÓ¸´³ÿÿþÿÿþðêëû÷öÿÿûÿÿùûüóæçÞÛÛÕîîèÚÚÔýý÷ÿÿøÌÌÀüûñ¾½³ýüòúùïÿÿùÿþöÎÊÅùõðâßÛìéåÉÅÄÿÿþÿúûþúùÿÿüööðÿÿûËËÅîîèÍÍÇÿÿüúùõðîæòðèáß×åãÛø÷íÿÿöîëãõòêàÝÕîêåÛ×ÒñîêÜÙÕÿþýöòñÿûúÿÿüèèâÿÿûÆÆÀììæààÚýüøÿÿûÿÿüÿÿûÍÊÅòïêÊÇ¿æãÛÿÿøúõìËƽñîæòïçåáÜÓÐËÿüøÿÿüÿÿüøøòüüöÇÇÁééãÞÝÙòñíÿÿûÿÿüøööÿÿÿóïîÇÄÀÿÿûÄÁ¹úõìñìãøóêÍÈ¿º¸®ÛØÐýûóÿÿûþþøÿÿûööðÍÍÇççáÔÔÎõôðÿþú÷öòÿÿüþýÿþýÿæãåÿþÿÆÁ¾îêåäÞ×äÝÔêäÙÿÿöÿÿ÷ÿÿøýüòö÷îéêáËÍÇ××ÑéèäÈÇÃýüø÷öòûúöÿÿþþüûÿüÿÿýÿÿûÿðíïîéèñíèÒÊÃîèÝëåÚËȺÀ½¯ÌÌÀÚÚÎÓÔÊÝáÖóöíããÝÍÌÈÿÿüäãßÿÿüûúöýûúÿýü÷öÿòïøÿýÿÿýÿý÷øÿÿüìäÝßÙÎÚÔÉõòäÿüîòòäßßÑßáÕ×ÛÏÐÔÉççáûúöñðìÿÿüþýùüû÷ÿÿþûùøýüÿýüÿü÷ÿõñöÿþÿÿüùÿýöÿþóý÷ìéæØÌɺÏÐÀÕÕÇìñâíñåïõêýý÷ÿÿûÿÿüúùõúùõÿÿüÿþýþüû]

!=

[BM®      6   (               x                ÿÿþûùøÿüûÿÿüÿÿúóñéóòèÿÿöòòæîíãÞÜÒØÕÍÖÓËìèãøóðÿüùÿÿþíîìÿÿþÿÿþóôòÿÿþüýûüýûÿýüÿÿþÿüøòïêúøðÿÿù÷öìÕÔÊ×ÖÌåäÚôóéìêâëèãáÜÙ×ÒÏÇ¿àáßÿÿþîïíúûùÿÿþòóñûüúþÿýüø÷ùöòÿÿüÿÿûöôìÐÏÅÏÎÄêéßæåÛÛÚÐÛÙÑÈƾØÕÐØÕÑñíìöòñãäâÉÊÈýþüÿÿþïðîÿÿþúûùõöôÿú÷ÿÿüúöñáÝØàÝÕðïåèçÝÌÌÀõôêíìâÿýõÿþùÿÿûéæâÛ×ÖÍÉÈËÌÊïðîÏÐÎãäâÿÿþóôòüýûüýûÿÿüöñîðìçîëãÝÚÒÎÌÂãâØÿÿ÷çæÜÞÝÓåãÛñîéÿÿüÿýüÿÿþÿÿÿòóñÉÊÈßàÞÚÛÙ×ØÖüýûÿÿþÿÿþÿÿüùõðáÝØÑÎÆßÜÔüúðÿÿ÷ööêèçÝëêàßÝÕÜÙÔÝÜØøöõÿÿþÿÿÿóôòùúøÓÔÒÑÒÐäåãæçåúûùÿÿþÿüùíéäÝÙÔáÞÖïíãøöìûùïûûïÒÑÇïîäéçßãàÛÙØÔÿÿþÿÿþøööÿÿþòóñëìêßàÞÛÜÚéêèóôòûüúÿýòÙÓÈðëâÑÎÆÿýùÿÿþüýûöøøÜÞÞàáßÞßÛíêåÖÓËÿÿ÷øòçÿÿòüýóÿÿøÿÿøÄÅ»ëìâÊËÁÿÿùÿÿ÷ùóèÞØÍêåÜÞÛÓÿýøÿÿûÿÿþøúú¼¾¾ßàÞåäàÛØÓÜÙÑÿûòÿüñÿÿ÷ÿÿ÷ÿÿøö÷í÷øîâãÙàá×âãÚýþõéãÖçáÖâÞÓñîæÿþùýüøÿÿþúýûýÿÿö÷õâàßîëçÿÿûéãÜ×ÐÇÕÏÄÜÝÓüýóÿÿøÿÿøÂùòóêÜÝÔüýôÜÖÉíêÜÚÖËÿÿöÿÿøúúôÿÿüýþüýþüòóñîìëÿÿüÿÿûÑËÆâÜÕñéâÙÚÐàá×ÿÿøôõëÅƽñòéáâÙúûò×ÔÅïìÞÔÓÅÿÿ÷ÿÿøùùóÿÿüþÿûÿÿþÿÿþÿÿþÿþýÑÌÉÒÍÊùóîåßÚûüòÉÊÀ÷øîýþõåæÝèéàÏÐÇýý÷ÝÚËìéÚÓÒÄÿÿöÿÿ÷ùúñÿÿûÿþúÿþúòðïóñðÿþýäßÞïêçüõòÞ×ÔâãÙØÙÏÿÿ÷ÿÿù×ØÏæçÞÈÈÂÿÿûææÖåäÖÔÓÅøøìÿÿöüûñÿÿùþþøÿÿüöõñÿÿþÿÿþüø÷ÕÐÏËÆÅÛÖÕÎÏÆö÷îÿÿùúûòÃÄ»êêäÕÕÏÿÿûîíßáàÒÕÕÇððäÿÿõýüòÿþöÿü÷æãÞÖÓÏØÕѸ´³ÿÿþÿÿþðêëüö÷ÿÿùÿÿùûüóæçÞÛÛÕîîèÚÚÔýý÷ÿÿ÷ÌÌÀüüð¾¾²ýüòúùïÿÿùÿþöÎÊÅùõðâßÛìéåÉÅÄÿÿþÿúûþùúÿÿùö÷îÿÿûËËÅîîèÍÍÇÿÿûúùõîïæðñèáàÖåäÚø÷íÿÿöîìâõòêàÝÕîëãÛ×ÒñîêÜÙÕÿþýôòñýûúÿÿûèèâÿÿûÆÆÀììæààÚýüøÿÿûÿÿüÿÿúËËÅòïêÊÇ¿æãÛÿÿøúõìËƽóîåòïçåáÜÓÐËýüøÿÿüÿÿþøøòüüöÇÇÁééãÞÞØòñíÿÿûÿÿüöööÿÿþñïîÇÄÀÿÿûÄÁ¹úõìñìãøôéÍÈ¿º¸®ÛØÐýûóÿÿûþþøÿÿüööðÍÍÇççáÔÓÏõôðÿþú÷öòÿÿþþýÿþýÿæääÿÿþÆÁ¾ðêåäßÖäÞÓêäÙÿÿöÿÿ÷ÿÿ÷ýüòö÷îçêáËÎÅ××ÑééãÈÇÃýüø÷öòûúöÿÿþþüûýüÿÿýÿÿûÿòíîîéèóíèÒËÂîèÝëåØÍǺÀ½¯Í̾ÚÚÎÓÕÉÝáÖñ÷ìãâÞÍÌÈÿÿüäãßÿÿüûúöýûúÿýü÷öÿòïøÿýÿÿþÿýø÷ÿÿûìäÝßÙÎÚÔÇ÷ñäÿüíóòäßßÑßáÕ×ÛÏÎÕÈçæâûúöñðìÿÿüþýùüúùÿÿþûùøýûÿÿûÿú÷ÿ÷ñöÿþÿÿüùÿýöÿþóý÷êëæ×ÌɺÐÐÀÕÕÇìñâíñåïöéýüøÿÿûÿÿüúùõúùõÿÿþÿþýþüû]

IN image_to_bmp(/home/stefan/autotest/temp/python26-zope212-cmf22-plone40/eggs/Products.PortalTransforms-2.0b3-py2.6.egg/Products/PortalTransforms/tests/input/logo.jpg)



Failure in test testSameNoFilename (Products.PortalTransforms.tests.test_transforms.TransformTestSubclass)
Traceback (most recent call last):
  File "/usr/local/python2.6/lib/python2.6/unittest.py", line 279, in run
    testMethod()
  File "/home/stefan/autotest/temp/python26-zope212-cmf22-plone40/eggs/Products.PortalTransforms-2.0b3-py2.6.egg/Products/PortalTransforms/tests/test_transforms.py", line 74, in testSameNoFilename
    self.do_convert()
  File "/home/stefan/autotest/temp/python26-zope212-cmf22-plone40/eggs/Products.PortalTransforms-2.0b3-py2.6.egg/Products/PortalTransforms/tests/test_transforms.py", line 60, in do_convert
    got, expected, self.transform.name(), self.input))
  File "/usr/local/python2.6/lib/python2.6/unittest.py", line 350, in failUnlessEqual
    (msg or '%r != %r' % (first, second))
AssertionError: [BM®      6   (               x                ÿÿÿûùøþýùÿÿûÿÿøóñéóòèÿÿöòòæîîâÞÜÒØÕÍÖÒÍìèãøóðÿýùÿÿþíîìÿÿþÿÿþóôòÿÿþüýûüýûÿýüÿÿþÿüøòïêúøðÿÿù÷öìÕÔÊ×ÖÌåäÚôòêìêâëèãàÝØÖÓÏÆÂÁâàßÿÿþîïíúûùÿÿþòóñûüúþÿýüø÷ùöòÿÿûÿÿûöôìÐÎÆÏÎÄêéßæåÛÛÚÐÛÙÑÈƾØÕÐØÕÑñíìôòñåãâÉÊÈýþüÿÿþïðîÿÿþúûùõöôÿú÷ÿÿüúöñáÝØàÝÕñïåèçÝÌËÁõôêíìâÿýõÿÿ÷ÿÿûéæâÛ×ÖËÉÈÍËÊïðîÏÐÎãäâÿÿþóôòüýûüýûÿÿüöñîðìçîëãÝÚÒÎÌÂãâØÿÿøçæÜÞÝÓåãÛñïçÿÿüÿþúÿÿþÿÿþòóñÉÊÈßàÞÚÛÙ×ØÖüýûÿÿþÿÿþÿÿüùôñáÝØÑÎÆßÜÔüúðÿÿöööêèçÝëêàßÝÕÜÚÒÝÜØø÷óÿÿþÿÿÿóôòùúøÓÔÒÑÒÐäåãæçåúûùÿÿþÿýøíéäÝÙÔáÞÖïìä÷õíúøðùúñÐÑÈíîåéçßãàÛÛØÓÿÿûÿÿüú÷óÿÿüòóïëìèßàÜÛÜØéêæóôðûüøÿüó×ÒÉîëãÑÎÆÿýøÿÿüüýùøù÷ÞßÝàáÝàßÛíêåÕÓËÿÿøöñèÿÿõþüôÿÿùÿÿùÄżëìãÊËÂÿÿûÿÿùùóèÜØÍêåÜÝÛÓÿýøÿÿûÿÿþøúú¼¾¾ßàÞåäàÙÙÓÜÙÑþüòÿüñÿÿ÷ÿÿ÷ÿÿøö÷í÷øîâãÙàá×âãÚýþõéãÖåáÖâÝÔðîæÿþùýüøÿÿþüýûÿÿþö÷õâáÝììæÿÿùçåÛ×ÐÇÓÎÅÞÝÓüýóÿÿøÿÿøÂúòóêÜÝÔüýôÜÖÉíêÜØÖËÿÿöÿÿøúúôÿÿüýþüýþüòóñîíéÿÿüÿÿûÏÌÄâÜÕïéâÛÚÐàá×ÿÿøôõëÅƽñòéáâÙúûò×ÔÅïìÞÔÒÇÿÿøÿÿøùùóÿÿüÿÿûÿÿþÿÿþÿÿþÿÿûÑÌÉÒÎÉùóîãßÚýûóÉÊÀ÷øïýþõåæÝèéàÏÏÉýý÷ÝÚËêéÛÓÒÄÿÿöÿÿ÷ûùñÿÿûÿþúÿýüòðïõñðÿþýäßÜïêçüõòÜ×ÔäâÚØÙÏÿÿ÷ÿÿù×ØÏæçÞÈÈÂÿÿûæå×åäÖÔÓÅøøìÿÿöüúòÿÿûÿýøÿÿüøõñÿÿþÿÿþüø÷ÔÐÏËÆÅÛÖÕÐÍÈö÷îÿÿùúûòÃýêêäÕÕÏÿÿûîìááàÒÕÕÉððäÿÿöýüòÿþöÿü÷æãßÖÓÏØÔÓ¸´³ÿÿþÿÿþðêëû÷öÿÿûÿÿùûüóæçÞÛÛÕîîèÚÚÔýý÷ÿÿøÌÌÀüûñ¾½³ýüòúùïÿÿùÿþöÎÊÅùõðâßÛìéåÉÅÄÿÿþÿúûþúùÿÿüööðÿÿûËËÅîîèÍÍÇÿÿüúùõðîæòðèáß×åãÛø÷íÿÿöîëãõòêàÝÕîêåÛ×ÒñîêÜÙÕÿþýöòñÿûúÿÿüèèâÿÿûÆÆÀììæààÚýüøÿÿûÿÿüÿÿûÍÊÅòïêÊÇ¿æãÛÿÿøúõìËƽñîæòïçåáÜÓÐËÿüøÿÿüÿÿüøøòüüöÇÇÁééãÞÝÙòñíÿÿûÿÿüøööÿÿÿóïîÇÄÀÿÿûÄÁ¹úõìñìãøóêÍÈ¿º¸®ÛØÐýûóÿÿûþþøÿÿûööðÍÍÇççáÔÔÎõôðÿþú÷öòÿÿüþýÿþýÿæãåÿþÿÆÁ¾îêåäÞ×äÝÔêäÙÿÿöÿÿ÷ÿÿøýüòö÷îéêáËÍÇ××ÑéèäÈÇÃýüø÷öòûúöÿÿþþüûÿüÿÿýÿÿûÿðíïîéèñíèÒÊÃîèÝëåÚËȺÀ½¯ÌÌÀÚÚÎÓÔÊÝáÖóöíããÝÍÌÈÿÿüäãßÿÿüûúöýûúÿýü÷öÿòïøÿýÿÿýÿý÷øÿÿüìäÝßÙÎÚÔÉõòäÿüîòòäßßÑßáÕ×ÛÏÐÔÉççáûúöñðìÿÿüþýùüû÷ÿÿþûùøýüÿýüÿü÷ÿõñöÿþÿÿüùÿýöÿþóý÷ìéæØÌɺÏÐÀÕÕÇìñâíñåïõêýý÷ÿÿûÿÿüúùõúùõÿÿüÿþýþüû]

!=

[BM®      6   (               x                ÿÿþûùøÿüûÿÿüÿÿúóñéóòèÿÿöòòæîíãÞÜÒØÕÍÖÓËìèãøóðÿüùÿÿþíîìÿÿþÿÿþóôòÿÿþüýûüýûÿýüÿÿþÿüøòïêúøðÿÿù÷öìÕÔÊ×ÖÌåäÚôóéìêâëèãáÜÙ×ÒÏÇ¿àáßÿÿþîïíúûùÿÿþòóñûüúþÿýüø÷ùöòÿÿüÿÿûöôìÐÏÅÏÎÄêéßæåÛÛÚÐÛÙÑÈƾØÕÐØÕÑñíìöòñãäâÉÊÈýþüÿÿþïðîÿÿþúûùõöôÿú÷ÿÿüúöñáÝØàÝÕðïåèçÝÌÌÀõôêíìâÿýõÿþùÿÿûéæâÛ×ÖÍÉÈËÌÊïðîÏÐÎãäâÿÿþóôòüýûüýûÿÿüöñîðìçîëãÝÚÒÎÌÂãâØÿÿ÷çæÜÞÝÓåãÛñîéÿÿüÿýüÿÿþÿÿÿòóñÉÊÈßàÞÚÛÙ×ØÖüýûÿÿþÿÿþÿÿüùõðáÝØÑÎÆßÜÔüúðÿÿ÷ööêèçÝëêàßÝÕÜÙÔÝÜØøöõÿÿþÿÿÿóôòùúøÓÔÒÑÒÐäåãæçåúûùÿÿþÿüùíéäÝÙÔáÞÖïíãøöìûùïûûïÒÑÇïîäéçßãàÛÙØÔÿÿþÿÿþøööÿÿþòóñëìêßàÞÛÜÚéêèóôòûüúÿýòÙÓÈðëâÑÎÆÿýùÿÿþüýûöøøÜÞÞàáßÞßÛíêåÖÓËÿÿ÷øòçÿÿòüýóÿÿøÿÿøÄÅ»ëìâÊËÁÿÿùÿÿ÷ùóèÞØÍêåÜÞÛÓÿýøÿÿûÿÿþøúú¼¾¾ßàÞåäàÛØÓÜÙÑÿûòÿüñÿÿ÷ÿÿ÷ÿÿøö÷í÷øîâãÙàá×âãÚýþõéãÖçáÖâÞÓñîæÿþùýüøÿÿþúýûýÿÿö÷õâàßîëçÿÿûéãÜ×ÐÇÕÏÄÜÝÓüýóÿÿøÿÿøÂùòóêÜÝÔüýôÜÖÉíêÜÚÖËÿÿöÿÿøúúôÿÿüýþüýþüòóñîìëÿÿüÿÿûÑËÆâÜÕñéâÙÚÐàá×ÿÿøôõëÅƽñòéáâÙúûò×ÔÅïìÞÔÓÅÿÿ÷ÿÿøùùóÿÿüþÿûÿÿþÿÿþÿÿþÿþýÑÌÉÒÍÊùóîåßÚûüòÉÊÀ÷øîýþõåæÝèéàÏÐÇýý÷ÝÚËìéÚÓÒÄÿÿöÿÿ÷ùúñÿÿûÿþúÿþúòðïóñðÿþýäßÞïêçüõòÞ×ÔâãÙØÙÏÿÿ÷ÿÿù×ØÏæçÞÈÈÂÿÿûææÖåäÖÔÓÅøøìÿÿöüûñÿÿùþþøÿÿüöõñÿÿþÿÿþüø÷ÕÐÏËÆÅÛÖÕÎÏÆö÷îÿÿùúûòÃÄ»êêäÕÕÏÿÿûîíßáàÒÕÕÇððäÿÿõýüòÿþöÿü÷æãÞÖÓÏØÕѸ´³ÿÿþÿÿþðêëüö÷ÿÿùÿÿùûüóæçÞÛÛÕîîèÚÚÔýý÷ÿÿ÷ÌÌÀüüð¾¾²ýüòúùïÿÿùÿþöÎÊÅùõðâßÛìéåÉÅÄÿÿþÿúûþùúÿÿùö÷îÿÿûËËÅîîèÍÍÇÿÿûúùõîïæðñèáàÖåäÚø÷íÿÿöîìâõòêàÝÕîëãÛ×ÒñîêÜÙÕÿþýôòñýûúÿÿûèèâÿÿûÆÆÀììæààÚýüøÿÿûÿÿüÿÿúËËÅòïêÊÇ¿æãÛÿÿøúõìËƽóîåòïçåáÜÓÐËýüøÿÿüÿÿþøøòüüöÇÇÁééãÞÞØòñíÿÿûÿÿüöööÿÿþñïîÇÄÀÿÿûÄÁ¹úõìñìãøôéÍÈ¿º¸®ÛØÐýûóÿÿûþþøÿÿüööðÍÍÇççáÔÓÏõôðÿþú÷öòÿÿþþýÿþýÿæääÿÿþÆÁ¾ðêåäßÖäÞÓêäÙÿÿöÿÿ÷ÿÿ÷ýüòö÷îçêáËÎÅ××ÑééãÈÇÃýüø÷öòûúöÿÿþþüûýüÿÿýÿÿûÿòíîîéèóíèÒËÂîèÝëåØÍǺÀ½¯Í̾ÚÚÎÓÕÉÝáÖñ÷ìãâÞÍÌÈÿÿüäãßÿÿüûúöýûúÿýü÷öÿòïøÿýÿÿþÿýø÷ÿÿûìäÝßÙÎÚÔÇ÷ñäÿüíóòäßßÑßáÕ×ÛÏÎÕÈçæâûúöñðìÿÿüþýùüúùÿÿþûùøýûÿÿûÿú÷ÿ÷ñöÿþÿÿüùÿýöÿþóý÷êëæ×ÌɺÐÐÀÕÕÇìñâíñåïöéýüøÿÿûÿÿüúùõúùõÿÿþÿþýþüû]

IN image_to_bmp(/home/stefan/autotest/temp/python26-zope212-cmf22-plone40/eggs/Products.PortalTransforms-2.0b3-py2.6.egg/Products/PortalTransforms/tests/input/logo.jpg)



Failure in test testSame (Products.PortalTransforms.tests.test_transforms.TransformTestSubclass)
Traceback (most recent call last):
  File "/usr/local/python2.6/lib/python2.6/unittest.py", line 279, in run
    testMethod()
  File "/home/stefan/autotest/temp/python26-zope212-cmf22-plone40/eggs/Products.PortalTransforms-2.0b3-py2.6.egg/Products/PortalTransforms/tests/test_transforms.py", line 68, in testSame
    self.do_convert(filename=self.input)
  File "/home/stefan/autotest/temp/python26-zope212-cmf22-plone40/eggs/Products.PortalTransforms-2.0b3-py2.6.egg/Products/PortalTransforms/tests/test_transforms.py", line 60, in do_convert
    got, expected, self.transform.name(), self.input))
  File "/usr/local/python2.6/lib/python2.6/unittest.py", line 350, in failUnlessEqual
    (msg or '%r != %r' % (first, second))
AssertionError: [ÿØÿà JFIF      ÿÛ C     $.' ",#(7),01444'9=82<.342ÿÛ C  2!!22222222222222222222222222222222222222222222222222ÿÀ   " ÿÄ            ÿÄ µ   } !1AQa"q2‘¡#B±ÁRÑð$3br‚ %&'()*456789:CDEFGHIJSTUVWXYZcdefghijstuvwxyzƒ„…†‡ˆ‰Š’“”•–—˜™š¢£¤¥¦§¨©ª²³´µ¶·¸¹ºÂÃÄÅÆÇÈÉÊÒÓÔÕÖ×ØÙÚáâãäåæçèéêñòóôõö÷øùúÿÄ         ÿÄ µ  w !1AQaq"2B‘¡±Á #3RðbrÑ $4á%ñ&'()*56789:CDEFGHIJSTUVWXYZcdefghijstuvwxyz‚ƒ„…†‡ˆ‰Š’“”•–—˜™š¢£¤¥¦§¨©ª²³´µ¶·¸¹ºÂÃÄÅÆÇÈÉÊÒÓÔÕÖ×ØÙÚâãäåæçèéêòóôõö÷øùúÿÚ    ? ÷ ¦šâw‚±T|Î?ϨÇý1UmbYåÆéÙ7ÇxÓ¹ïÍYÓ0¢elyŠÿ 1ü1ŸÌ5Dí»VÑJC2 Ø]qÁÏUäA=´ò¤æÚ|ÏÊÜò9#úþGêJ…ÑĶi!&p>nrq¸OÐ7äh¤ÊD÷Ò¤­qlØr>e=ùÀôÍS¶™’R–ñ/™ŒmÜ[hüp=;þ´QM+’ôeÛ{WIL³îß’ý?Ï­QRZ?ÿÙ]

!=

[ÿØÿà JFIF      ÿÛ C     $.' ",#(7),01444'9=82<.342ÿÛ C  2!!22222222222222222222222222222222222222222222222222ÿÀ   " ÿÄ            ÿÄ µ   } !1AQa"q2‘¡#B±ÁRÑð$3br‚ %&'()*456789:CDEFGHIJSTUVWXYZcdefghijstuvwxyzƒ„…†‡ˆ‰Š’“”•–—˜™š¢£¤¥¦§¨©ª²³´µ¶·¸¹ºÂÃÄÅÆÇÈÉÊÒÓÔÕÖ×ØÙÚáâãäåæçèéêñòóôõö÷øùúÿÄ         ÿÄ µ  w !1AQaq"2B‘¡±Á #3RðbrÑ $4á%ñ&'()*56789:CDEFGHIJSTUVWXYZcdefghijstuvwxyz‚ƒ„…†‡ˆ‰Š’“”•–—˜™š¢£¤¥¦§¨©ª²³´µ¶·¸¹ºÂÃÄÅÆÇÈÉÊÒÓÔÕÖ×ØÙÚâãäåæçèéêòóôõö÷øùúÿÚ    ? ÷ ¦šâw‚±T|Î?ϨÇý1UmbYåÆéÙ7ÇxÓ¹ïÍYÓ0¢elyŠÿ 1ü1ŸÌ5Dí»VÑJC2 Ø]qÁÏUäC'¶žTœÛO‚Ùù[žG$_ÈýIPº8–Í$$ÎÍÎN7Éúü™HžâÚT•®-›Ģ¡ÿ 8™ªvÓ2JRÞ%ó1»‹mŽ§ÖŠ)­Izmí]%2Ìw»~Kôÿ <~´QEIgÿÙ]

IN image_to_jpeg(/home/stefan/autotest/temp/python26-zope212-cmf22-plone40/eggs/Products.PortalTransforms-2.0b3-py2.6.egg/Products/PortalTransforms/tests/input/logo.gif)



Failure in test testSameNoFilename (Products.PortalTransforms.tests.test_transforms.TransformTestSubclass)
Traceback (most recent call last):
  File "/usr/local/python2.6/lib/python2.6/unittest.py", line 279, in run
    testMethod()
  File "/home/stefan/autotest/temp/python26-zope212-cmf22-plone40/eggs/Products.PortalTransforms-2.0b3-py2.6.egg/Products/PortalTransforms/tests/test_transforms.py", line 74, in testSameNoFilename
    self.do_convert()
  File "/home/stefan/autotest/temp/python26-zope212-cmf22-plone40/eggs/Products.PortalTransforms-2.0b3-py2.6.egg/Products/PortalTransforms/tests/test_transforms.py", line 60, in do_convert
    got, expected, self.transform.name(), self.input))
  File "/usr/local/python2.6/lib/python2.6/unittest.py", line 350, in failUnlessEqual
    (msg or '%r != %r' % (first, second))
AssertionError: [ÿØÿà JFIF      ÿÛ C     $.' ",#(7),01444'9=82<.342ÿÛ C  2!!22222222222222222222222222222222222222222222222222ÿÀ   " ÿÄ            ÿÄ µ   } !1AQa"q2‘¡#B±ÁRÑð$3br‚ %&'()*456789:CDEFGHIJSTUVWXYZcdefghijstuvwxyzƒ„…†‡ˆ‰Š’“”•–—˜™š¢£¤¥¦§¨©ª²³´µ¶·¸¹ºÂÃÄÅÆÇÈÉÊÒÓÔÕÖ×ØÙÚáâãäåæçèéêñòóôõö÷øùúÿÄ         ÿÄ µ  w !1AQaq"2B‘¡±Á #3RðbrÑ $4á%ñ&'()*56789:CDEFGHIJSTUVWXYZcdefghijstuvwxyz‚ƒ„…†‡ˆ‰Š’“”•–—˜™š¢£¤¥¦§¨©ª²³´µ¶·¸¹ºÂÃÄÅÆÇÈÉÊÒÓÔÕÖ×ØÙÚâãäåæçèéêòóôõö÷øùúÿÚ    ? ÷ ¦šâw‚±T|Î?ϨÇý1UmbYåÆéÙ7ÇxÓ¹ïÍYÓ0¢elyŠÿ 1ü1ŸÌ5Dí»VÑJC2 Ø]qÁÏUäA=´ò¤æÚ|ÏÊÜò9#úþGêJ…ÑĶi!&p>nrq¸OÐ7äh¤ÊD÷Ò¤­qlØr>e=ùÀôÍS¶™’R–ñ/™ŒmÜ[hüp=;þ´QM+’ôeÛ{WIL³îß’ý?Ï­QRZ?ÿÙ]

!=

[ÿØÿà JFIF      ÿÛ C     $.' ",#(7),01444'9=82<.342ÿÛ C  2!!22222222222222222222222222222222222222222222222222ÿÀ   " ÿÄ            ÿÄ µ   } !1AQa"q2‘¡#B±ÁRÑð$3br‚ %&'()*456789:CDEFGHIJSTUVWXYZcdefghijstuvwxyzƒ„…†‡ˆ‰Š’“”•–—˜™š¢£¤¥¦§¨©ª²³´µ¶·¸¹ºÂÃÄÅÆÇÈÉÊÒÓÔÕÖ×ØÙÚáâãäåæçèéêñòóôõö÷øùúÿÄ         ÿÄ µ  w !1AQaq"2B‘¡±Á #3RðbrÑ $4á%ñ&'()*56789:CDEFGHIJSTUVWXYZcdefghijstuvwxyz‚ƒ„…†‡ˆ‰Š’“”•–—˜™š¢£¤¥¦§¨©ª²³´µ¶·¸¹ºÂÃÄÅÆÇÈÉÊÒÓÔÕÖ×ØÙÚâãäåæçèéêòóôõö÷øùúÿÚ    ? ÷ ¦šâw‚±T|Î?ϨÇý1UmbYåÆéÙ7ÇxÓ¹ïÍYÓ0¢elyŠÿ 1ü1ŸÌ5Dí»VÑJC2 Ø]qÁÏUäC'¶žTœÛO‚Ùù[žG$_ÈýIPº8–Í$$ÎÍÎN7Éúü™HžâÚT•®-›Ģ¡ÿ 8™ªvÓ2JRÞ%ó1»‹mŽ§ÖŠ)­Izmí]%2Ìw»~Kôÿ <~´QEIgÿÙ]

IN image_to_jpeg(/home/stefan/autotest/temp/python26-zope212-cmf22-plone40/eggs/Products.PortalTransforms-2.0b3-py2.6.egg/Products/PortalTransforms/tests/input/logo.gif)

  Ran 517 tests with 4 failures and 0 errors in 36.067 seconds.
Running Products.PloneTestCase.layer.PloneSite tests:
  Tear down Products.Archetypes.tests.layer.ArchetypesSite in 0.067 seconds.
  Tear down Products.Archetypes.tests.layer.ZCML in 0.005 seconds.
  Tear down Products.CMFCore.testing.FunctionalZCMLLayer in 0.000 seconds.
  Set up Products.PloneTestCase.layer.ZCML in 2.377 seconds.
  Set up Products.PloneTestCase.layer.PloneSite in 3.687 seconds.
  Ran 9 tests with 0 failures and 0 errors in 1.075 seconds.
Running plone.app.kss.tests.kss_and_plone_layer.KSSAndPloneLayer tests:
  Set up plone.app.kss.tests.kss_and_plone_layer.KSSAndPloneLayer in 0.005 seconds.


Error in test testVersionPreviewIsNotInlineEditable (archetypes.kss.tests.test_fields.FieldsViewTestCase)
Traceback (most recent call last):
  File "/usr/local/python2.6/lib/python2.6/unittest.py", line 279, in run
    testMethod()
  File "/home/stefan/autotest/temp/python26-zope212-cmf22-plone40/src/archetypes.kss/archetypes/kss/tests/test_fields.py", line 278, in testVersionPreviewIsNotInlineEditable
    klass = tag['class']
TypeError: 'NoneType' object is unsubscriptable

  Ran 19 tests with 0 failures and 1 errors in 1.347 seconds.
Running zope.testing.testrunner.layer.UnitTests tests:
  Tear down plone.app.kss.tests.kss_and_plone_layer.KSSAndPloneLayer in 0.000 seconds.
  Tear down Products.PloneTestCase.layer.PloneSite in 0.345 seconds.
  Tear down Products.PloneTestCase.layer.ZCML in 0.005 seconds.
  Tear down Testing.ZopeTestCase.layer.ZopeLite in 0.000 seconds.
  Set up zope.testing.testrunner.layer.UnitTests in 0.000 seconds.
/home/stefan/autotest/temp/python26-zope212-cmf22-plone40/eggs/Products.Archetypes-1.6b3-py2.6.egg/Products/Archetypes/ClassGen.py:152: UserWarning: The method 'makeFoo' was already protected by a different permission than the one declared on the field. Assuming that the explicit permission declared is the correct one and has preference over the permission declared on the field.
  self.handle_mode(klass, generator, type, field, mode)
  Ran 28 tests with 0 failures and 0 errors in 0.149 seconds.
Tearing down left over layers:
  Tear down zope.testing.testrunner.layer.UnitTests in 0.000 seconds.
Total: 668 tests, 4 failures, 1 errors in 50.351 seconds.
Running Testing.ZopeTestCase.layer.ZopeLite tests:
  Set up Testing.ZopeTestCase.layer.ZopeLite in 0.090 seconds.
  Ran 283 tests with 0 failures and 0 errors in 1.320 seconds.
Running Products.CMFCalendar.testing.FunctionalLayer tests:
  Set up Products.CMFCore.testing.FunctionalZCMLLayer in 0.167 seconds.
  Set up Products.CMFCalendar.testing.FunctionalLayer in 0.326 seconds.
  Ran 24 tests with 0 failures and 0 errors in 1.531 seconds.
Running Products.CMFCore.testing.EventZCMLLayer tests:
  Tear down Products.CMFCalendar.testing.FunctionalLayer in 0.026 seconds.
  Tear down Products.CMFCore.testing.FunctionalZCMLLayer in 0.001 seconds.
  Set up Products.CMFCore.testing.EventZCMLLayer in 0.001 seconds.
  Ran 8 tests with 0 failures and 0 errors in 0.200 seconds.
Running Products.CMFCore.testing.ExportImportZCMLLayer tests:
  Tear down Products.CMFCore.testing.EventZCMLLayer in 0.000 seconds.
  Set up Products.CMFCore.testing.ExportImportZCMLLayer in 0.001 seconds.
  Ran 10 tests with 0 failures and 0 errors in 0.964 seconds.
Running Products.CMFCore.testing.TraversingEventZCMLLayer tests:
  Tear down Products.CMFCore.testing.ExportImportZCMLLayer in 0.000 seconds.
  Set up Products.CMFCore.testing.TraversingEventZCMLLayer in 0.001 seconds.
  Ran 5 tests with 0 failures and 0 errors in 0.159 seconds.
Running Products.CMFDefault.testing.FunctionalLayer tests:
  Tear down Products.CMFCore.testing.TraversingEventZCMLLayer in 0.000 seconds.
  Set up Products.CMFCore.testing.FunctionalZCMLLayer in 0.153 seconds.
  Set up Products.CMFDefault.testing.FunctionalLayer in 0.244 seconds.
  Ran 76 tests with 0 failures and 0 errors in 3.946 seconds.
Running Products.CMFUid.testing.UidEventZCMLLayer tests:
  Tear down Products.CMFDefault.testing.FunctionalLayer in 0.023 seconds.
  Tear down Products.CMFCore.testing.FunctionalZCMLLayer in 0.002 seconds.
  Set up Products.CMFUid.testing.UidEventZCMLLayer in 0.001 seconds.
  Ran 12 tests with 0 failures and 0 errors in 0.321 seconds.
Running Products.DCWorkflow.testing.ExportImportZCMLLayer tests:
  Tear down Products.CMFUid.testing.UidEventZCMLLayer in 0.000 seconds.
  Set up Products.DCWorkflow.testing.ExportImportZCMLLayer in 0.141 seconds.
  Ran 38 tests with 0 failures and 0 errors in 0.737 seconds.
Running Products.GenericSetup.testing.ExportImportZCMLLayer tests:
  Tear down Products.DCWorkflow.testing.ExportImportZCMLLayer in 0.000 seconds.
  Set up Products.GenericSetup.testing.ExportImportZCMLLayer in 0.081 seconds.
  Ran 186 tests with 0 failures and 0 errors in 0.593 seconds.
Running zope.testing.testrunner.layer.UnitTests tests:
  Tear down Products.GenericSetup.testing.ExportImportZCMLLayer in 0.000 seconds.
  Tear down Testing.ZopeTestCase.layer.ZopeLite in 0.000 seconds.
  Set up zope.testing.testrunner.layer.UnitTests in 0.000 seconds.
  Ran 346 tests with 0 failures and 0 errors in 0.258 seconds.
Tearing down left over layers:
  Tear down zope.testing.testrunner.layer.UnitTests in 0.000 seconds.
Total: 988 tests, 0 failures, 0 errors in 12.570 seconds.
Running Testing.ZopeTestCase.layer.ZopeLite tests:
  Set up Testing.ZopeTestCase.layer.ZopeLite in 0.915 seconds.
  Ran 27 tests with 0 failures and 0 errors in 0.056 seconds.
Running Products.PloneTestCase.layer.PloneSite tests:
  Set up Products.PloneTestCase.layer.ZCML in 2.492 seconds.
  Set up Products.PloneTestCase.layer.PloneSite in 4.802 seconds.
/home/stefan/autotest/temp/python26-zope212-cmf22-plone40/eggs/Zope2-2.12.3-py2.6-linux-x86_64.egg/OFS/subscribers.py:73: DeprecationWarning: Products.FAQ.FAQ.FAQ.manage_afterAdd is discouraged. You should use event subscribers instead.
  DeprecationWarning)
/home/stefan/autotest/temp/python26-zope212-cmf22-plone40/eggs/Zope2-2.12.3-py2.6-linux-x86_64.egg/OFS/subscribers.py:73: DeprecationWarning: Products.FAQ.FAQQuestion.FAQQuestion.manage_afterAdd is discouraged. You should use event subscribers instead.
  DeprecationWarning)
  Ran 145 tests with 0 failures and 0 errors in 23.943 seconds.
Running Products.CMFDiffTool.tests.BaseTestCase.CMFDiffToolLayer tests:
  Set up Products.CMFDiffTool.tests.BaseTestCase.CMFDiffToolLayer in 0.013 seconds.
  Ran 2 tests with 0 failures and 0 errors in 0.220 seconds.
Running Products.CMFTestCase.layer.CMFSite tests:
  Tear down Products.CMFDiffTool.tests.BaseTestCase.CMFDiffToolLayer in 0.364 seconds.
  Tear down Products.PloneTestCase.layer.PloneSite in 0.006 seconds.
  Tear down Products.PloneTestCase.layer.ZCML in 0.004 seconds.
  Set up Products.CMFTestCase.layer.ZCML in 1.781 seconds.
  Set up Products.CMFTestCase.layer.CMFSite in 1.338 seconds.
  Ran 20 tests with 0 failures and 0 errors in 0.395 seconds.
Running zope.testing.testrunner.layer.UnitTests tests:
  Tear down Products.CMFTestCase.layer.CMFSite in 0.065 seconds.
  Tear down Products.CMFTestCase.layer.ZCML in 0.003 seconds.
  Tear down Testing.ZopeTestCase.layer.ZopeLite in 0.000 seconds.
  Set up zope.testing.testrunner.layer.UnitTests in 0.000 seconds.
  Ran 10 tests with 0 failures and 0 errors in 0.005 seconds.
Tearing down left over layers:
  Tear down zope.testing.testrunner.layer.UnitTests in 0.000 seconds.
Total: 204 tests, 0 failures, 0 errors in 37.388 seconds.
Running Testing.ZopeTestCase.layer.ZopeLite tests:
  Set up Testing.ZopeTestCase.layer.ZopeLite in 0.562 seconds.
  Ran 126 tests with 0 failures and 0 errors in 0.762 seconds.
Running Products.CMFTestCase.layer.CMFSite tests:
  Set up Products.CMFTestCase.layer.ZCML in 2.360 seconds.
  Set up Products.CMFTestCase.layer.CMFSite in 0.234 seconds.
  Ran 58 tests with 0 failures and 0 errors in 2.015 seconds.
Running Products.PloneTestCase.layer.ZCML tests:
  Tear down Products.CMFTestCase.layer.CMFSite in 0.039 seconds.
  Tear down Products.CMFTestCase.layer.ZCML in 0.004 seconds.
  Set up Products.PloneTestCase.layer.ZCML in 1.794 seconds.
  Ran 12 tests with 0 failures and 0 errors in 0.016 seconds.
Running Products.PloneTestCase.layer.PloneSite tests:
  Set up Products.PloneTestCase.layer.PloneSite in 4.020 seconds.


Failure in test testDoUpgrades (Products.CMFPlone.tests.testMigrationTool.TestMigrationTool)
Traceback (most recent call last):
  File "/usr/local/python2.6/lib/python2.6/unittest.py", line 279, in run
    testMethod()
  File "/home/stefan/autotest/temp/python26-zope212-cmf22-plone40/src/Plone/Products/CMFPlone/tests/testMigrationTool.py", line 63, in testDoUpgrades
    self.failUnless(last == current)
  File "/usr/local/python2.6/lib/python2.6/unittest.py", line 325, in failUnless
    if not expr: raise self.failureException, msg
AssertionError



Failure in test testDoUpgrades (plone.app.upgrade.tests.test_upgrade.TestUpgrade)
Traceback (most recent call last):
  File "/usr/local/python2.6/lib/python2.6/unittest.py", line 279, in run
    testMethod()
  File "/home/stefan/autotest/temp/python26-zope212-cmf22-plone40/src/plone.app.upgrade/plone/app/upgrade/tests/test_upgrade.py", line 51, in testDoUpgrades
    self.failUnless(last == current)
  File "/usr/local/python2.6/lib/python2.6/unittest.py", line 325, in failUnless
    if not expr: raise self.failureException, msg
AssertionError

  Ran 1839 tests with 2 failures and 0 errors in 3 minutes 45.436 seconds.
Running plone.app.contentrules.tests.test_configuration.TestContentrulesGSLayer tests:
  Set up plone.app.contentrules.tests.test_configuration.TestContentrulesGSLayer in 0.002 seconds.
  Ran 6 tests with 0 failures and 0 errors in 2.400 seconds.
Running plone.app.customerize.tests.layer.PloneCustomerize tests:
  Tear down plone.app.contentrules.tests.test_configuration.TestContentrulesGSLayer in 0.000 seconds.
  Set up plone.app.customerize.tests.layer.PloneCustomerize in 0.000 seconds.
  Ran 27 tests with 0 failures and 0 errors in 2.651 seconds.
Running plone.app.kss.tests.kss_and_plone_layer.KSSAndPloneLayer tests:
  Tear down plone.app.customerize.tests.layer.PloneCustomerize in 0.000 seconds.
  Set up plone.app.kss.tests.kss_and_plone_layer.KSSAndPloneLayer in 0.004 seconds.
  Ran 13 tests with 0 failures and 0 errors in 1.150 seconds.
Running plone.app.linkintegrity.tests.layer.PloneLinkintegrity tests:
  Tear down plone.app.kss.tests.kss_and_plone_layer.KSSAndPloneLayer in 0.000 seconds.
  Set up collective.testcaselayer.ptc.PTCLayer in 0.035 seconds.
  Set up plone.app.linkintegrity.tests.layer.PloneLinkintegrity in 0.565 seconds.
  Ran 117 tests with 0 failures and 0 errors in 27.804 seconds.
Running plone.app.upgrade.tests.base.FunctionalUpgradeLayer tests:
  Tear down plone.app.linkintegrity.tests.layer.PloneLinkintegrity in 0.000 seconds.
  Tear down collective.testcaselayer.ptc.PTCLayer in 0.000 seconds.
  Set up plone.app.upgrade.tests.base.FunctionalUpgradeLayer in 0.000 seconds.


Failure in test testUpgrade (plone.app.upgrade.v25.tests.TestFunctionalMigrations)
Traceback (most recent call last):
  File "/usr/local/python2.6/lib/python2.6/unittest.py", line 279, in run
    testMethod()
  File "/home/stefan/autotest/temp/python26-zope212-cmf22-plone40/src/plone.app.upgrade/plone/app/upgrade/v25/tests.py", line 131, in testUpgrade
    self.failIf(mig.needUpgrading())
  File "/usr/local/python2.6/lib/python2.6/unittest.py", line 321, in failIf
    if expr: raise self.failureException, msg
AssertionError



Failure in test testBaseUpgrade (plone.app.upgrade.v30.tests.TestFunctionalMigrations)
Traceback (most recent call last):
  File "/usr/local/python2.6/lib/python2.6/unittest.py", line 279, in run
    testMethod()
  File "/home/stefan/autotest/temp/python26-zope212-cmf22-plone40/src/plone.app.upgrade/plone/app/upgrade/v30/tests.py", line 1261, in testBaseUpgrade
    self.failIf(mig.needUpgrading())
  File "/usr/local/python2.6/lib/python2.6/unittest.py", line 321, in failIf
    if expr: raise self.failureException, msg
AssertionError



Failure in test testFullUpgrade (plone.app.upgrade.v30.tests.TestFunctionalMigrations)
Traceback (most recent call last):
  File "/usr/local/python2.6/lib/python2.6/unittest.py", line 279, in run
    testMethod()
  File "/home/stefan/autotest/temp/python26-zope212-cmf22-plone40/src/plone.app.upgrade/plone/app/upgrade/v30/tests.py", line 1272, in testFullUpgrade
    self.failIf(mig.needUpgrading())
  File "/usr/local/python2.6/lib/python2.6/unittest.py", line 321, in failIf
    if expr: raise self.failureException, msg
AssertionError



Failure in test testBaseUpgrade (plone.app.upgrade.v31.tests.TestFunctionalMigrations)
Traceback (most recent call last):
  File "/usr/local/python2.6/lib/python2.6/unittest.py", line 279, in run
    testMethod()
  File "/home/stefan/autotest/temp/python26-zope212-cmf22-plone40/src/plone.app.upgrade/plone/app/upgrade/v31/tests.py", line 100, in testBaseUpgrade
    self.failIf(mig.needUpgrading())
  File "/usr/local/python2.6/lib/python2.6/unittest.py", line 321, in failIf
    if expr: raise self.failureException, msg
AssertionError



Failure in test testFullUpgrade (plone.app.upgrade.v31.tests.TestFunctionalMigrations)
Traceback (most recent call last):
  File "/usr/local/python2.6/lib/python2.6/unittest.py", line 279, in run
    testMethod()
  File "/home/stefan/autotest/temp/python26-zope212-cmf22-plone40/src/plone.app.upgrade/plone/app/upgrade/v31/tests.py", line 111, in testFullUpgrade
    self.failIf(mig.needUpgrading())
  File "/usr/local/python2.6/lib/python2.6/unittest.py", line 321, in failIf
    if expr: raise self.failureException, msg
AssertionError



Failure in test testBaseUpgrade (plone.app.upgrade.v32.tests.TestFunctionalMigrations)
Traceback (most recent call last):
  File "/usr/local/python2.6/lib/python2.6/unittest.py", line 279, in run
    testMethod()
  File "/home/stefan/autotest/temp/python26-zope212-cmf22-plone40/src/plone.app.upgrade/plone/app/upgrade/v32/tests.py", line 35, in testBaseUpgrade
    self.failIf(mig.needUpgrading())
  File "/usr/local/python2.6/lib/python2.6/unittest.py", line 321, in failIf
    if expr: raise self.failureException, msg
AssertionError



Failure in test testFullUpgrade (plone.app.upgrade.v32.tests.TestFunctionalMigrations)
Traceback (most recent call last):
  File "/usr/local/python2.6/lib/python2.6/unittest.py", line 279, in run
    testMethod()
  File "/home/stefan/autotest/temp/python26-zope212-cmf22-plone40/src/plone.app.upgrade/plone/app/upgrade/v32/tests.py", line 46, in testFullUpgrade
    self.failIf(mig.needUpgrading())
  File "/usr/local/python2.6/lib/python2.6/unittest.py", line 321, in failIf
    if expr: raise self.failureException, msg
AssertionError



Failure in test testBaseUpgrade (plone.app.upgrade.v33.tests.TestFunctionalMigrations)
Traceback (most recent call last):
  File "/usr/local/python2.6/lib/python2.6/unittest.py", line 279, in run
    testMethod()
  File "/home/stefan/autotest/temp/python26-zope212-cmf22-plone40/src/plone.app.upgrade/plone/app/upgrade/v33/tests.py", line 48, in testBaseUpgrade
    self.failIf(mig.needUpgrading())
  File "/usr/local/python2.6/lib/python2.6/unittest.py", line 321, in failIf
    if expr: raise self.failureException, msg
AssertionError



Failure in test testFolderUpgrade (plone.app.upgrade.v33.tests.TestFunctionalMigrations)
Traceback (most recent call last):
  File "/usr/local/python2.6/lib/python2.6/unittest.py", line 279, in run
    testMethod()
  File "/home/stefan/autotest/temp/python26-zope212-cmf22-plone40/src/plone.app.upgrade/plone/app/upgrade/v33/tests.py", line 80, in testFolderUpgrade
    self.failIf(oldsite.portal_migration.needUpgrading())
  File "/usr/local/python2.6/lib/python2.6/unittest.py", line 321, in failIf
    if expr: raise self.failureException, msg
AssertionError



Failure in test testFullUpgrade (plone.app.upgrade.v33.tests.TestFunctionalMigrations)
Traceback (most recent call last):
  File "/usr/local/python2.6/lib/python2.6/unittest.py", line 279, in run
    testMethod()
  File "/home/stefan/autotest/temp/python26-zope212-cmf22-plone40/src/plone.app.upgrade/plone/app/upgrade/v33/tests.py", line 59, in testFullUpgrade
    self.failIf(mig.needUpgrading())
  File "/usr/local/python2.6/lib/python2.6/unittest.py", line 321, in failIf
    if expr: raise self.failureException, msg
AssertionError

  Ran 11 tests with 10 failures and 0 errors in 48.120 seconds.
Running plone.app.viewletmanager.tests.test_exportimport.Layer tests:
  Tear down plone.app.upgrade.tests.base.FunctionalUpgradeLayer in 0.000 seconds.
  Tear down Products.PloneTestCase.layer.PloneSite in 0.374 seconds.
  Tear down Products.PloneTestCase.layer.ZCML in 0.015 seconds.
  Tear down Testing.ZopeTestCase.layer.ZopeLite in 0.000 seconds.
  Set up plone.app.viewletmanager.tests.test_exportimport.Layer in 0.000 seconds.
  Ran 16 tests with 0 failures and 0 errors in 0.050 seconds.
Running zope.testing.testrunner.layer.UnitTests tests:
  Tear down plone.app.viewletmanager.tests.test_exportimport.Layer in 0.000 seconds.
  Set up zope.testing.testrunner.layer.UnitTests in 0.000 seconds.
  Ran 145 tests with 0 failures and 0 errors in 0.909 seconds.
Tearing down left over layers:
  Tear down zope.testing.testrunner.layer.UnitTests in 0.000 seconds.
Total: 2370 tests, 12 failures, 0 errors in 5 minutes 25.777 seconds.
Running Testing.ZopeTestCase.layer.ZopeLite tests:
  Set up Testing.ZopeTestCase.layer.ZopeLite in 1.439 seconds.
  Ran 165 tests with 0 failures and 0 errors in 0.635 seconds.
Running Products.PloneTestCase.layer.ZCML tests:
  Set up Products.PloneTestCase.layer.ZCML in 2.400 seconds.
  Ran 34 tests with 0 failures and 0 errors in 0.211 seconds.
Running Products.PlonePAS.tests.layer.PlonePASLayer tests:
  Set up Products.PloneTestCase.layer.PloneSite in 3.650 seconds.
  Set up Products.PlonePAS.tests.layer.PlonePASLayer in 0.000 seconds.
  Ran 153 tests with 0 failures and 0 errors in 1.925 seconds.
Running zope.testing.testrunner.layer.UnitTests tests:
  Tear down Products.PlonePAS.tests.layer.PlonePASLayer in 0.000 seconds.
  Tear down Products.PloneTestCase.layer.PloneSite in 0.336 seconds.
  Tear down Products.PloneTestCase.layer.ZCML in 0.004 seconds.
  Tear down Testing.ZopeTestCase.layer.ZopeLite in 0.000 seconds.
  Set up zope.testing.testrunner.layer.UnitTests in 0.000 seconds.
  Ran 337 tests with 0 failures and 0 errors in 0.928 seconds.
Tearing down left over layers:
  Tear down zope.testing.testrunner.layer.UnitTests in 0.000 seconds.
Total: 689 tests, 0 failures, 0 errors in 12.305 seconds.
Running Products.PloneTestCase.layer.PloneSite tests:
  Set up Testing.ZopeTestCase.layer.ZopeLite in 1.390 seconds.
  Set up Products.PloneTestCase.layer.ZCML in 2.431 seconds.
  Set up Products.PloneTestCase.layer.PloneSite in 4.193 seconds.
/home/stefan/autotest/temp/python26-zope212-cmf22-plone40/eggs/borg.localrole-3.0a1-py2.6.egg/borg/localrole/bbb/bbb.txt:1: DeprecationWarning: IWorkspace is deprecated. Please use borg.localrole.interfaces.ILocalRoleProvider instead
  =========
/home/stefan/autotest/temp/python26-zope212-cmf22-plone40/eggs/borg.localrole-3.0a1-py2.6.egg/borg/localrole/bbb/bbb.txt:1: DeprecationWarning: IGroupAwareWorkspace is deprecated. Please use borg.localrole.interfaces.ILocalRoleProvider instead
  =========
  Ran 39 tests with 0 failures and 0 errors in 0.237 seconds.
Running plone.browserlayer.tests.test_doctest.PloneBrowserLayerLayer tests:
  Set up plone.browserlayer.tests.test_doctest.PloneBrowserLayerLayer in 0.003 seconds.
  Ran 9 tests with 0 failures and 0 errors in 0.740 seconds.
Running plone.theme.tests.test_doctest.PloneThemeLayer tests:
  Tear down plone.browserlayer.tests.test_doctest.PloneBrowserLayerLayer in 0.000 seconds.
  Set up plone.theme.tests.test_doctest.PloneThemeLayer in 0.003 seconds.
  Ran 5 tests with 0 failures and 0 errors in 0.053 seconds.
Running zope.testing.testrunner.layer.UnitTests tests:
  Tear down plone.theme.tests.test_doctest.PloneThemeLayer in 0.000 seconds.
  Tear down Products.PloneTestCase.layer.PloneSite in 0.330 seconds.
  Tear down Products.PloneTestCase.layer.ZCML in 0.005 seconds.
  Tear down Testing.ZopeTestCase.layer.ZopeLite in 0.000 seconds.
  Set up zope.testing.testrunner.layer.UnitTests in 0.000 seconds.
/usr/local/python2.6/lib/python2.6/mhlib.py:83: DeprecationWarning: the multifile module has been deprecated since Python 2.5
  import multifile
  Ran 252 tests with 0 failures and 0 errors in 0.836 seconds.
Tearing down left over layers:
  Tear down zope.testing.testrunner.layer.UnitTests in 0.000 seconds.
Total: 305 tests, 0 failures, 0 errors in 11.114 seconds.
Running Products.PloneTestCase.layer.PloneSite tests:
  Set up Testing.ZopeTestCase.layer.ZopeLite in 0.906 seconds.
  Set up Products.PloneTestCase.layer.ZCML in 2.358 seconds.
  Set up Products.PloneTestCase.layer.PloneSite in 3.969 seconds.
/usr/local/python2.6/lib/python2.6/unittest.py:279: DeprecationWarning: The use of 'hide' has been deprecated and will be removed in plone.portlet.static 2.0. Instead, use the new generic built-in show/hide setting of plone.portlets.
  testMethod()
  Ran 165 tests with 0 failures and 0 errors in 14.890 seconds.
Running plone.app.portlets.tests.test_configuration.TestPortletZCMLLayer tests:
  Set up plone.app.portlets.tests.test_configuration.TestPortletZCMLLayer in 0.006 seconds.
  Ran 5 tests with 0 failures and 0 errors in 0.039 seconds.
Running plone.app.portlets.tests.test_configuration.TestPortletGSLayer tests:
  Set up plone.app.portlets.tests.test_configuration.TestPortletGSLayer Traceback (most recent call last):
  File "/home/stefan/autotest/temp/python26-zope212-cmf22-plone40/eggs/zope.testing-3.7.7-py2.6.egg/zope/testing/testrunner/runner.py", line 361, in run_layer
    setup_layer(options, layer, setup_layers)
  File "/home/stefan/autotest/temp/python26-zope212-cmf22-plone40/eggs/zope.testing-3.7.7-py2.6.egg/zope/testing/testrunner/runner.py", line 518, in setup_layer
    layer.setUp()
  File "/home/stefan/autotest/temp/python26-zope212-cmf22-plone40/src/plone.app.portlets/plone/app/portlets/tests/test_configuration.py", line 154, in setUp
    portal_setup.runAllImportStepsFromProfile('profile-plone.app.portlets:testing')
  File "/home/stefan/autotest/temp/python26-zope212-cmf22-plone40/eggs/Products.GenericSetup-1.6.0b1-py2.6.egg/Products/GenericSetup/tool.py", line 331, in runAllImportStepsFromProfile
    ignore_dependencies=ignore_dependencies)
   - __traceback_info__: profile-plone.app.portlets:testing
  File "/home/stefan/autotest/temp/python26-zope212-cmf22-plone40/eggs/Products.GenericSetup-1.6.0b1-py2.6.egg/Products/GenericSetup/tool.py", line 1085, in _runImportStepsFromContext
    message = self._doRunImportStep(step, context)
  File "/home/stefan/autotest/temp/python26-zope212-cmf22-plone40/eggs/Products.GenericSetup-1.6.0b1-py2.6.egg/Products/GenericSetup/tool.py", line 999, in _doRunImportStep
    return handler(context)
   - __traceback_info__: portlets
  File "/home/stefan/autotest/temp/python26-zope212-cmf22-plone40/src/plone.app.portlets/plone/app/portlets/exportimport/portlets.py", line 686, in importPortlets
    importer.body = body
  File "/home/stefan/autotest/temp/python26-zope212-cmf22-plone40/eggs/Products.GenericSetup-1.6.0b1-py2.6.egg/Products/GenericSetup/utils.py", line 509, in _importBody
    self._importNode(dom.documentElement)
  File "/home/stefan/autotest/temp/python26-zope212-cmf22-plone40/src/plone.app.portlets/plone/app/portlets/exportimport/portlets.py", line 210, in _importNode
    self._initProvider(node)
  File "/home/stefan/autotest/temp/python26-zope212-cmf22-plone40/src/plone.app.portlets/plone/app/portlets/exportimport/portlets.py", line 219, in _initProvider
    self._initPortlets(node)
  File "/home/stefan/autotest/temp/python26-zope212-cmf22-plone40/src/plone.app.portlets/plone/app/portlets/exportimport/portlets.py", line 273, in _initPortlets
    self._initAssignmentNode(child)
  File "/home/stefan/autotest/temp/python26-zope212-cmf22-plone40/src/plone.app.portlets/plone/app/portlets/exportimport/portlets.py", line 440, in _initAssignmentNode
    assignment_handler.import_assignment(portlet_interface, node)
  File "/home/stefan/autotest/temp/python26-zope212-cmf22-plone40/src/plone.app.portlets/plone/app/portlets/exportimport/portlets.py", line 83, in import_assignment
    self.import_node(interface, child)
  File "/home/stefan/autotest/temp/python26-zope212-cmf22-plone40/src/plone.app.portlets/plone/app/portlets/exportimport/portlets.py", line 125, in import_node
    value = self.from_unicode(field, value)
  File "/home/stefan/autotest/temp/python26-zope212-cmf22-plone40/src/plone.app.portlets/plone/app/portlets/exportimport/portlets.py", line 167, in from_unicode
    return field.fromUnicode(value)
  File "/home/stefan/autotest/temp/python26-zope212-cmf22-plone40/eggs/zope.schema-3.5.4-py2.6.egg/zope/schema/_field.py", line 302, in fromUnicode
    self.validate(str)
  File "/home/stefan/autotest/temp/python26-zope212-cmf22-plone40/eggs/zope.schema-3.5.4-py2.6.egg/zope/schema/_bootstrapfields.py", line 138, in validate
    self._validate(value)
  File "/home/stefan/autotest/temp/python26-zope212-cmf22-plone40/eggs/zope.schema-3.5.4-py2.6.egg/zope/schema/_field.py", line 318, in _validate
    raise ConstraintNotSatisfied(value)
ConstraintNotSatisfied

Running zope.testing.testrunner.layer.UnitTests tests:
  Tear down plone.app.portlets.tests.test_configuration.TestPortletZCMLLayer in 0.000 seconds.
  Tear down Products.PloneTestCase.layer.PloneSite in 0.387 seconds.
  Tear down Products.PloneTestCase.layer.ZCML in 0.005 seconds.
  Tear down Testing.ZopeTestCase.layer.ZopeLite in 0.000 seconds.
  Set up zope.testing.testrunner.layer.UnitTests in 0.000 seconds.
  Ran 57 tests with 0 failures and 0 errors in 0.300 seconds.
Tearing down left over layers:
  Tear down zope.testing.testrunner.layer.UnitTests in 0.000 seconds.
Total: 227 tests, 0 failures, 1 errors in 24.713 seconds.
Running zope.testing.testrunner.layer.UnitTests tests:
  Set up zope.testing.testrunner.layer.UnitTests in 0.000 seconds.
  Ran 3 tests with 0 failures and 0 errors in 13.058 seconds.
Tearing down left over layers:
  Tear down zope.testing.testrunner.layer.UnitTests in 0.000 seconds.
Running Products.PloneTestCase.layer.PloneSite tests:
  Set up Testing.ZopeTestCase.layer.ZopeLite in 0.000 seconds.
  Set up Products.PloneTestCase.layer.ZCML in 1.963 seconds.
  Set up Products.PloneTestCase.layer.PloneSite in 4.938 seconds.
  Ran 23 tests with 0 failures and 0 errors in 2.794 seconds.
Running Products.CMFPlacefulWorkflow.tests.test_exportimport.ExportImportLayer tests:
  Set up Products.CMFPlacefulWorkflow.tests.test_exportimport.ExportImportLayer in 0.001 seconds.
  Ran 12 tests with 0 failures and 0 errors in 0.941 seconds.
Tearing down left over layers:
  Tear down Products.CMFPlacefulWorkflow.tests.test_exportimport.ExportImportLayer in 0.000 seconds.
  Tear down Products.PloneTestCase.layer.PloneSite in 0.351 seconds.
  Tear down Products.PloneTestCase.layer.ZCML in 0.004 seconds.
  Tear down Testing.ZopeTestCase.layer.ZopeLite in 0.000 seconds.
Total: 35 tests, 0 failures, 0 errors in 11.444 seconds.
Running Products.CMFTestCase.layer.CMFSite tests:
  Set up Testing.ZopeTestCase.layer.ZopeLite in 0.233 seconds.
  Set up Products.CMFTestCase.layer.ZCML in 0.373 seconds.
  Set up Products.CMFTestCase.layer.CMFSite in 0.211 seconds.
  Ran 58 tests with 0 failures and 0 errors in 0.229 seconds.
Tearing down left over layers:
  Tear down Products.CMFTestCase.layer.CMFSite in 0.025 seconds.
  Tear down Products.CMFTestCase.layer.ZCML in 0.001 seconds.
  Tear down Testing.ZopeTestCase.layer.ZopeLite in 0.000 seconds.
Running zope.testing.testrunner.layer.UnitTests tests:
  Set up zope.testing.testrunner.layer.UnitTests in 0.000 seconds.
  Ran 35 tests with 0 failures and 0 errors in 0.026 seconds.
Tearing down left over layers:
  Tear down zope.testing.testrunner.layer.UnitTests in 0.000 seconds.
Running Products.PloneTestCase.layer.PloneSite tests:
  Set up Testing.ZopeTestCase.layer.ZopeLite in 1.383 seconds.
  Set up Products.PloneTestCase.layer.ZCML in 2.489 seconds.
  Set up Products.PloneTestCase.layer.PloneSite in 3.917 seconds.


Failure in test /home/stefan/autotest/temp/python26-zope212-cmf22-plone40/eggs/Products.PasswordResetTool-2.0b6-py2.6.egg/Products/PasswordResetTool/tests/browser.txt
Failed doctest test for browser.txt
  File "/home/stefan/autotest/temp/python26-zope212-cmf22-plone40/eggs/Products.PasswordResetTool-2.0b6-py2.6.egg/Products/PasswordResetTool/tests/browser.txt", line 0

----------------------------------------------------------------------
File "/home/stefan/autotest/temp/python26-zope212-cmf22-plone40/eggs/Products.PasswordResetTool-2.0b6-py2.6.egg/Products/PasswordResetTool/tests/browser.txt", line 125, in browser.txt
Failed example:
    open('/tmp/test.html', 'w').write(browser.contents)
Exception raised:
    Traceback (most recent call last):
      File "/home/stefan/autotest/temp/python26-zope212-cmf22-plone40/eggs/zope.testing-3.7.7-py2.6.egg/zope/testing/doctest.py", line 1361, in __run
        compileflags, 1) in test.globs
      File "<doctest browser.txt[line 125, example 27]>", line 1, in <module>
        open('/tmp/test.html', 'w').write(browser.contents)
    IOError: [Errno 13] Permission denied: '/tmp/test.html'
----------------------------------------------------------------------
File "/home/stefan/autotest/temp/python26-zope212-cmf22-plone40/eggs/Products.PasswordResetTool-2.0b6-py2.6.egg/Products/PasswordResetTool/tests/browser.txt", line 137, in browser.txt
Failed example:
    open('/tmp/test2.html', 'w').write(browser.contents)
Exception raised:
    Traceback (most recent call last):
      File "/home/stefan/autotest/temp/python26-zope212-cmf22-plone40/eggs/zope.testing-3.7.7-py2.6.egg/zope/testing/doctest.py", line 1361, in __run
        compileflags, 1) in test.globs
      File "<doctest browser.txt[line 137, example 34]>", line 1, in <module>
        open('/tmp/test2.html', 'w').write(browser.contents)
    IOError: [Errno 13] Permission denied: '/tmp/test2.html'

  Ran 38 tests with 1 failures and 0 errors in 4.064 seconds.
Tearing down left over layers:
  Tear down Products.PloneTestCase.layer.PloneSite in 0.346 seconds.
  Tear down Products.PloneTestCase.layer.ZCML in 0.006 seconds.
  Tear down Testing.ZopeTestCase.layer.ZopeLite in 0.000 seconds.
Running Products.PloneTestCase.layer.PloneSite tests:
  Set up Testing.ZopeTestCase.layer.ZopeLite in 1.474 seconds.
  Set up Products.PloneTestCase.layer.ZCML in 2.481 seconds.
  Set up Products.PloneTestCase.layer.PloneSite in 3.949 seconds.
/home/stefan/autotest/temp/python26-zope212-cmf22-plone40/eggs/Products.PlonePAS-4.0b4-py2.6.egg/Products/PlonePAS/tools/membership.py:555: DeprecationWarning: credentialsChanged should be called with 'REQUEST' as second argument. The BBB code will be removed in CMF 2.3.
  self.credentialsChanged(password, REQUEST=REQUEST)
  Ran 61 tests with 0 failures and 0 errors in 1.277 seconds.
Tearing down left over layers:
  Tear down Products.PloneTestCase.layer.PloneSite in 0.356 seconds.
  Tear down Products.PloneTestCase.layer.ZCML in 0.004 seconds.
  Tear down Testing.ZopeTestCase.layer.ZopeLite in 0.000 seconds.
Running Products.PloneTestCase.layer.PloneSite tests:
  Set up Testing.ZopeTestCase.layer.ZopeLite in 1.438 seconds.
  Set up Products.PloneTestCase.layer.ZCML in 2.488 seconds.
  Set up Products.PloneTestCase.layer.PloneSite in 4.060 seconds.
  Ran 245 tests with 0 failures and 0 errors in 17.721 seconds.
Running zope.testing.testrunner.layer.UnitTests tests:
  Tear down Products.PloneTestCase.layer.PloneSite in 0.362 seconds.
  Tear down Products.PloneTestCase.layer.ZCML in 0.005 seconds.
  Tear down Testing.ZopeTestCase.layer.ZopeLite in 0.000 seconds.
  Set up zope.testing.testrunner.layer.UnitTests in 0.000 seconds.
  Ran 59 tests with 0 failures and 0 errors in 0.013 seconds.
Tearing down left over layers:
  Tear down zope.testing.testrunner.layer.UnitTests in 0.000 seconds.
Total: 304 tests, 0 failures, 0 errors in 26.520 seconds.
Running Products.PloneTestCase.layer.PloneSite tests:
  Set up Testing.ZopeTestCase.layer.ZopeLite in 1.421 seconds.
  Set up Products.PloneTestCase.layer.ZCML in 2.471 seconds.
  Set up Products.PloneTestCase.layer.PloneSite in 3.938 seconds.
  Ran 78 tests with 0 failures and 0 errors in 3.013 seconds.
Tearing down left over layers:
  Tear down Products.PloneTestCase.layer.PloneSite in 0.346 seconds.
  Tear down Products.PloneTestCase.layer.ZCML in 0.007 seconds.
  Tear down Testing.ZopeTestCase.layer.ZopeLite in 0.000 seconds.
Running zope.testing.testrunner.layer.UnitTests tests:
  Set up zope.testing.testrunner.layer.UnitTests in 0.000 seconds.
  Ran 76 tests with 0 failures and 0 errors in 1.536 seconds.
Tearing down left over layers:
  Tear down zope.testing.testrunner.layer.UnitTests in 0.000 seconds.
Running Products.contentmigration.tests.layer.TestLayer tests:
  Set up Testing.ZopeTestCase.layer.ZopeLite in 1.407 seconds.
  Set up Products.PloneTestCase.layer.ZCML in 2.500 seconds.
  Set up Products.PloneTestCase.layer.PloneSite in 4.102 seconds.
  Set up Products.contentmigration.tests.layer.TestLayer in 0.002 seconds.
  Ran 18 tests with 0 failures and 0 errors in 4.939 seconds.
Tearing down left over layers:
  Tear down Products.contentmigration.tests.layer.TestLayer in 0.000 seconds.
  Tear down Products.PloneTestCase.layer.PloneSite in 0.344 seconds.
  Tear down Products.PloneTestCase.layer.ZCML in 0.004 seconds.
  Tear down Testing.ZopeTestCase.layer.ZopeLite in 0.000 seconds.
Total: 0 tests, 0 failures, 0 errors in 0.000 seconds.
Running archetypes.referencebrowserwidget.tests.base.layer tests:
  Set up Testing.ZopeTestCase.layer.ZopeLite in 0.000 seconds.
  Set up Products.PloneTestCase.layer.ZCML in 1.896 seconds.
  Set up Products.PloneTestCase.layer.PloneSite in 4.139 seconds.
  Set up archetypes.referencebrowserwidget.tests.base.layer in 0.000 seconds.
  Ran 43 tests with 0 failures and 0 errors in 7.810 seconds.
Running zope.testing.testrunner.layer.UnitTests tests:
  Tear down archetypes.referencebrowserwidget.tests.base.layer in 0.000 seconds.
  Tear down Products.PloneTestCase.layer.PloneSite in 0.356 seconds.
  Tear down Products.PloneTestCase.layer.ZCML in 0.007 seconds.
  Tear down Testing.ZopeTestCase.layer.ZopeLite in 0.000 seconds.
  Set up zope.testing.testrunner.layer.UnitTests in 0.000 seconds.
  Ran 4 tests with 0 failures and 0 errors in 0.001 seconds.
Tearing down left over layers:
  Tear down zope.testing.testrunner.layer.UnitTests in 0.000 seconds.
Total: 47 tests, 0 failures, 0 errors in 14.675 seconds.
Running archetypes.schemaextender.tests.testIntegration.layer tests:
  Set up Testing.ZopeTestCase.layer.ZopeLite in 1.326 seconds.
  Set up Products.PloneTestCase.layer.ZCML in 2.482 seconds.
  Set up Products.PloneTestCase.layer.PloneSite in 3.921 seconds.
  Set up archetypes.schemaextender.tests.testIntegration.layer in 0.000 seconds.
  Ran 17 tests with 0 failures and 0 errors in 3.001 seconds.
Running zope.testing.testrunner.layer.UnitTests tests:
  Tear down archetypes.schemaextender.tests.testIntegration.layer in 0.000 seconds.
  Tear down Products.PloneTestCase.layer.PloneSite in 0.348 seconds.
  Tear down Products.PloneTestCase.layer.ZCML in 0.007 seconds.
  Tear down Testing.ZopeTestCase.layer.ZopeLite in 0.000 seconds.
  Set up zope.testing.testrunner.layer.UnitTests in 0.000 seconds.
  Ran 19 tests with 0 failures and 0 errors in 0.006 seconds.
Tearing down left over layers:
  Tear down zope.testing.testrunner.layer.UnitTests in 0.000 seconds.
Total: 36 tests, 0 failures, 0 errors in 11.530 seconds.
Running zope.testing.testrunner.layer.UnitTests tests:
  Set up zope.testing.testrunner.layer.UnitTests in 0.000 seconds.
  Ran 4 tests with 0 failures and 0 errors in 0.039 seconds.
Tearing down left over layers:
  Tear down zope.testing.testrunner.layer.UnitTests in 0.000 seconds.
Running Testing.ZopeTestCase.layer.ZopeLite tests:
  Set up Testing.ZopeTestCase.layer.ZopeLite in 0.067 seconds.
  Ran 40 tests with 0 failures and 0 errors in 0.778 seconds.
Tearing down left over layers:
  Tear down Testing.ZopeTestCase.layer.ZopeLite in 0.000 seconds.
Running Testing.ZopeTestCase.layer.ZopeLite tests:
  Set up Testing.ZopeTestCase.layer.ZopeLite in 0.034 seconds.
  Ran 40 tests with 0 failures and 0 errors in 1.013 seconds.
Running zope.testing.testrunner.layer.UnitTests tests:
  Tear down Testing.ZopeTestCase.layer.ZopeLite in 0.000 seconds.
  Set up zope.testing.testrunner.layer.UnitTests in 0.000 seconds.
  Ran 1 tests with 0 failures and 0 errors in 0.100 seconds.
Tearing down left over layers:
  Tear down zope.testing.testrunner.layer.UnitTests in 0.000 seconds.
Total: 41 tests, 0 failures, 0 errors in 1.327 seconds.
/home/stefan/autotest/temp/python26-zope212-cmf22-plone40/src/kss.core/kss/core/tests/test_kssview_core.py:165: UserWarning: The test_class you are using doesn't subclass from ZopeTestCase.Functional. Please fix that.
  tearDown=KSSViewTestCase.beforeTearDown.im_func))
Running Testing.ZopeTestCase.layer.ZopeLite tests:
  Set up Testing.ZopeTestCase.layer.ZopeLite in 0.046 seconds.
  Ran 1 tests with 0 failures and 0 errors in 0.265 seconds.
Running kss.core.tests.base.KSSLayer tests:
  Tear down Testing.ZopeTestCase.layer.ZopeLite in 0.000 seconds.
  Set up kss.core.tests.base.KSSCoreLayer in 0.031 seconds.
  Set up kss.core.tests.base.KSSLayer in 0.057 seconds.
  Ran 29 tests with 0 failures and 0 errors in 0.154 seconds.
Running kss.core.tests.test_ttwapi.layer tests:
  Set up kss.core.tests.test_ttwapi.layer in 0.001 seconds.
  Ran 3 tests with 0 failures and 0 errors in 0.026 seconds.
Running zope.testing.testrunner.layer.UnitTests tests:
  Tear down kss.core.tests.test_ttwapi.layer in 0.000 seconds.
  Tear down kss.core.tests.base.KSSLayer in 0.000 seconds.
  Tear down kss.core.tests.base.KSSCoreLayer in 0.000 seconds.
  Set up zope.testing.testrunner.layer.UnitTests in 0.000 seconds.
/home/stefan/autotest/temp/python26-zope212-cmf22-plone40/src/kss.core/kss/core/siteview.txt:1: DeprecationWarning: ISite is deprecated. Moved to zope.location.interfaces. Importing from here will stop working in Zope 3.6
  =========
  Ran 14 tests with 0 failures and 0 errors in 0.009 seconds.
Tearing down left over layers:
  Tear down zope.testing.testrunner.layer.UnitTests in 0.000 seconds.
Total: 47 tests, 0 failures, 0 errors in 0.902 seconds.
***********************************************
WARNING: LinguaPlone not found. Skipping tests.
***********************************************
***********************************************
WARNING: LinguaPlone not found. Skipping tests.
***********************************************
Running plone.app.blob.tests.layer.BlobLayer tests:
  Set up Testing.ZopeTestCase.layer.ZopeLite in 0.922 seconds.
  Set up Products.PloneTestCase.layer.ZCML in 2.454 seconds.
  Set up Products.PloneTestCase.layer.PloneSite in 3.905 seconds.
  Set up plone.app.blob.tests.layer.BlobLayer in 0.097 seconds.
/home/stefan/autotest/temp/python26-zope212-cmf22-plone40/eggs/Products.PortalTransforms-2.0b3-py2.6.egg/Products/PortalTransforms/libtransforms/commandtransform.py:97: DeprecationWarning: os.popen4 is deprecated.  Use the subprocess module.
  cin, couterr = os.popen4(command, 'b')
  Ran 29 tests with 0 failures and 0 errors in 7.552 seconds.
Running plone.app.blob.tests.layer.BlobReplacementLayer tests:
  Set up plone.app.blob.tests.layer.BlobReplacementLayer in 0.197 seconds.
  Ran 45 tests with 0 failures and 0 errors in 12.231 seconds.
Running zope.testing.testrunner.layer.UnitTests tests:
  Tear down plone.app.blob.tests.layer.BlobReplacementLayer in 0.000 seconds.
  Tear down plone.app.blob.tests.layer.BlobLayer in 0.000 seconds.
  Tear down Products.PloneTestCase.layer.PloneSite in 0.342 seconds.
  Tear down Products.PloneTestCase.layer.ZCML in 0.009 seconds.
  Tear down Testing.ZopeTestCase.layer.ZopeLite in 0.000 seconds.
  Set up zope.testing.testrunner.layer.UnitTests in 0.000 seconds.
  Ran 2 tests with 0 failures and 0 errors in 0.001 seconds.
Tearing down left over layers:
  Tear down zope.testing.testrunner.layer.UnitTests in 0.000 seconds.
Total: 76 tests, 0 failures, 0 errors in 28.463 seconds.
Running Testing.ZopeTestCase.layer.ZopeLite tests:
  Set up Testing.ZopeTestCase.layer.ZopeLite in 0.927 seconds.
  Ran 2 tests with 0 failures and 0 errors in 0.008 seconds.
Running plone.app.folder.tests.layer.IntegrationLayer tests:
  Set up Products.PloneTestCase.layer.ZCML in 2.454 seconds.
  Set up Products.PloneTestCase.layer.PloneSite in 3.842 seconds.
  Set up plone.app.folder.tests.layer.IntegrationLayer in 0.093 seconds.
  Ran 22 tests with 0 failures and 0 errors in 5.151 seconds.
Running plone.app.folder.tests.layer.PartialOrderingIntegrationLayer tests:
  Set up plone.app.folder.tests.layer.PartialOrderingIntegrationLayer in 0.000 seconds.
  Ran 3 tests with 0 failures and 0 errors in 0.322 seconds.
Tearing down left over layers:
  Tear down plone.app.folder.tests.layer.PartialOrderingIntegrationLayer in 0.000 seconds.
  Tear down plone.app.folder.tests.layer.IntegrationLayer in 0.000 seconds.
  Tear down Products.PloneTestCase.layer.PloneSite in 0.349 seconds.
  Tear down Products.PloneTestCase.layer.ZCML in 0.004 seconds.
  Tear down Testing.ZopeTestCase.layer.ZopeLite in 0.000 seconds.
Total: 27 tests, 0 failures, 0 errors in 13.735 seconds.
Running plone.app.imaging.tests.layer.ImagingLayer tests:
  Set up Testing.ZopeTestCase.layer.ZopeLite in 0.952 seconds.
  Set up Products.PloneTestCase.layer.ZCML in 3.039 seconds.
  Set up Products.PloneTestCase.layer.PloneSite in 3.925 seconds.
  Set up plone.app.imaging.tests.layer.ImagingLayer in 0.095 seconds.
  Ran 37 tests with 0 failures and 0 errors in 4.120 seconds.
Running zope.testing.testrunner.layer.UnitTests tests:
  Tear down plone.app.imaging.tests.layer.ImagingLayer in 0.000 seconds.
  Tear down Products.PloneTestCase.layer.PloneSite in 0.377 seconds.
  Tear down Products.PloneTestCase.layer.ZCML in 0.005 seconds.
  Tear down Testing.ZopeTestCase.layer.ZopeLite in 0.000 seconds.
  Set up zope.testing.testrunner.layer.UnitTests in 0.000 seconds.
  Ran 7 tests with 0 failures and 0 errors in 0.001 seconds.
Tearing down left over layers:
  Tear down zope.testing.testrunner.layer.UnitTests in 0.000 seconds.
Total: 44 tests, 0 failures, 0 errors in 12.999 seconds.
Running Products.PloneTestCase.layer.PloneSite tests:
  Set up Testing.ZopeTestCase.layer.ZopeLite in 1.459 seconds.
  Set up Products.PloneTestCase.layer.ZCML in 2.504 seconds.
  Set up Products.PloneTestCase.layer.PloneSite in 3.937 seconds.
  Ran 9 tests with 0 failures and 0 errors in 0.130 seconds.
Tearing down left over layers:
  Tear down Products.PloneTestCase.layer.PloneSite in 0.344 seconds.
  Tear down Products.PloneTestCase.layer.ZCML in 0.004 seconds.
  Tear down Testing.ZopeTestCase.layer.ZopeLite in 0.000 seconds.
Total: 0 tests, 0 failures, 0 errors in 0.000 seconds.
Running Products.PloneTestCase.layer.PloneSite tests:
  Set up Testing.ZopeTestCase.layer.ZopeLite in 1.446 seconds.
  Set up Products.PloneTestCase.layer.ZCML in 2.434 seconds.
  Set up Products.PloneTestCase.layer.PloneSite in 3.943 seconds.
  Ran 3 tests with 0 failures and 0 errors in 0.696 seconds.
Tearing down left over layers:
  Tear down Products.PloneTestCase.layer.PloneSite in 0.344 seconds.
  Tear down Products.PloneTestCase.layer.ZCML in 0.004 seconds.
  Tear down Testing.ZopeTestCase.layer.ZopeLite in 0.000 seconds.
Running Products.PloneTestCase.layer.PloneSite tests:
  Set up Testing.ZopeTestCase.layer.ZopeLite in 1.385 seconds.
  Set up Products.PloneTestCase.layer.ZCML in 2.493 seconds.
  Set up Products.PloneTestCase.layer.PloneSite in 3.901 seconds.
  Ran 38 tests with 0 failures and 0 errors in 8.047 seconds.
Tearing down left over layers:
  Tear down Products.PloneTestCase.layer.PloneSite in 0.346 seconds.
  Tear down Products.PloneTestCase.layer.ZCML in 0.006 seconds.
  Tear down Testing.ZopeTestCase.layer.ZopeLite in 0.000 seconds.
Running plone.folder.tests.layer.PloneFolderLayer tests:
  Set up plone.folder.tests.layer.PloneFolderLayer in 0.007 seconds.
  Ran 70 tests with 0 failures and 0 errors in 5.538 seconds.
Tearing down left over layers:
  Tear down plone.folder.tests.layer.PloneFolderLayer in 0.000 seconds.
Running Products.PloneTestCase.layer.PloneSite tests:
  Set up Testing.ZopeTestCase.layer.ZopeLite in 1.427 seconds.
  Set up Products.PloneTestCase.layer.ZCML in 2.466 seconds.
  Set up Products.PloneTestCase.layer.PloneSite in 4.270 seconds.
  Ran 41 tests with 0 failures and 0 errors in 0.376 seconds.
Tearing down left over layers:
  Tear down Products.PloneTestCase.layer.PloneSite in 0.342 seconds.
  Tear down Products.PloneTestCase.layer.ZCML in 0.004 seconds.
  Tear down Testing.ZopeTestCase.layer.ZopeLite in 0.000 seconds.
Total: 0 tests, 0 failures, 0 errors in 0.000 seconds.
Total: 0 tests, 0 failures, 0 errors in 0.000 seconds.
Running Products.PloneTestCase.layer.ZCML tests:
  Set up Testing.ZopeTestCase.layer.ZopeLite in 0.935 seconds.
  Set up Products.PloneTestCase.layer.ZCML in 2.465 seconds.
/home/stefan/autotest/temp/python26-zope212-cmf22-plone40/eggs/wicked-1.1.8alpha1-py2.6.egg/wicked/cache.py:34: DeprecationWarning: object.__init__() takes no parameters
  super(CacheStore, self).__init__(self)
  Ran 16 tests with 0 failures and 0 errors in 0.047 seconds.
Running wicked.at.tests.wickedtestcase.WickedSite tests:
  Set up Products.PloneTestCase.layer.PloneSite in 4.680 seconds.
  Set up wicked.at.tests.wickedtestcase.WickedSite in 0.002 seconds.
/home/stefan/autotest/temp/python26-zope212-cmf22-plone40/eggs/Zope2-2.12.3-py2.6-linux-x86_64.egg/OFS/subscribers.py:73: DeprecationWarning: wicked.atcontent.ironicwiki.IronicWiki.manage_afterAdd is discouraged. You should use event subscribers instead.
  DeprecationWarning)
/home/stefan/autotest/temp/python26-zope212-cmf22-plone40/eggs/Zope2-2.12.3-py2.6-linux-x86_64.egg/OFS/subscribers.py:73: DeprecationWarning: wicked.atcontent.ironicwiki.IronicWiki.manage_beforeDelete is discouraged. You should use event subscribers instead.
  DeprecationWarning)
/home/stefan/autotest/temp/python26-zope212-cmf22-plone40/eggs/Zope2-2.12.3-py2.6-linux-x86_64.egg/OFS/subscribers.py:73: DeprecationWarning: wicked.atcontent.ironicwiki.IronicWiki.manage_afterClone is discouraged. You should use event subscribers instead.
  DeprecationWarning)
  Ran 23 tests with 0 failures and 0 errors in 5.868 seconds.
Running wicked.at.tests.test_scope.Scoped tests:
  Set up wicked.at.tests.test_scope.Scoped in 0.001 seconds.
  Ran 3 tests with 0 failures and 0 errors in 0.637 seconds.
Running wicked.plone.tests.SelectiveATCT tests:
  Tear down wicked.at.tests.test_scope.Scoped in 0.000 seconds.
  Tear down wicked.at.tests.wickedtestcase.WickedSite in 0.002 seconds.
  Set up wicked.plone.tests.SelectiveATCT in 0.003 seconds.
  Ran 22 tests with 0 failures and 0 errors in 6.057 seconds.
Running wicked.plone.tests.ZCMLLayer tests:
  Tear down wicked.plone.tests.SelectiveATCT in 0.004 seconds.
  Set up wicked.plone.tests.ZCMLLayer in 0.020 seconds.
  Ran 8 tests with 0 failures and 0 errors in 0.732 seconds.
Running zope.testing.testrunner.layer.UnitTests tests:
  Tear down wicked.plone.tests.ZCMLLayer in 0.376 seconds.
  Tear down Products.PloneTestCase.layer.PloneSite in 0.001 seconds.
  Tear down Products.PloneTestCase.layer.ZCML in 0.004 seconds.
  Tear down Testing.ZopeTestCase.layer.ZopeLite in 0.000 seconds.
  Set up zope.testing.testrunner.layer.UnitTests in 0.000 seconds.
  Ran 34 tests with 0 failures and 0 errors in 0.016 seconds.
Tearing down left over layers:
  Tear down zope.testing.testrunner.layer.UnitTests in 0.000 seconds.
Total: 106 tests, 0 failures, 0 errors in 23.114 seconds.
#### Running tests for group ATCT ####
#### Finished tests for group ATCT ####

#### Running tests for group Archetypes ####
#### Finished tests for group Archetypes ####

#### Running tests for group CMF ####
#### Finished tests for group CMF ####

#### Running tests for group CMFEditions ####
#### Finished tests for group CMFEditions ####

#### Running tests for group Plone ####
#### Finished tests for group Plone ####

#### Running tests for group PlonePAS ####
#### Finished tests for group PlonePAS ####

#### Running tests for group plone ####
#### Finished tests for group plone ####

#### Running tests for group portlets ####
#### Finished tests for group portlets ####

#### Running tests for group z3c.autoinclude ####
#### Finished tests for group z3c.autoinclude ####

#### Running tests for Products.CMFPlacefulWorkflow ####
#### Finished tests for Products.CMFPlacefulWorkflow ####

#### Running tests for Products.CMFTestCase ####
#### Finished tests for Products.CMFTestCase ####

#### Running tests for Products.ExtendedPathIndex ####
#### Finished tests for Products.ExtendedPathIndex ####

#### Running tests for Products.PasswordResetTool ####
#### Finished tests for Products.PasswordResetTool ####

#### Running tests for Products.PloneTestCase ####
#### Finished tests for Products.PloneTestCase ####

#### Running tests for Products.ResourceRegistries ####
#### Finished tests for Products.ResourceRegistries ####

#### Running tests for Products.TinyMCE ####
#### Finished tests for Products.TinyMCE ####

#### Running tests for Products.ZopeVersionControl ####
#### Finished tests for Products.ZopeVersionControl ####

#### Running tests for Products.contentmigration ####
#### Finished tests for Products.contentmigration ####

#### Running tests for Products.i18ntestcase ####
#### Finished tests for Products.i18ntestcase ####

#### Running tests for archetypes.referencebrowserwidget ####
#### Finished tests for archetypes.referencebrowserwidget ####

#### Running tests for archetypes.schemaextender ####
#### Finished tests for archetypes.schemaextender ####

#### Running tests for collective.monkeypatcher ####
#### Finished tests for collective.monkeypatcher ####

#### Running tests for five.customerize ####
#### Finished tests for five.customerize ####

#### Running tests for five.formlib ####
#### Finished tests for five.formlib ####

#### Running tests for kss.core ####
#### Finished tests for kss.core ####

#### Running tests for plone.app.blob ####
#### Finished tests for plone.app.blob ####

#### Running tests for plone.app.folder ####
#### Finished tests for plone.app.folder ####

#### Running tests for plone.app.imaging ####
#### Finished tests for plone.app.imaging ####

#### Running tests for plone.app.jquerytools ####
#### Finished tests for plone.app.jquerytools ####

#### Running tests for plone.app.locales ####
#### Finished tests for plone.app.locales ####

#### Running tests for plone.app.openid ####
#### Finished tests for plone.app.openid ####

#### Running tests for plone.app.users ####
#### Finished tests for plone.app.users ####

#### Running tests for plone.folder ####
#### Finished tests for plone.folder ####

#### Running tests for plone.stringinterp ####
#### Finished tests for plone.stringinterp ####

#### Running tests for plonetheme.classic ####
#### Finished tests for plonetheme.classic ####

#### Running tests for plonetheme.sunburst ####
#### Finished tests for plonetheme.sunburst ####

#### Running tests for wicked ####
#### Finished tests for wicked ####

Packages with test failures:

Failing tests in group Archetypes
Failing tests in group Plone
Failing tests in group portlets
Failing tests in Products.PasswordResetTool

Total time elapsed: 916.257 seconds

Grand total: 90 packages, 4 failures


FAILED (90 packages, 4 failures)




More information about the Testbot mailing list