[Testbot] FAILED (90 packages, 4 failures) : Plone-4.0 Zope-2.12 Python-2.6.4

Plone Tests plone-tests at epy.co.at
Thu Feb 18 02:39:55 UTC 2010


Plone Tests : FAILED (90 packages, 4 failures)
Plone-4.0 Zope-2.12 Python-2.6.4

Running ./bin/alltests -q --no-color --no-progress
Running Products.CMFTestCase.layer.CMFSite tests:
  Set up Testing.ZopeTestCase.layer.ZopeLite in 1.134 seconds.
  Set up Products.CMFTestCase.layer.ZCML in 3.006 seconds.
  Set up Products.CMFTestCase.layer.CMFSite in 1.455 seconds.
  Ran 31 tests with 0 failures and 0 errors in 0.586 seconds.
Running Products.PloneTestCase.layer.PloneSite tests:
  Tear down Products.CMFTestCase.layer.CMFSite in 0.069 seconds.
  Tear down Products.CMFTestCase.layer.ZCML in 0.004 seconds.
  Set up Products.PloneTestCase.layer.ZCML in 1.748 seconds.
  Set up Products.PloneTestCase.layer.PloneSite in 3.630 seconds.
  Ran 712 tests with 0 failures and 0 errors in 1 minutes 10.212 seconds.
Tearing down left over layers:
  Tear down Products.PloneTestCase.layer.PloneSite in 0.372 seconds.
  Tear down Products.PloneTestCase.layer.ZCML in 0.010 seconds.
  Tear down Testing.ZopeTestCase.layer.ZopeLite in 0.000 seconds.
Total: 743 tests, 0 failures, 0 errors in 1 minutes 22.731 seconds.
Running Testing.ZopeTestCase.layer.ZopeLite tests:
  Set up Testing.ZopeTestCase.layer.ZopeLite in 0.824 seconds.
  Ran 36 tests with 0 failures and 0 errors in 0.082 seconds.
Running Products.Archetypes.tests.layer.ZCML tests:
  Set up Products.CMFCore.testing.FunctionalZCMLLayer in 0.192 seconds.
  Set up Products.Archetypes.tests.layer.ZCML in 0.180 seconds.
  Ran 59 tests with 0 failures and 0 errors in 1.157 seconds.
Running Products.Archetypes.tests.layer.ArchetypesSite tests:
  Set up Products.Archetypes.tests.layer.ArchetypesSite in 1.432 seconds.
/home/stefan/autotest/temp/python26-zope212-cmf22-plone40/eggs/Zope2-2.12.3-py2.6-linux-x86_64.egg/OFS/subscribers.py:73: DeprecationWarning: Products.Archetypes.tests.test_classgen.Dummy.manage_afterAdd is discouraged. You should use event subscribers instead.
  DeprecationWarning)
/home/stefan/autotest/temp/python26-zope212-cmf22-plone40/eggs/Zope2-2.12.3-py2.6-linux-x86_64.egg/OFS/subscribers.py:73: DeprecationWarning: Products.Archetypes.tests.test_annotation.AnnDummy.manage_afterAdd is discouraged. You should use event subscribers instead.
  DeprecationWarning)
/home/stefan/autotest/temp/python26-zope212-cmf22-plone40/eggs/Zope2-2.12.3-py2.6-linux-x86_64.egg/OFS/subscribers.py:73: DeprecationWarning: Products.Archetypes.tests.test_event.Dummy.manage_afterAdd is discouraged. You should use event subscribers instead.
  DeprecationWarning)


Failure in test testSame (Products.PortalTransforms.tests.test_transforms.TransformTestSubclass)
Traceback (most recent call last):
  File "/usr/local/python2.6/lib/python2.6/unittest.py", line 279, in run
    testMethod()
  File "/home/stefan/autotest/temp/python26-zope212-cmf22-plone40/eggs/Products.PortalTransforms-2.0b2-py2.6.egg/Products/PortalTransforms/tests/test_transforms.py", line 68, in testSame
    self.do_convert(filename=self.input)
  File "/home/stefan/autotest/temp/python26-zope212-cmf22-plone40/eggs/Products.PortalTransforms-2.0b2-py2.6.egg/Products/PortalTransforms/tests/test_transforms.py", line 60, in do_convert
    got, expected, self.transform.name(), self.input))
  File "/usr/local/python2.6/lib/python2.6/unittest.py", line 350, in failUnlessEqual
    (msg or '%r != %r' % (first, second))
AssertionError: [BM®      6   (               x                ÿÿÿûùøþýùÿÿûÿÿøóñéóòèÿÿöòòæîîâÞÜÒØÕÍÖÒÍìèãøóðÿýùÿÿþíîìÿÿþÿÿþóôòÿÿþüýûüýûÿýüÿÿþÿüøòïêúøðÿÿù÷öìÕÔÊ×ÖÌåäÚôòêìêâëèãàÝØÖÓÏÆÂÁâàßÿÿþîïíúûùÿÿþòóñûüúþÿýüø÷ùöòÿÿûÿÿûöôìÐÎÆÏÎÄêéßæåÛÛÚÐÛÙÑÈƾØÕÐØÕÑñíìôòñåãâÉÊÈýþüÿÿþïðîÿÿþúûùõöôÿú÷ÿÿüúöñáÝØàÝÕñïåèçÝÌËÁõôêíìâÿýõÿÿ÷ÿÿûéæâÛ×ÖËÉÈÍËÊïðîÏÐÎãäâÿÿþóôòüýûüýûÿÿüöñîðìçîëãÝÚÒÎÌÂãâØÿÿøçæÜÞÝÓåãÛñïçÿÿüÿþúÿÿþÿÿþòóñÉÊÈßàÞÚÛÙ×ØÖüýûÿÿþÿÿþÿÿüùôñáÝØÑÎÆßÜÔüúðÿÿöööêèçÝëêàßÝÕÜÚÒÝÜØø÷óÿÿþÿÿÿóôòùúøÓÔÒÑÒÐäåãæçåúûùÿÿþÿýøíéäÝÙÔáÞÖïìä÷õíúøðùúñÐÑÈíîåéçßãàÛÛØÓÿÿûÿÿüú÷óÿÿüòóïëìèßàÜÛÜØéêæóôðûüøÿüó×ÒÉîëãÑÎÆÿýøÿÿüüýùøù÷ÞßÝàáÝàßÛíêåÕÓËÿÿøöñèÿÿõþüôÿÿùÿÿùÄżëìãÊËÂÿÿûÿÿùùóèÜØÍêåÜÝÛÓÿýøÿÿûÿÿþøúú¼¾¾ßàÞåäàÙÙÓÜÙÑþüòÿüñÿÿ÷ÿÿ÷ÿÿøö÷í÷øîâãÙàá×âãÚýþõéãÖåáÖâÝÔðîæÿþùýüøÿÿþüýûÿÿþö÷õâáÝììæÿÿùçåÛ×ÐÇÓÎÅÞÝÓüýóÿÿøÿÿøÂúòóêÜÝÔüýôÜÖÉíêÜØÖËÿÿöÿÿøúúôÿÿüýþüýþüòóñîíéÿÿüÿÿûÏÌÄâÜÕïéâÛÚÐàá×ÿÿøôõëÅƽñòéáâÙúûò×ÔÅïìÞÔÒÇÿÿøÿÿøùùóÿÿüÿÿûÿÿþÿÿþÿÿþÿÿûÑÌÉÒÎÉùóîãßÚýûóÉÊÀ÷øïýþõåæÝèéàÏÏÉýý÷ÝÚËêéÛÓÒÄÿÿöÿÿ÷ûùñÿÿûÿþúÿýüòðïõñðÿþýäßÜïêçüõòÜ×ÔäâÚØÙÏÿÿ÷ÿÿù×ØÏæçÞÈÈÂÿÿûæå×åäÖÔÓÅøøìÿÿöüúòÿÿûÿýøÿÿüøõñÿÿþÿÿþüø÷ÔÐÏËÆÅÛÖÕÐÍÈö÷îÿÿùúûòÃýêêäÕÕÏÿÿûîìááàÒÕÕÉððäÿÿöýüòÿþöÿü÷æãßÖÓÏØÔÓ¸´³ÿÿþÿÿþðêëû÷öÿÿûÿÿùûüóæçÞÛÛÕîîèÚÚÔýý÷ÿÿøÌÌÀüûñ¾½³ýüòúùïÿÿùÿþöÎÊÅùõðâßÛìéåÉÅÄÿÿþÿúûþúùÿÿüööðÿÿûËËÅîîèÍÍÇÿÿüúùõðîæòðèáß×åãÛø÷íÿÿöîëãõòêàÝÕîêåÛ×ÒñîêÜÙÕÿþýöòñÿûúÿÿüèèâÿÿûÆÆÀììæààÚýüøÿÿûÿÿüÿÿûÍÊÅòïêÊÇ¿æãÛÿÿøúõìËƽñîæòïçåáÜÓÐËÿüøÿÿüÿÿüøøòüüöÇÇÁééãÞÝÙòñíÿÿûÿÿüøööÿÿÿóïîÇÄÀÿÿûÄÁ¹úõìñìãøóêÍÈ¿º¸®ÛØÐýûóÿÿûþþøÿÿûööðÍÍÇççáÔÔÎõôðÿþú÷öòÿÿüþýÿþýÿæãåÿþÿÆÁ¾îêåäÞ×äÝÔêäÙÿÿöÿÿ÷ÿÿøýüòö÷îéêáËÍÇ××ÑéèäÈÇÃýüø÷öòûúöÿÿþþüûÿüÿÿýÿÿûÿðíïîéèñíèÒÊÃîèÝëåÚËȺÀ½¯ÌÌÀÚÚÎÓÔÊÝáÖóöíããÝÍÌÈÿÿüäãßÿÿüûúöýûúÿýü÷öÿòïøÿýÿÿýÿý÷øÿÿüìäÝßÙÎÚÔÉõòäÿüîòòäßßÑßáÕ×ÛÏÐÔÉççáûúöñðìÿÿüþýùüû÷ÿÿþûùøýüÿýüÿü÷ÿõñöÿþÿÿüùÿýöÿþóý÷ìéæØÌɺÏÐÀÕÕÇìñâíñåïõêýý÷ÿÿûÿÿüúùõúùõÿÿüÿþýþüû]

!=

[BM®      6   (               x                ÿÿþûùøÿüûÿÿüÿÿúóñéóòèÿÿöòòæîíãÞÜÒØÕÍÖÓËìèãøóðÿüùÿÿþíîìÿÿþÿÿþóôòÿÿþüýûüýûÿýüÿÿþÿüøòïêúøðÿÿù÷öìÕÔÊ×ÖÌåäÚôóéìêâëèãáÜÙ×ÒÏÇ¿àáßÿÿþîïíúûùÿÿþòóñûüúþÿýüø÷ùöòÿÿüÿÿûöôìÐÏÅÏÎÄêéßæåÛÛÚÐÛÙÑÈƾØÕÐØÕÑñíìöòñãäâÉÊÈýþüÿÿþïðîÿÿþúûùõöôÿú÷ÿÿüúöñáÝØàÝÕðïåèçÝÌÌÀõôêíìâÿýõÿþùÿÿûéæâÛ×ÖÍÉÈËÌÊïðîÏÐÎãäâÿÿþóôòüýûüýûÿÿüöñîðìçîëãÝÚÒÎÌÂãâØÿÿ÷çæÜÞÝÓåãÛñîéÿÿüÿýüÿÿþÿÿÿòóñÉÊÈßàÞÚÛÙ×ØÖüýûÿÿþÿÿþÿÿüùõðáÝØÑÎÆßÜÔüúðÿÿ÷ööêèçÝëêàßÝÕÜÙÔÝÜØøöõÿÿþÿÿÿóôòùúøÓÔÒÑÒÐäåãæçåúûùÿÿþÿüùíéäÝÙÔáÞÖïíãøöìûùïûûïÒÑÇïîäéçßãàÛÙØÔÿÿþÿÿþøööÿÿþòóñëìêßàÞÛÜÚéêèóôòûüúÿýòÙÓÈðëâÑÎÆÿýùÿÿþüýûöøøÜÞÞàáßÞßÛíêåÖÓËÿÿ÷øòçÿÿòüýóÿÿøÿÿøÄÅ»ëìâÊËÁÿÿùÿÿ÷ùóèÞØÍêåÜÞÛÓÿýøÿÿûÿÿþøúú¼¾¾ßàÞåäàÛØÓÜÙÑÿûòÿüñÿÿ÷ÿÿ÷ÿÿøö÷í÷øîâãÙàá×âãÚýþõéãÖçáÖâÞÓñîæÿþùýüøÿÿþúýûýÿÿö÷õâàßîëçÿÿûéãÜ×ÐÇÕÏÄÜÝÓüýóÿÿøÿÿøÂùòóêÜÝÔüýôÜÖÉíêÜÚÖËÿÿöÿÿøúúôÿÿüýþüýþüòóñîìëÿÿüÿÿûÑËÆâÜÕñéâÙÚÐàá×ÿÿøôõëÅƽñòéáâÙúûò×ÔÅïìÞÔÓÅÿÿ÷ÿÿøùùóÿÿüþÿûÿÿþÿÿþÿÿþÿþýÑÌÉÒÍÊùóîåßÚûüòÉÊÀ÷øîýþõåæÝèéàÏÐÇýý÷ÝÚËìéÚÓÒÄÿÿöÿÿ÷ùúñÿÿûÿþúÿþúòðïóñðÿþýäßÞïêçüõòÞ×ÔâãÙØÙÏÿÿ÷ÿÿù×ØÏæçÞÈÈÂÿÿûææÖåäÖÔÓÅøøìÿÿöüûñÿÿùþþøÿÿüöõñÿÿþÿÿþüø÷ÕÐÏËÆÅÛÖÕÎÏÆö÷îÿÿùúûòÃÄ»êêäÕÕÏÿÿûîíßáàÒÕÕÇððäÿÿõýüòÿþöÿü÷æãÞÖÓÏØÕѸ´³ÿÿþÿÿþðêëüö÷ÿÿùÿÿùûüóæçÞÛÛÕîîèÚÚÔýý÷ÿÿ÷ÌÌÀüüð¾¾²ýüòúùïÿÿùÿþöÎÊÅùõðâßÛìéåÉÅÄÿÿþÿúûþùúÿÿùö÷îÿÿûËËÅîîèÍÍÇÿÿûúùõîïæðñèáàÖåäÚø÷íÿÿöîìâõòêàÝÕîëãÛ×ÒñîêÜÙÕÿþýôòñýûúÿÿûèèâÿÿûÆÆÀììæààÚýüøÿÿûÿÿüÿÿúËËÅòïêÊÇ¿æãÛÿÿøúõìËƽóîåòïçåáÜÓÐËýüøÿÿüÿÿþøøòüüöÇÇÁééãÞÞØòñíÿÿûÿÿüöööÿÿþñïîÇÄÀÿÿûÄÁ¹úõìñìãøôéÍÈ¿º¸®ÛØÐýûóÿÿûþþøÿÿüööðÍÍÇççáÔÓÏõôðÿþú÷öòÿÿþþýÿþýÿæääÿÿþÆÁ¾ðêåäßÖäÞÓêäÙÿÿöÿÿ÷ÿÿ÷ýüòö÷îçêáËÎÅ××ÑééãÈÇÃýüø÷öòûúöÿÿþþüûýüÿÿýÿÿûÿòíîîéèóíèÒËÂîèÝëåØÍǺÀ½¯Í̾ÚÚÎÓÕÉÝáÖñ÷ìãâÞÍÌÈÿÿüäãßÿÿüûúöýûúÿýü÷öÿòïøÿýÿÿþÿýø÷ÿÿûìäÝßÙÎÚÔÇ÷ñäÿüíóòäßßÑßáÕ×ÛÏÎÕÈçæâûúöñðìÿÿüþýùüúùÿÿþûùøýûÿÿûÿú÷ÿ÷ñöÿþÿÿüùÿýöÿþóý÷êëæ×ÌɺÐÐÀÕÕÇìñâíñåïöéýüøÿÿûÿÿüúùõúùõÿÿþÿþýþüû]

IN image_to_bmp(/home/stefan/autotest/temp/python26-zope212-cmf22-plone40/eggs/Products.PortalTransforms-2.0b2-py2.6.egg/Products/PortalTransforms/tests/input/logo.jpg)



Failure in test testSameNoFilename (Products.PortalTransforms.tests.test_transforms.TransformTestSubclass)
Traceback (most recent call last):
  File "/usr/local/python2.6/lib/python2.6/unittest.py", line 279, in run
    testMethod()
  File "/home/stefan/autotest/temp/python26-zope212-cmf22-plone40/eggs/Products.PortalTransforms-2.0b2-py2.6.egg/Products/PortalTransforms/tests/test_transforms.py", line 74, in testSameNoFilename
    self.do_convert()
  File "/home/stefan/autotest/temp/python26-zope212-cmf22-plone40/eggs/Products.PortalTransforms-2.0b2-py2.6.egg/Products/PortalTransforms/tests/test_transforms.py", line 60, in do_convert
    got, expected, self.transform.name(), self.input))
  File "/usr/local/python2.6/lib/python2.6/unittest.py", line 350, in failUnlessEqual
    (msg or '%r != %r' % (first, second))
AssertionError: [BM®      6   (               x                ÿÿÿûùøþýùÿÿûÿÿøóñéóòèÿÿöòòæîîâÞÜÒØÕÍÖÒÍìèãøóðÿýùÿÿþíîìÿÿþÿÿþóôòÿÿþüýûüýûÿýüÿÿþÿüøòïêúøðÿÿù÷öìÕÔÊ×ÖÌåäÚôòêìêâëèãàÝØÖÓÏÆÂÁâàßÿÿþîïíúûùÿÿþòóñûüúþÿýüø÷ùöòÿÿûÿÿûöôìÐÎÆÏÎÄêéßæåÛÛÚÐÛÙÑÈƾØÕÐØÕÑñíìôòñåãâÉÊÈýþüÿÿþïðîÿÿþúûùõöôÿú÷ÿÿüúöñáÝØàÝÕñïåèçÝÌËÁõôêíìâÿýõÿÿ÷ÿÿûéæâÛ×ÖËÉÈÍËÊïðîÏÐÎãäâÿÿþóôòüýûüýûÿÿüöñîðìçîëãÝÚÒÎÌÂãâØÿÿøçæÜÞÝÓåãÛñïçÿÿüÿþúÿÿþÿÿþòóñÉÊÈßàÞÚÛÙ×ØÖüýûÿÿþÿÿþÿÿüùôñáÝØÑÎÆßÜÔüúðÿÿöööêèçÝëêàßÝÕÜÚÒÝÜØø÷óÿÿþÿÿÿóôòùúøÓÔÒÑÒÐäåãæçåúûùÿÿþÿýøíéäÝÙÔáÞÖïìä÷õíúøðùúñÐÑÈíîåéçßãàÛÛØÓÿÿûÿÿüú÷óÿÿüòóïëìèßàÜÛÜØéêæóôðûüøÿüó×ÒÉîëãÑÎÆÿýøÿÿüüýùøù÷ÞßÝàáÝàßÛíêåÕÓËÿÿøöñèÿÿõþüôÿÿùÿÿùÄżëìãÊËÂÿÿûÿÿùùóèÜØÍêåÜÝÛÓÿýøÿÿûÿÿþøúú¼¾¾ßàÞåäàÙÙÓÜÙÑþüòÿüñÿÿ÷ÿÿ÷ÿÿøö÷í÷øîâãÙàá×âãÚýþõéãÖåáÖâÝÔðîæÿþùýüøÿÿþüýûÿÿþö÷õâáÝììæÿÿùçåÛ×ÐÇÓÎÅÞÝÓüýóÿÿøÿÿøÂúòóêÜÝÔüýôÜÖÉíêÜØÖËÿÿöÿÿøúúôÿÿüýþüýþüòóñîíéÿÿüÿÿûÏÌÄâÜÕïéâÛÚÐàá×ÿÿøôõëÅƽñòéáâÙúûò×ÔÅïìÞÔÒÇÿÿøÿÿøùùóÿÿüÿÿûÿÿþÿÿþÿÿþÿÿûÑÌÉÒÎÉùóîãßÚýûóÉÊÀ÷øïýþõåæÝèéàÏÏÉýý÷ÝÚËêéÛÓÒÄÿÿöÿÿ÷ûùñÿÿûÿþúÿýüòðïõñðÿþýäßÜïêçüõòÜ×ÔäâÚØÙÏÿÿ÷ÿÿù×ØÏæçÞÈÈÂÿÿûæå×åäÖÔÓÅøøìÿÿöüúòÿÿûÿýøÿÿüøõñÿÿþÿÿþüø÷ÔÐÏËÆÅÛÖÕÐÍÈö÷îÿÿùúûòÃýêêäÕÕÏÿÿûîìááàÒÕÕÉððäÿÿöýüòÿþöÿü÷æãßÖÓÏØÔÓ¸´³ÿÿþÿÿþðêëû÷öÿÿûÿÿùûüóæçÞÛÛÕîîèÚÚÔýý÷ÿÿøÌÌÀüûñ¾½³ýüòúùïÿÿùÿþöÎÊÅùõðâßÛìéåÉÅÄÿÿþÿúûþúùÿÿüööðÿÿûËËÅîîèÍÍÇÿÿüúùõðîæòðèáß×åãÛø÷íÿÿöîëãõòêàÝÕîêåÛ×ÒñîêÜÙÕÿþýöòñÿûúÿÿüèèâÿÿûÆÆÀììæààÚýüøÿÿûÿÿüÿÿûÍÊÅòïêÊÇ¿æãÛÿÿøúõìËƽñîæòïçåáÜÓÐËÿüøÿÿüÿÿüøøòüüöÇÇÁééãÞÝÙòñíÿÿûÿÿüøööÿÿÿóïîÇÄÀÿÿûÄÁ¹úõìñìãøóêÍÈ¿º¸®ÛØÐýûóÿÿûþþøÿÿûööðÍÍÇççáÔÔÎõôðÿþú÷öòÿÿüþýÿþýÿæãåÿþÿÆÁ¾îêåäÞ×äÝÔêäÙÿÿöÿÿ÷ÿÿøýüòö÷îéêáËÍÇ××ÑéèäÈÇÃýüø÷öòûúöÿÿþþüûÿüÿÿýÿÿûÿðíïîéèñíèÒÊÃîèÝëåÚËȺÀ½¯ÌÌÀÚÚÎÓÔÊÝáÖóöíããÝÍÌÈÿÿüäãßÿÿüûúöýûúÿýü÷öÿòïøÿýÿÿýÿý÷øÿÿüìäÝßÙÎÚÔÉõòäÿüîòòäßßÑßáÕ×ÛÏÐÔÉççáûúöñðìÿÿüþýùüû÷ÿÿþûùøýüÿýüÿü÷ÿõñöÿþÿÿüùÿýöÿþóý÷ìéæØÌɺÏÐÀÕÕÇìñâíñåïõêýý÷ÿÿûÿÿüúùõúùõÿÿüÿþýþüû]

!=

[BM®      6   (               x                ÿÿþûùøÿüûÿÿüÿÿúóñéóòèÿÿöòòæîíãÞÜÒØÕÍÖÓËìèãøóðÿüùÿÿþíîìÿÿþÿÿþóôòÿÿþüýûüýûÿýüÿÿþÿüøòïêúøðÿÿù÷öìÕÔÊ×ÖÌåäÚôóéìêâëèãáÜÙ×ÒÏÇ¿àáßÿÿþîïíúûùÿÿþòóñûüúþÿýüø÷ùöòÿÿüÿÿûöôìÐÏÅÏÎÄêéßæåÛÛÚÐÛÙÑÈƾØÕÐØÕÑñíìöòñãäâÉÊÈýþüÿÿþïðîÿÿþúûùõöôÿú÷ÿÿüúöñáÝØàÝÕðïåèçÝÌÌÀõôêíìâÿýõÿþùÿÿûéæâÛ×ÖÍÉÈËÌÊïðîÏÐÎãäâÿÿþóôòüýûüýûÿÿüöñîðìçîëãÝÚÒÎÌÂãâØÿÿ÷çæÜÞÝÓåãÛñîéÿÿüÿýüÿÿþÿÿÿòóñÉÊÈßàÞÚÛÙ×ØÖüýûÿÿþÿÿþÿÿüùõðáÝØÑÎÆßÜÔüúðÿÿ÷ööêèçÝëêàßÝÕÜÙÔÝÜØøöõÿÿþÿÿÿóôòùúøÓÔÒÑÒÐäåãæçåúûùÿÿþÿüùíéäÝÙÔáÞÖïíãøöìûùïûûïÒÑÇïîäéçßãàÛÙØÔÿÿþÿÿþøööÿÿþòóñëìêßàÞÛÜÚéêèóôòûüúÿýòÙÓÈðëâÑÎÆÿýùÿÿþüýûöøøÜÞÞàáßÞßÛíêåÖÓËÿÿ÷øòçÿÿòüýóÿÿøÿÿøÄÅ»ëìâÊËÁÿÿùÿÿ÷ùóèÞØÍêåÜÞÛÓÿýøÿÿûÿÿþøúú¼¾¾ßàÞåäàÛØÓÜÙÑÿûòÿüñÿÿ÷ÿÿ÷ÿÿøö÷í÷øîâãÙàá×âãÚýþõéãÖçáÖâÞÓñîæÿþùýüøÿÿþúýûýÿÿö÷õâàßîëçÿÿûéãÜ×ÐÇÕÏÄÜÝÓüýóÿÿøÿÿøÂùòóêÜÝÔüýôÜÖÉíêÜÚÖËÿÿöÿÿøúúôÿÿüýþüýþüòóñîìëÿÿüÿÿûÑËÆâÜÕñéâÙÚÐàá×ÿÿøôõëÅƽñòéáâÙúûò×ÔÅïìÞÔÓÅÿÿ÷ÿÿøùùóÿÿüþÿûÿÿþÿÿþÿÿþÿþýÑÌÉÒÍÊùóîåßÚûüòÉÊÀ÷øîýþõåæÝèéàÏÐÇýý÷ÝÚËìéÚÓÒÄÿÿöÿÿ÷ùúñÿÿûÿþúÿþúòðïóñðÿþýäßÞïêçüõòÞ×ÔâãÙØÙÏÿÿ÷ÿÿù×ØÏæçÞÈÈÂÿÿûææÖåäÖÔÓÅøøìÿÿöüûñÿÿùþþøÿÿüöõñÿÿþÿÿþüø÷ÕÐÏËÆÅÛÖÕÎÏÆö÷îÿÿùúûòÃÄ»êêäÕÕÏÿÿûîíßáàÒÕÕÇððäÿÿõýüòÿþöÿü÷æãÞÖÓÏØÕѸ´³ÿÿþÿÿþðêëüö÷ÿÿùÿÿùûüóæçÞÛÛÕîîèÚÚÔýý÷ÿÿ÷ÌÌÀüüð¾¾²ýüòúùïÿÿùÿþöÎÊÅùõðâßÛìéåÉÅÄÿÿþÿúûþùúÿÿùö÷îÿÿûËËÅîîèÍÍÇÿÿûúùõîïæðñèáàÖåäÚø÷íÿÿöîìâõòêàÝÕîëãÛ×ÒñîêÜÙÕÿþýôòñýûúÿÿûèèâÿÿûÆÆÀììæààÚýüøÿÿûÿÿüÿÿúËËÅòïêÊÇ¿æãÛÿÿøúõìËƽóîåòïçåáÜÓÐËýüøÿÿüÿÿþøøòüüöÇÇÁééãÞÞØòñíÿÿûÿÿüöööÿÿþñïîÇÄÀÿÿûÄÁ¹úõìñìãøôéÍÈ¿º¸®ÛØÐýûóÿÿûþþøÿÿüööðÍÍÇççáÔÓÏõôðÿþú÷öòÿÿþþýÿþýÿæääÿÿþÆÁ¾ðêåäßÖäÞÓêäÙÿÿöÿÿ÷ÿÿ÷ýüòö÷îçêáËÎÅ××ÑééãÈÇÃýüø÷öòûúöÿÿþþüûýüÿÿýÿÿûÿòíîîéèóíèÒËÂîèÝëåØÍǺÀ½¯Í̾ÚÚÎÓÕÉÝáÖñ÷ìãâÞÍÌÈÿÿüäãßÿÿüûúöýûúÿýü÷öÿòïøÿýÿÿþÿýø÷ÿÿûìäÝßÙÎÚÔÇ÷ñäÿüíóòäßßÑßáÕ×ÛÏÎÕÈçæâûúöñðìÿÿüþýùüúùÿÿþûùøýûÿÿûÿú÷ÿ÷ñöÿþÿÿüùÿýöÿþóý÷êëæ×ÌɺÐÐÀÕÕÇìñâíñåïöéýüøÿÿûÿÿüúùõúùõÿÿþÿþýþüû]

IN image_to_bmp(/home/stefan/autotest/temp/python26-zope212-cmf22-plone40/eggs/Products.PortalTransforms-2.0b2-py2.6.egg/Products/PortalTransforms/tests/input/logo.jpg)



Failure in test testSame (Products.PortalTransforms.tests.test_transforms.TransformTestSubclass)
Traceback (most recent call last):
  File "/usr/local/python2.6/lib/python2.6/unittest.py", line 279, in run
    testMethod()
  File "/home/stefan/autotest/temp/python26-zope212-cmf22-plone40/eggs/Products.PortalTransforms-2.0b2-py2.6.egg/Products/PortalTransforms/tests/test_transforms.py", line 68, in testSame
    self.do_convert(filename=self.input)
  File "/home/stefan/autotest/temp/python26-zope212-cmf22-plone40/eggs/Products.PortalTransforms-2.0b2-py2.6.egg/Products/PortalTransforms/tests/test_transforms.py", line 60, in do_convert
    got, expected, self.transform.name(), self.input))
  File "/usr/local/python2.6/lib/python2.6/unittest.py", line 350, in failUnlessEqual
    (msg or '%r != %r' % (first, second))
AssertionError: [ÿØÿà JFIF      ÿÛ C     $.' ",#(7),01444'9=82<.342ÿÛ C  2!!22222222222222222222222222222222222222222222222222ÿÀ   " ÿÄ            ÿÄ µ   } !1AQa"q2‘¡#B±ÁRÑð$3br‚ %&'()*456789:CDEFGHIJSTUVWXYZcdefghijstuvwxyzƒ„…†‡ˆ‰Š’“”•–—˜™š¢£¤¥¦§¨©ª²³´µ¶·¸¹ºÂÃÄÅÆÇÈÉÊÒÓÔÕÖ×ØÙÚáâãäåæçèéêñòóôõö÷øùúÿÄ         ÿÄ µ  w !1AQaq"2B‘¡±Á #3RðbrÑ $4á%ñ&'()*56789:CDEFGHIJSTUVWXYZcdefghijstuvwxyz‚ƒ„…†‡ˆ‰Š’“”•–—˜™š¢£¤¥¦§¨©ª²³´µ¶·¸¹ºÂÃÄÅÆÇÈÉÊÒÓÔÕÖ×ØÙÚâãäåæçèéêòóôõö÷øùúÿÚ    ? ÷ ¦šâw‚±T|Î?ϨÇý1UmbYåÆéÙ7ÇxÓ¹ïÍYÓ0¢elyŠÿ 1ü1ŸÌ5Dí»VÑJC2 Ø]qÁÏUäA=´ò¤æÚ|ÏÊÜò9#úþGêJ…ÑĶi!&p>nrq¸OÐ7äh¤ÊD÷Ò¤­qlØr>e=ùÀôÍS¶™’R–ñ/™ŒmÜ[hüp=;þ´QM+’ôeÛ{WIL³îß’ý?Ï­QRZ?ÿÙ]

!=

[ÿØÿà JFIF      ÿÛ C     $.' ",#(7),01444'9=82<.342ÿÛ C  2!!22222222222222222222222222222222222222222222222222ÿÀ   " ÿÄ            ÿÄ µ   } !1AQa"q2‘¡#B±ÁRÑð$3br‚ %&'()*456789:CDEFGHIJSTUVWXYZcdefghijstuvwxyzƒ„…†‡ˆ‰Š’“”•–—˜™š¢£¤¥¦§¨©ª²³´µ¶·¸¹ºÂÃÄÅÆÇÈÉÊÒÓÔÕÖ×ØÙÚáâãäåæçèéêñòóôõö÷øùúÿÄ         ÿÄ µ  w !1AQaq"2B‘¡±Á #3RðbrÑ $4á%ñ&'()*56789:CDEFGHIJSTUVWXYZcdefghijstuvwxyz‚ƒ„…†‡ˆ‰Š’“”•–—˜™š¢£¤¥¦§¨©ª²³´µ¶·¸¹ºÂÃÄÅÆÇÈÉÊÒÓÔÕÖ×ØÙÚâãäåæçèéêòóôõö÷øùúÿÚ    ? ÷ ¦šâw‚±T|Î?ϨÇý1UmbYåÆéÙ7ÇxÓ¹ïÍYÓ0¢elyŠÿ 1ü1ŸÌ5Dí»VÑJC2 Ø]qÁÏUäC'¶žTœÛO‚Ùù[žG$_ÈýIPº8–Í$$ÎÍÎN7Éúü™HžâÚT•®-›Ģ¡ÿ 8™ªvÓ2JRÞ%ó1»‹mŽ§ÖŠ)­Izmí]%2Ìw»~Kôÿ <~´QEIgÿÙ]

IN image_to_jpeg(/home/stefan/autotest/temp/python26-zope212-cmf22-plone40/eggs/Products.PortalTransforms-2.0b2-py2.6.egg/Products/PortalTransforms/tests/input/logo.gif)



Failure in test testSameNoFilename (Products.PortalTransforms.tests.test_transforms.TransformTestSubclass)
Traceback (most recent call last):
  File "/usr/local/python2.6/lib/python2.6/unittest.py", line 279, in run
    testMethod()
  File "/home/stefan/autotest/temp/python26-zope212-cmf22-plone40/eggs/Products.PortalTransforms-2.0b2-py2.6.egg/Products/PortalTransforms/tests/test_transforms.py", line 74, in testSameNoFilename
    self.do_convert()
  File "/home/stefan/autotest/temp/python26-zope212-cmf22-plone40/eggs/Products.PortalTransforms-2.0b2-py2.6.egg/Products/PortalTransforms/tests/test_transforms.py", line 60, in do_convert
    got, expected, self.transform.name(), self.input))
  File "/usr/local/python2.6/lib/python2.6/unittest.py", line 350, in failUnlessEqual
    (msg or '%r != %r' % (first, second))
AssertionError: [ÿØÿà JFIF      ÿÛ C     $.' ",#(7),01444'9=82<.342ÿÛ C  2!!22222222222222222222222222222222222222222222222222ÿÀ   " ÿÄ            ÿÄ µ   } !1AQa"q2‘¡#B±ÁRÑð$3br‚ %&'()*456789:CDEFGHIJSTUVWXYZcdefghijstuvwxyzƒ„…†‡ˆ‰Š’“”•–—˜™š¢£¤¥¦§¨©ª²³´µ¶·¸¹ºÂÃÄÅÆÇÈÉÊÒÓÔÕÖ×ØÙÚáâãäåæçèéêñòóôõö÷øùúÿÄ         ÿÄ µ  w !1AQaq"2B‘¡±Á #3RðbrÑ $4á%ñ&'()*56789:CDEFGHIJSTUVWXYZcdefghijstuvwxyz‚ƒ„…†‡ˆ‰Š’“”•–—˜™š¢£¤¥¦§¨©ª²³´µ¶·¸¹ºÂÃÄÅÆÇÈÉÊÒÓÔÕÖ×ØÙÚâãäåæçèéêòóôõö÷øùúÿÚ    ? ÷ ¦šâw‚±T|Î?ϨÇý1UmbYåÆéÙ7ÇxÓ¹ïÍYÓ0¢elyŠÿ 1ü1ŸÌ5Dí»VÑJC2 Ø]qÁÏUäA=´ò¤æÚ|ÏÊÜò9#úþGêJ…ÑĶi!&p>nrq¸OÐ7äh¤ÊD÷Ò¤­qlØr>e=ùÀôÍS¶™’R–ñ/™ŒmÜ[hüp=;þ´QM+’ôeÛ{WIL³îß’ý?Ï­QRZ?ÿÙ]

!=

[ÿØÿà JFIF      ÿÛ C     $.' ",#(7),01444'9=82<.342ÿÛ C  2!!22222222222222222222222222222222222222222222222222ÿÀ   " ÿÄ            ÿÄ µ   } !1AQa"q2‘¡#B±ÁRÑð$3br‚ %&'()*456789:CDEFGHIJSTUVWXYZcdefghijstuvwxyzƒ„…†‡ˆ‰Š’“”•–—˜™š¢£¤¥¦§¨©ª²³´µ¶·¸¹ºÂÃÄÅÆÇÈÉÊÒÓÔÕÖ×ØÙÚáâãäåæçèéêñòóôõö÷øùúÿÄ         ÿÄ µ  w !1AQaq"2B‘¡±Á #3RðbrÑ $4á%ñ&'()*56789:CDEFGHIJSTUVWXYZcdefghijstuvwxyz‚ƒ„…†‡ˆ‰Š’“”•–—˜™š¢£¤¥¦§¨©ª²³´µ¶·¸¹ºÂÃÄÅÆÇÈÉÊÒÓÔÕÖ×ØÙÚâãäåæçèéêòóôõö÷øùúÿÚ    ? ÷ ¦šâw‚±T|Î?ϨÇý1UmbYåÆéÙ7ÇxÓ¹ïÍYÓ0¢elyŠÿ 1ü1ŸÌ5Dí»VÑJC2 Ø]qÁÏUäC'¶žTœÛO‚Ùù[žG$_ÈýIPº8–Í$$ÎÍÎN7Éúü™HžâÚT•®-›Ģ¡ÿ 8™ªvÓ2JRÞ%ó1»‹mŽ§ÖŠ)­Izmí]%2Ìw»~Kôÿ <~´QEIgÿÙ]

IN image_to_jpeg(/home/stefan/autotest/temp/python26-zope212-cmf22-plone40/eggs/Products.PortalTransforms-2.0b2-py2.6.egg/Products/PortalTransforms/tests/input/logo.gif)

  Ran 517 tests with 4 failures and 0 errors in 36.149 seconds.
Running Products.PloneTestCase.layer.PloneSite tests:
  Tear down Products.Archetypes.tests.layer.ArchetypesSite in 0.071 seconds.
  Tear down Products.Archetypes.tests.layer.ZCML in 0.004 seconds.
  Tear down Products.CMFCore.testing.FunctionalZCMLLayer in 0.000 seconds.
  Set up Products.PloneTestCase.layer.ZCML in 2.409 seconds.
  Set up Products.PloneTestCase.layer.PloneSite in 3.687 seconds.
  Ran 9 tests with 0 failures and 0 errors in 1.084 seconds.
Running plone.app.kss.tests.kss_and_plone_layer.KSSAndPloneLayer tests:
  Set up plone.app.kss.tests.kss_and_plone_layer.KSSAndPloneLayer in 0.006 seconds.


Error in test testVersionPreviewIsNotInlineEditable (archetypes.kss.tests.test_fields.FieldsViewTestCase)
Traceback (most recent call last):
  File "/usr/local/python2.6/lib/python2.6/unittest.py", line 279, in run
    testMethod()
  File "/home/stefan/autotest/temp/python26-zope212-cmf22-plone40/eggs/archetypes.kss-1.6.0a1-py2.6.egg/archetypes/kss/tests/test_fields.py", line 278, in testVersionPreviewIsNotInlineEditable
    klass = tag['class']
TypeError: 'NoneType' object is unsubscriptable

  Ran 19 tests with 0 failures and 1 errors in 1.367 seconds.
Running zope.testing.testrunner.layer.UnitTests tests:
  Tear down plone.app.kss.tests.kss_and_plone_layer.KSSAndPloneLayer in 0.000 seconds.
  Tear down Products.PloneTestCase.layer.PloneSite in 0.367 seconds.
  Tear down Products.PloneTestCase.layer.ZCML in 0.005 seconds.
  Tear down Testing.ZopeTestCase.layer.ZopeLite in 0.000 seconds.
  Set up zope.testing.testrunner.layer.UnitTests in 0.000 seconds.
/home/stefan/autotest/temp/python26-zope212-cmf22-plone40/eggs/Products.Archetypes-1.6b3-py2.6.egg/Products/Archetypes/ClassGen.py:152: UserWarning: The method 'makeFoo' was already protected by a different permission than the one declared on the field. Assuming that the explicit permission declared is the correct one and has preference over the permission declared on the field.
  self.handle_mode(klass, generator, type, field, mode)
  Ran 28 tests with 0 failures and 0 errors in 0.162 seconds.
Tearing down left over layers:
  Tear down zope.testing.testrunner.layer.UnitTests in 0.000 seconds.
Total: 668 tests, 4 failures, 1 errors in 50.557 seconds.
Running Testing.ZopeTestCase.layer.ZopeLite tests:
  Set up Testing.ZopeTestCase.layer.ZopeLite in 0.090 seconds.
  Ran 283 tests with 0 failures and 0 errors in 1.311 seconds.
Running Products.CMFCalendar.testing.FunctionalLayer tests:
  Set up Products.CMFCore.testing.FunctionalZCMLLayer in 0.167 seconds.
  Set up Products.CMFCalendar.testing.FunctionalLayer in 0.325 seconds.
  Ran 24 tests with 0 failures and 0 errors in 1.519 seconds.
Running Products.CMFCore.testing.EventZCMLLayer tests:
  Tear down Products.CMFCalendar.testing.FunctionalLayer in 0.028 seconds.
  Tear down Products.CMFCore.testing.FunctionalZCMLLayer in 0.001 seconds.
  Set up Products.CMFCore.testing.EventZCMLLayer in 0.001 seconds.
  Ran 8 tests with 0 failures and 0 errors in 0.200 seconds.
Running Products.CMFCore.testing.ExportImportZCMLLayer tests:
  Tear down Products.CMFCore.testing.EventZCMLLayer in 0.000 seconds.
  Set up Products.CMFCore.testing.ExportImportZCMLLayer in 0.001 seconds.
  Ran 10 tests with 0 failures and 0 errors in 0.929 seconds.
Running Products.CMFCore.testing.TraversingEventZCMLLayer tests:
  Tear down Products.CMFCore.testing.ExportImportZCMLLayer in 0.000 seconds.
  Set up Products.CMFCore.testing.TraversingEventZCMLLayer in 0.001 seconds.
  Ran 5 tests with 0 failures and 0 errors in 0.159 seconds.
Running Products.CMFDefault.testing.FunctionalLayer tests:
  Tear down Products.CMFCore.testing.TraversingEventZCMLLayer in 0.000 seconds.
  Set up Products.CMFCore.testing.FunctionalZCMLLayer in 0.153 seconds.
  Set up Products.CMFDefault.testing.FunctionalLayer in 0.242 seconds.
  Ran 76 tests with 0 failures and 0 errors in 3.897 seconds.
Running Products.CMFUid.testing.UidEventZCMLLayer tests:
  Tear down Products.CMFDefault.testing.FunctionalLayer in 0.025 seconds.
  Tear down Products.CMFCore.testing.FunctionalZCMLLayer in 0.002 seconds.
  Set up Products.CMFUid.testing.UidEventZCMLLayer in 0.001 seconds.
  Ran 12 tests with 0 failures and 0 errors in 0.322 seconds.
Running Products.DCWorkflow.testing.ExportImportZCMLLayer tests:
  Tear down Products.CMFUid.testing.UidEventZCMLLayer in 0.000 seconds.
  Set up Products.DCWorkflow.testing.ExportImportZCMLLayer in 0.141 seconds.
  Ran 38 tests with 0 failures and 0 errors in 0.736 seconds.
Running Products.GenericSetup.testing.ExportImportZCMLLayer tests:
  Tear down Products.DCWorkflow.testing.ExportImportZCMLLayer in 0.000 seconds.
  Set up Products.GenericSetup.testing.ExportImportZCMLLayer in 0.081 seconds.
  Ran 186 tests with 0 failures and 0 errors in 0.591 seconds.
Running zope.testing.testrunner.layer.UnitTests tests:
  Tear down Products.GenericSetup.testing.ExportImportZCMLLayer in 0.000 seconds.
  Tear down Testing.ZopeTestCase.layer.ZopeLite in 0.000 seconds.
  Set up zope.testing.testrunner.layer.UnitTests in 0.000 seconds.
  Ran 346 tests with 0 failures and 0 errors in 0.258 seconds.
Tearing down left over layers:
  Tear down zope.testing.testrunner.layer.UnitTests in 0.000 seconds.
Total: 988 tests, 0 failures, 0 errors in 12.463 seconds.
Running Testing.ZopeTestCase.layer.ZopeLite tests:
  Set up Testing.ZopeTestCase.layer.ZopeLite in 0.922 seconds.
  Ran 27 tests with 0 failures and 0 errors in 0.056 seconds.
Running Products.PloneTestCase.layer.PloneSite tests:
  Set up Products.PloneTestCase.layer.ZCML in 2.469 seconds.
  Set up Products.PloneTestCase.layer.PloneSite in 4.790 seconds.
/home/stefan/autotest/temp/python26-zope212-cmf22-plone40/eggs/Zope2-2.12.3-py2.6-linux-x86_64.egg/OFS/subscribers.py:73: DeprecationWarning: Products.FAQ.FAQ.FAQ.manage_afterAdd is discouraged. You should use event subscribers instead.
  DeprecationWarning)
/home/stefan/autotest/temp/python26-zope212-cmf22-plone40/eggs/Zope2-2.12.3-py2.6-linux-x86_64.egg/OFS/subscribers.py:73: DeprecationWarning: Products.FAQ.FAQQuestion.FAQQuestion.manage_afterAdd is discouraged. You should use event subscribers instead.
  DeprecationWarning)
  Ran 145 tests with 0 failures and 0 errors in 23.936 seconds.
Running Products.CMFDiffTool.tests.BaseTestCase.CMFDiffToolLayer tests:
  Set up Products.CMFDiffTool.tests.BaseTestCase.CMFDiffToolLayer in 0.013 seconds.
  Ran 2 tests with 0 failures and 0 errors in 0.222 seconds.
Running Products.CMFTestCase.layer.CMFSite tests:
  Tear down Products.CMFDiffTool.tests.BaseTestCase.CMFDiffToolLayer in 0.380 seconds.
  Tear down Products.PloneTestCase.layer.PloneSite in 0.006 seconds.
  Tear down Products.PloneTestCase.layer.ZCML in 0.004 seconds.
  Set up Products.CMFTestCase.layer.ZCML in 1.751 seconds.
  Set up Products.CMFTestCase.layer.CMFSite in 1.346 seconds.
  Ran 20 tests with 0 failures and 0 errors in 0.392 seconds.
Running zope.testing.testrunner.layer.UnitTests tests:
  Tear down Products.CMFTestCase.layer.CMFSite in 0.070 seconds.
  Tear down Products.CMFTestCase.layer.ZCML in 0.003 seconds.
  Tear down Testing.ZopeTestCase.layer.ZopeLite in 0.000 seconds.
  Set up zope.testing.testrunner.layer.UnitTests in 0.000 seconds.
  Ran 10 tests with 0 failures and 0 errors in 0.005 seconds.
Tearing down left over layers:
  Tear down zope.testing.testrunner.layer.UnitTests in 0.000 seconds.
Total: 204 tests, 0 failures, 0 errors in 37.346 seconds.
Test-module import failures:

Module: plone.app.linkintegrity.tests.testDocTests

Traceback (most recent call last):
  File "/home/stefan/autotest/temp/python26-zope212-cmf22-plone40/eggs/plone.app.linkintegrity-1.3a3-py2.6.egg/plone/app/linkintegrity/tests/testDocTests.py", line 4, in <module>
    from plone.app.linkintegrity.tests import layer
  File "/home/stefan/autotest/temp/python26-zope212-cmf22-plone40/eggs/plone.app.linkintegrity-1.3a3-py2.6.egg/plone/app/linkintegrity/tests/layer.py", line 3, in <module>
    from collective.testcaselayer.ptc import BasePTCLayer, ptc_layer
ImportError: No module named testcaselayer.ptc


Running Testing.ZopeTestCase.layer.ZopeLite tests:
  Set up Testing.ZopeTestCase.layer.ZopeLite in 0.564 seconds.
  Ran 126 tests with 0 failures and 0 errors in 0.763 seconds.
Running Products.CMFTestCase.layer.CMFSite tests:
  Set up Products.CMFTestCase.layer.ZCML in 2.306 seconds.
  Set up Products.CMFTestCase.layer.CMFSite in 0.233 seconds.
  Ran 58 tests with 0 failures and 0 errors in 2.015 seconds.
Running Products.PloneTestCase.layer.ZCML tests:
  Tear down Products.CMFTestCase.layer.CMFSite in 0.042 seconds.
  Tear down Products.CMFTestCase.layer.ZCML in 0.004 seconds.
  Set up Products.PloneTestCase.layer.ZCML in 1.746 seconds.
  Ran 12 tests with 0 failures and 0 errors in 0.016 seconds.
Running Products.PloneTestCase.layer.PloneSite tests:
  Set up Products.PloneTestCase.layer.PloneSite in 4.140 seconds.


Failure in test /home/stefan/autotest/temp/python26-zope212-cmf22-plone40/src/Plone/Products/CMFPlone/tests/emaillogin.txt
Failed doctest test for emaillogin.txt
  File "/home/stefan/autotest/temp/python26-zope212-cmf22-plone40/src/Plone/Products/CMFPlone/tests/emaillogin.txt", line 0

----------------------------------------------------------------------
File "/home/stefan/autotest/temp/python26-zope212-cmf22-plone40/src/Plone/Products/CMFPlone/tests/emaillogin.txt", line 247, in emaillogin.txt
Failed example:
    "Set your password" in browser.contents
Expected:
    True
Got:
    False
----------------------------------------------------------------------
File "/home/stefan/autotest/temp/python26-zope212-cmf22-plone40/src/Plone/Products/CMFPlone/tests/emaillogin.txt", line 249, in emaillogin.txt
Failed example:
    form = browser.getForm(name='pwreset_action')
Exception raised:
    Traceback (most recent call last):
      File "/home/stefan/autotest/temp/python26-zope212-cmf22-plone40/eggs/zope.testing-3.7.7-py2.6.egg/zope/testing/doctest.py", line 1361, in __run
        compileflags, 1) in test.globs
      File "<doctest emaillogin.txt[line 249, example 113]>", line 1, in <module>
        form = browser.getForm(name='pwreset_action')
      File "/home/stefan/autotest/temp/python26-zope212-cmf22-plone40/eggs/zope.testbrowser-3.6.0a2-py2.6.egg/zope/testbrowser/browser.py", line 398, in getForm
        form = disambiguate(matching_forms, '', index)
      File "/home/stefan/autotest/temp/python26-zope212-cmf22-plone40/eggs/zope.testbrowser-3.6.0a2-py2.6.egg/zope/testbrowser/browser.py", line 54, in disambiguate
        raise LookupError(msg)
    LookupError
----------------------------------------------------------------------
File "/home/stefan/autotest/temp/python26-zope212-cmf22-plone40/src/Plone/Products/CMFPlone/tests/emaillogin.txt", line 250, in emaillogin.txt
Failed example:
    form.getControl(name='userid').value = 'email3 at example.org'
Exception raised:
    Traceback (most recent call last):
      File "/home/stefan/autotest/temp/python26-zope212-cmf22-plone40/eggs/zope.testing-3.7.7-py2.6.egg/zope/testing/doctest.py", line 1361, in __run
        compileflags, 1) in test.globs
      File "<doctest emaillogin.txt[line 250, example 114]>", line 1, in <module>
        form.getControl(name='userid').value = 'email3 at example.org'
      File "/home/stefan/autotest/temp/python26-zope212-cmf22-plone40/eggs/zope.testbrowser-3.6.0a2-py2.6.egg/zope/testbrowser/browser.py", line 752, in getControl
        raise zope.testbrowser.interfaces.ExpiredError
    ExpiredError
----------------------------------------------------------------------
File "/home/stefan/autotest/temp/python26-zope212-cmf22-plone40/src/Plone/Products/CMFPlone/tests/emaillogin.txt", line 251, in emaillogin.txt
Failed example:
    form.getControl(name='password').value = 'secretion'
Exception raised:
    Traceback (most recent call last):
      File "/home/stefan/autotest/temp/python26-zope212-cmf22-plone40/eggs/zope.testing-3.7.7-py2.6.egg/zope/testing/doctest.py", line 1361, in __run
        compileflags, 1) in test.globs
      File "<doctest emaillogin.txt[line 251, example 115]>", line 1, in <module>
        form.getControl(name='password').value = 'secretion'
      File "/home/stefan/autotest/temp/python26-zope212-cmf22-plone40/eggs/zope.testbrowser-3.6.0a2-py2.6.egg/zope/testbrowser/browser.py", line 752, in getControl
        raise zope.testbrowser.interfaces.ExpiredError
    ExpiredError
----------------------------------------------------------------------
File "/home/stefan/autotest/temp/python26-zope212-cmf22-plone40/src/Plone/Products/CMFPlone/tests/emaillogin.txt", line 252, in emaillogin.txt
Failed example:
    form.getControl(name='password2').value = 'secretion'
Exception raised:
    Traceback (most recent call last):
      File "/home/stefan/autotest/temp/python26-zope212-cmf22-plone40/eggs/zope.testing-3.7.7-py2.6.egg/zope/testing/doctest.py", line 1361, in __run
        compileflags, 1) in test.globs
      File "<doctest emaillogin.txt[line 252, example 116]>", line 1, in <module>
        form.getControl(name='password2').value = 'secretion'
      File "/home/stefan/autotest/temp/python26-zope212-cmf22-plone40/eggs/zope.testbrowser-3.6.0a2-py2.6.egg/zope/testbrowser/browser.py", line 752, in getControl
        raise zope.testbrowser.interfaces.ExpiredError
    ExpiredError
----------------------------------------------------------------------
File "/home/stefan/autotest/temp/python26-zope212-cmf22-plone40/src/Plone/Products/CMFPlone/tests/emaillogin.txt", line 253, in emaillogin.txt
Failed example:
    form.submit()
Exception raised:
    Traceback (most recent call last):
      File "/home/stefan/autotest/temp/python26-zope212-cmf22-plone40/eggs/zope.testing-3.7.7-py2.6.egg/zope/testing/doctest.py", line 1361, in __run
        compileflags, 1) in test.globs
      File "<doctest emaillogin.txt[line 253, example 117]>", line 1, in <module>
        form.submit()
      File "/home/stefan/autotest/temp/python26-zope212-cmf22-plone40/eggs/zope.testbrowser-3.6.0a2-py2.6.egg/zope/testbrowser/browser.py", line 729, in submit
        raise zope.testbrowser.interfaces.ExpiredError
    ExpiredError
----------------------------------------------------------------------
File "/home/stefan/autotest/temp/python26-zope212-cmf22-plone40/src/Plone/Products/CMFPlone/tests/emaillogin.txt", line 254, in emaillogin.txt
Failed example:
    "Your password has been set successfully." in browser.contents
Expected:
    True
Got:
    False
----------------------------------------------------------------------
File "/home/stefan/autotest/temp/python26-zope212-cmf22-plone40/src/Plone/Products/CMFPlone/tests/emaillogin.txt", line 264, in emaillogin.txt
Failed example:
    self.failIf('Log in' in browser.contents)
Exception raised:
    Traceback (most recent call last):
      File "/home/stefan/autotest/temp/python26-zope212-cmf22-plone40/eggs/zope.testing-3.7.7-py2.6.egg/zope/testing/doctest.py", line 1361, in __run
        compileflags, 1) in test.globs
      File "<doctest emaillogin.txt[line 264, example 124]>", line 1, in <module>
        self.failIf('Log in' in browser.contents)
      File "/usr/local/python2.6/lib/python2.6/unittest.py", line 321, in failIf
        if expr: raise self.failureException, msg
    AssertionError
----------------------------------------------------------------------
File "/home/stefan/autotest/temp/python26-zope212-cmf22-plone40/src/Plone/Products/CMFPlone/tests/emaillogin.txt", line 291, in emaillogin.txt
Failed example:
    "Set your password" in browser.contents
Expected:
    True
Got:
    False
----------------------------------------------------------------------
File "/home/stefan/autotest/temp/python26-zope212-cmf22-plone40/src/Plone/Products/CMFPlone/tests/emaillogin.txt", line 293, in emaillogin.txt
Failed example:
    form = browser.getForm(name='pwreset_action')
Exception raised:
    Traceback (most recent call last):
      File "/home/stefan/autotest/temp/python26-zope212-cmf22-plone40/eggs/zope.testing-3.7.7-py2.6.egg/zope/testing/doctest.py", line 1361, in __run
        compileflags, 1) in test.globs
      File "<doctest emaillogin.txt[line 293, example 138]>", line 1, in <module>
        form = browser.getForm(name='pwreset_action')
      File "/home/stefan/autotest/temp/python26-zope212-cmf22-plone40/eggs/zope.testbrowser-3.6.0a2-py2.6.egg/zope/testbrowser/browser.py", line 398, in getForm
        form = disambiguate(matching_forms, '', index)
      File "/home/stefan/autotest/temp/python26-zope212-cmf22-plone40/eggs/zope.testbrowser-3.6.0a2-py2.6.egg/zope/testbrowser/browser.py", line 54, in disambiguate
        raise LookupError(msg)
    LookupError
----------------------------------------------------------------------
File "/home/stefan/autotest/temp/python26-zope212-cmf22-plone40/src/Plone/Products/CMFPlone/tests/emaillogin.txt", line 294, in emaillogin.txt
Failed example:
    form.getControl(name='userid').value = 'username'
Exception raised:
    Traceback (most recent call last):
      File "/home/stefan/autotest/temp/python26-zope212-cmf22-plone40/eggs/zope.testing-3.7.7-py2.6.egg/zope/testing/doctest.py", line 1361, in __run
        compileflags, 1) in test.globs
      File "<doctest emaillogin.txt[line 294, example 139]>", line 1, in <module>
        form.getControl(name='userid').value = 'username'
      File "/home/stefan/autotest/temp/python26-zope212-cmf22-plone40/eggs/zope.testbrowser-3.6.0a2-py2.6.egg/zope/testbrowser/browser.py", line 752, in getControl
        raise zope.testbrowser.interfaces.ExpiredError
    ExpiredError
----------------------------------------------------------------------
File "/home/stefan/autotest/temp/python26-zope212-cmf22-plone40/src/Plone/Products/CMFPlone/tests/emaillogin.txt", line 295, in emaillogin.txt
Failed example:
    form.getControl(name='password').value = 'secretion'
Exception raised:
    Traceback (most recent call last):
      File "/home/stefan/autotest/temp/python26-zope212-cmf22-plone40/eggs/zope.testing-3.7.7-py2.6.egg/zope/testing/doctest.py", line 1361, in __run
        compileflags, 1) in test.globs
      File "<doctest emaillogin.txt[line 295, example 140]>", line 1, in <module>
        form.getControl(name='password').value = 'secretion'
      File "/home/stefan/autotest/temp/python26-zope212-cmf22-plone40/eggs/zope.testbrowser-3.6.0a2-py2.6.egg/zope/testbrowser/browser.py", line 752, in getControl
        raise zope.testbrowser.interfaces.ExpiredError
    ExpiredError
----------------------------------------------------------------------
File "/home/stefan/autotest/temp/python26-zope212-cmf22-plone40/src/Plone/Products/CMFPlone/tests/emaillogin.txt", line 296, in emaillogin.txt
Failed example:
    form.getControl(name='password2').value = 'secretion'
Exception raised:
    Traceback (most recent call last):
      File "/home/stefan/autotest/temp/python26-zope212-cmf22-plone40/eggs/zope.testing-3.7.7-py2.6.egg/zope/testing/doctest.py", line 1361, in __run
        compileflags, 1) in test.globs
      File "<doctest emaillogin.txt[line 296, example 141]>", line 1, in <module>
        form.getControl(name='password2').value = 'secretion'
      File "/home/stefan/autotest/temp/python26-zope212-cmf22-plone40/eggs/zope.testbrowser-3.6.0a2-py2.6.egg/zope/testbrowser/browser.py", line 752, in getControl
        raise zope.testbrowser.interfaces.ExpiredError
    ExpiredError
----------------------------------------------------------------------
File "/home/stefan/autotest/temp/python26-zope212-cmf22-plone40/src/Plone/Products/CMFPlone/tests/emaillogin.txt", line 297, in emaillogin.txt
Failed example:
    form.submit()
Exception raised:
    Traceback (most recent call last):
      File "/home/stefan/autotest/temp/python26-zope212-cmf22-plone40/eggs/zope.testing-3.7.7-py2.6.egg/zope/testing/doctest.py", line 1361, in __run
        compileflags, 1) in test.globs
      File "<doctest emaillogin.txt[line 297, example 142]>", line 1, in <module>
        form.submit()
      File "/home/stefan/autotest/temp/python26-zope212-cmf22-plone40/eggs/zope.testbrowser-3.6.0a2-py2.6.egg/zope/testbrowser/browser.py", line 729, in submit
        raise zope.testbrowser.interfaces.ExpiredError
    ExpiredError
----------------------------------------------------------------------
File "/home/stefan/autotest/temp/python26-zope212-cmf22-plone40/src/Plone/Products/CMFPlone/tests/emaillogin.txt", line 298, in emaillogin.txt
Failed example:
    "Your password has been set successfully." in browser.contents
Expected:
    True
Got:
    False
----------------------------------------------------------------------
File "/home/stefan/autotest/temp/python26-zope212-cmf22-plone40/src/Plone/Products/CMFPlone/tests/emaillogin.txt", line 310, in emaillogin.txt
Failed example:
    self.failIf('Log in' in browser.contents)
Exception raised:
    Traceback (most recent call last):
      File "/home/stefan/autotest/temp/python26-zope212-cmf22-plone40/eggs/zope.testing-3.7.7-py2.6.egg/zope/testing/doctest.py", line 1361, in __run
        compileflags, 1) in test.globs
      File "<doctest emaillogin.txt[line 310, example 149]>", line 1, in <module>
        self.failIf('Log in' in browser.contents)
      File "/usr/local/python2.6/lib/python2.6/unittest.py", line 321, in failIf
        if expr: raise self.failureException, msg
    AssertionError



Failure in test /home/stefan/autotest/temp/python26-zope212-cmf22-plone40/src/plone.app.content/plone/app/content/browser/tests/foldercontents.txt
Failed doctest test for foldercontents.txt
  File "/home/stefan/autotest/temp/python26-zope212-cmf22-plone40/src/plone.app.content/plone/app/content/browser/tests/foldercontents.txt", line 0

----------------------------------------------------------------------
File "/home/stefan/autotest/temp/python26-zope212-cmf22-plone40/src/plone.app.content/plone/app/content/browser/tests/foldercontents.txt", line 12, in foldercontents.txt
Failed example:
    'Please log in' in browser.contents
Expected:
    True
Got:
    False



Failure in test test_unauthenticated (plone.app.content.browser.tests.test_reviewlist.ReviewListTestCase)
Traceback (most recent call last):
  File "/usr/local/python2.6/lib/python2.6/unittest.py", line 279, in run
    testMethod()
  File "/home/stefan/autotest/temp/python26-zope212-cmf22-plone40/src/plone.app.content/plone/app/content/browser/tests/test_reviewlist.py", line 44, in test_unauthenticated
    self.assertTrue('Please log in' in self.browser.contents)
  File "/usr/local/python2.6/lib/python2.6/unittest.py", line 325, in failUnless
    if not expr: raise self.failureException, msg
AssertionError



Failure in test /home/stefan/autotest/temp/python26-zope212-cmf22-plone40/src/plone.app.workflow/plone/app/workflow/tests/onestateworkflow.txt
Failed doctest test for onestateworkflow.txt
  File "/home/stefan/autotest/temp/python26-zope212-cmf22-plone40/src/plone.app.workflow/plone/app/workflow/tests/onestateworkflow.txt", line 0

----------------------------------------------------------------------
File "/home/stefan/autotest/temp/python26-zope212-cmf22-plone40/src/plone.app.workflow/plone/app/workflow/tests/onestateworkflow.txt", line 83, in onestateworkflow.txt
Failed example:
    'Please log in' in browser.contents
Expected:
    True
Got:
    False
----------------------------------------------------------------------
File "/home/stefan/autotest/temp/python26-zope212-cmf22-plone40/src/plone.app.workflow/plone/app/workflow/tests/onestateworkflow.txt", line 87, in onestateworkflow.txt
Failed example:
    'Please log in' in browser.contents
Expected:
    True
Got:
    False
----------------------------------------------------------------------
File "/home/stefan/autotest/temp/python26-zope212-cmf22-plone40/src/plone.app.workflow/plone/app/workflow/tests/onestateworkflow.txt", line 91, in onestateworkflow.txt
Failed example:
    'Please log in' in browser.contents
Expected:
    True
Got:
    False

  Ran 1839 tests with 4 failures and 0 errors in 3 minutes 47.700 seconds.
Running plone.app.contentrules.tests.test_configuration.TestContentrulesGSLayer tests:
  Set up plone.app.contentrules.tests.test_configuration.TestContentrulesGSLayer in 0.002 seconds.
  Ran 6 tests with 0 failures and 0 errors in 2.428 seconds.
Running plone.app.customerize.tests.layer.PloneCustomerize tests:
  Tear down plone.app.contentrules.tests.test_configuration.TestContentrulesGSLayer in 0.000 seconds.
  Set up plone.app.customerize.tests.layer.PloneCustomerize in 0.000 seconds.
  Ran 27 tests with 0 failures and 0 errors in 2.647 seconds.
Running plone.app.kss.tests.kss_and_plone_layer.KSSAndPloneLayer tests:
  Tear down plone.app.customerize.tests.layer.PloneCustomerize in 0.000 seconds.
  Set up plone.app.kss.tests.kss_and_plone_layer.KSSAndPloneLayer in 0.004 seconds.


Error in test testChangeViewTemplate (plone.app.kss.tests.test_menus.ContentActionMenusTestCase)
Traceback (most recent call last):
  File "/usr/local/python2.6/lib/python2.6/unittest.py", line 279, in run
    testMethod()
  File "/home/stefan/autotest/temp/python26-zope212-cmf22-plone40/src/plone.app.kss/plone/app/kss/tests/test_menus.py", line 57, in testChangeViewTemplate
    result = view.changeViewTemplate(url)
  File "<wrapper>", line 5, in wrapper
  File "/home/stefan/autotest/temp/python26-zope212-cmf22-plone40/src/kss.core/kss/core/actionwrapper.py", line 238, in apply
    result = self.f(obj, *arg, **kw)
  File "/home/stefan/autotest/temp/python26-zope212-cmf22-plone40/src/plone.app.kss/plone/app/kss/content_replacer.py", line 233, in changeViewTemplate
    raise RuntimeError, 'Result content did not contain <div id="%s">' % replace_id
RuntimeError: Result content did not contain <div id="region-content">



Error in test testReplaceContentRegion (plone.app.kss.tests.test_menus.ContentActionMenusTestCase)
Traceback (most recent call last):
  File "/usr/local/python2.6/lib/python2.6/unittest.py", line 279, in run
    testMethod()
  File "/home/stefan/autotest/temp/python26-zope212-cmf22-plone40/src/plone.app.kss/plone/app/kss/tests/test_menus.py", line 43, in testReplaceContentRegion
    result = view.replaceContentRegion(self.fpage.absolute_url(), tabid='contentview-edit')
  File "<wrapper>", line 5, in wrapper
  File "/home/stefan/autotest/temp/python26-zope212-cmf22-plone40/src/kss.core/kss/core/actionwrapper.py", line 238, in apply
    result = self.f(obj, *arg, **kw)
  File "/home/stefan/autotest/temp/python26-zope212-cmf22-plone40/src/plone.app.kss/plone/app/kss/content_replacer.py", line 159, in replaceContentRegion
    raise RuntimeError, 'Result content did not contain <div id="%s">' % replace_id
RuntimeError: Result content did not contain <div id="region-content">

  Ran 13 tests with 0 failures and 2 errors in 1.124 seconds.
Running plone.app.upgrade.tests.base.FunctionalUpgradeLayer tests:
  Tear down plone.app.kss.tests.kss_and_plone_layer.KSSAndPloneLayer in 0.000 seconds.
  Set up plone.app.upgrade.tests.base.FunctionalUpgradeLayer in 0.000 seconds.
  Ran 11 tests with 0 failures and 0 errors in 55.941 seconds.
Running plone.app.viewletmanager.tests.test_exportimport.Layer tests:
  Tear down plone.app.upgrade.tests.base.FunctionalUpgradeLayer in 0.000 seconds.
  Tear down Products.PloneTestCase.layer.PloneSite in 0.402 seconds.
  Tear down Products.PloneTestCase.layer.ZCML in 0.015 seconds.
  Tear down Testing.ZopeTestCase.layer.ZopeLite in 0.000 seconds.
  Set up plone.app.viewletmanager.tests.test_exportimport.Layer in 0.000 seconds.
  Ran 16 tests with 0 failures and 0 errors in 0.050 seconds.
Running zope.testing.testrunner.layer.UnitTests tests:
  Tear down plone.app.viewletmanager.tests.test_exportimport.Layer in 0.000 seconds.
  Set up zope.testing.testrunner.layer.UnitTests in 0.000 seconds.
  Ran 144 tests with 0 failures and 0 errors in 0.854 seconds.
Tearing down left over layers:
  Tear down zope.testing.testrunner.layer.UnitTests in 0.000 seconds.

Test-modules with import problems:
  plone.app.linkintegrity.tests.testDocTests
Total: 2252 tests, 4 failures, 2 errors in 5 minutes 6.614 seconds.
Running Testing.ZopeTestCase.layer.ZopeLite tests:
  Set up Testing.ZopeTestCase.layer.ZopeLite in 1.478 seconds.
  Ran 165 tests with 0 failures and 0 errors in 0.624 seconds.
Running Products.PloneTestCase.layer.ZCML tests:
  Set up Products.PloneTestCase.layer.ZCML in 2.369 seconds.
  Ran 34 tests with 0 failures and 0 errors in 0.211 seconds.
Running Products.PlonePAS.tests.layer.PlonePASLayer tests:
  Set up Products.PloneTestCase.layer.PloneSite in 3.645 seconds.
  Set up Products.PlonePAS.tests.layer.PlonePASLayer in 0.000 seconds.


Failure in test testGetBadMembers (Products.PlonePAS.tests.test_membershiptool.TestMembershipTool)
Traceback (most recent call last):
  File "/usr/local/python2.6/lib/python2.6/unittest.py", line 279, in run
    testMethod()
  File "/home/stefan/autotest/temp/python26-zope212-cmf22-plone40/src/Products.PlonePAS/Products/PlonePAS/tests/test_membershiptool.py", line 482, in testGetBadMembers
    self.assertEqual(self.membership.getBadMembers(), [])
  File "/usr/local/python2.6/lib/python2.6/unittest.py", line 350, in failUnlessEqual
    (msg or '%r != %r' % (first, second))
AssertionError: ['test_user_1_'] != []

  Ran 153 tests with 1 failures and 0 errors in 1.925 seconds.
Running zope.testing.testrunner.layer.UnitTests tests:
  Tear down Products.PlonePAS.tests.layer.PlonePASLayer in 0.000 seconds.
  Tear down Products.PloneTestCase.layer.PloneSite in 0.357 seconds.
  Tear down Products.PloneTestCase.layer.ZCML in 0.004 seconds.
  Tear down Testing.ZopeTestCase.layer.ZopeLite in 0.000 seconds.
  Set up zope.testing.testrunner.layer.UnitTests in 0.000 seconds.
  Ran 337 tests with 0 failures and 0 errors in 0.648 seconds.
Tearing down left over layers:
  Tear down zope.testing.testrunner.layer.UnitTests in 0.000 seconds.
Total: 689 tests, 1 failures, 0 errors in 12.038 seconds.
Running Products.PloneTestCase.layer.PloneSite tests:
  Set up Testing.ZopeTestCase.layer.ZopeLite in 1.431 seconds.
  Set up Products.PloneTestCase.layer.ZCML in 2.408 seconds.
  Set up Products.PloneTestCase.layer.PloneSite in 4.216 seconds.
/home/stefan/autotest/temp/python26-zope212-cmf22-plone40/eggs/borg.localrole-3.0a1-py2.6.egg/borg/localrole/bbb/bbb.txt:1: DeprecationWarning: IWorkspace is deprecated. Please use borg.localrole.interfaces.ILocalRoleProvider instead
  =========
/home/stefan/autotest/temp/python26-zope212-cmf22-plone40/eggs/borg.localrole-3.0a1-py2.6.egg/borg/localrole/bbb/bbb.txt:1: DeprecationWarning: IGroupAwareWorkspace is deprecated. Please use borg.localrole.interfaces.ILocalRoleProvider instead
  =========
  Ran 39 tests with 0 failures and 0 errors in 0.240 seconds.
Running plone.browserlayer.tests.test_doctest.PloneBrowserLayerLayer tests:
  Set up plone.browserlayer.tests.test_doctest.PloneBrowserLayerLayer in 0.003 seconds.
  Ran 9 tests with 0 failures and 0 errors in 0.742 seconds.
Running plone.theme.tests.test_doctest.PloneThemeLayer tests:
  Tear down plone.browserlayer.tests.test_doctest.PloneBrowserLayerLayer in 0.000 seconds.
  Set up plone.theme.tests.test_doctest.PloneThemeLayer in 0.003 seconds.
  Ran 5 tests with 0 failures and 0 errors in 0.053 seconds.
Running zope.testing.testrunner.layer.UnitTests tests:
  Tear down plone.theme.tests.test_doctest.PloneThemeLayer in 0.000 seconds.
  Tear down Products.PloneTestCase.layer.PloneSite in 0.355 seconds.
  Tear down Products.PloneTestCase.layer.ZCML in 0.004 seconds.
  Tear down Testing.ZopeTestCase.layer.ZopeLite in 0.000 seconds.
  Set up zope.testing.testrunner.layer.UnitTests in 0.000 seconds.
/usr/local/python2.6/lib/python2.6/mhlib.py:83: DeprecationWarning: the multifile module has been deprecated since Python 2.5
  import multifile
  Ran 252 tests with 0 failures and 0 errors in 0.859 seconds.
Tearing down left over layers:
  Tear down zope.testing.testrunner.layer.UnitTests in 0.000 seconds.
Total: 305 tests, 0 failures, 0 errors in 11.195 seconds.
Running Products.PloneTestCase.layer.PloneSite tests:
  Set up Testing.ZopeTestCase.layer.ZopeLite in 0.903 seconds.
  Set up Products.PloneTestCase.layer.ZCML in 2.375 seconds.
  Set up Products.PloneTestCase.layer.PloneSite in 3.993 seconds.
/usr/local/python2.6/lib/python2.6/unittest.py:279: DeprecationWarning: The use of 'hide' has been deprecated and will be removed in plone.portlet.static 2.0. Instead, use the new generic built-in show/hide setting of plone.portlets.
  testMethod()
  Ran 165 tests with 0 failures and 0 errors in 15.211 seconds.
Running plone.app.portlets.tests.test_configuration.TestPortletZCMLLayer tests:
  Set up plone.app.portlets.tests.test_configuration.TestPortletZCMLLayer in 0.006 seconds.
  Ran 5 tests with 0 failures and 0 errors in 0.039 seconds.
Running plone.app.portlets.tests.test_configuration.TestPortletGSLayer tests:
  Set up plone.app.portlets.tests.test_configuration.TestPortletGSLayer in 1.349 seconds.
  Ran 13 tests with 0 failures and 0 errors in 3.696 seconds.
Running zope.testing.testrunner.layer.UnitTests tests:
  Tear down plone.app.portlets.tests.test_configuration.TestPortletGSLayer in 0.000 seconds.
  Tear down plone.app.portlets.tests.test_configuration.TestPortletZCMLLayer in 0.000 seconds.
  Tear down Products.PloneTestCase.layer.PloneSite in 0.366 seconds.
  Tear down Products.PloneTestCase.layer.ZCML in 0.005 seconds.
  Tear down Testing.ZopeTestCase.layer.ZopeLite in 0.000 seconds.
  Set up zope.testing.testrunner.layer.UnitTests in 0.000 seconds.
  Ran 57 tests with 0 failures and 0 errors in 0.149 seconds.
Tearing down left over layers:
  Tear down zope.testing.testrunner.layer.UnitTests in 0.000 seconds.
Total: 240 tests, 0 failures, 0 errors in 28.933 seconds.
Running zope.testing.testrunner.layer.UnitTests tests:
  Set up zope.testing.testrunner.layer.UnitTests in 0.000 seconds.
  Ran 3 tests with 0 failures and 0 errors in 12.368 seconds.
Tearing down left over layers:
  Tear down zope.testing.testrunner.layer.UnitTests in 0.000 seconds.
Running Products.PloneTestCase.layer.PloneSite tests:
  Set up Testing.ZopeTestCase.layer.ZopeLite in 0.000 seconds.
  Set up Products.PloneTestCase.layer.ZCML in 1.876 seconds.
  Set up Products.PloneTestCase.layer.PloneSite in 4.620 seconds.
  Ran 23 tests with 0 failures and 0 errors in 2.773 seconds.
Running Products.CMFPlacefulWorkflow.tests.test_exportimport.ExportImportLayer tests:
  Set up Products.CMFPlacefulWorkflow.tests.test_exportimport.ExportImportLayer in 0.001 seconds.
  Ran 12 tests with 0 failures and 0 errors in 0.931 seconds.
Tearing down left over layers:
  Tear down Products.CMFPlacefulWorkflow.tests.test_exportimport.ExportImportLayer in 0.000 seconds.
  Tear down Products.PloneTestCase.layer.PloneSite in 0.370 seconds.
  Tear down Products.PloneTestCase.layer.ZCML in 0.004 seconds.
  Tear down Testing.ZopeTestCase.layer.ZopeLite in 0.000 seconds.
Total: 35 tests, 0 failures, 0 errors in 11.016 seconds.
Running Products.CMFTestCase.layer.CMFSite tests:
  Set up Testing.ZopeTestCase.layer.ZopeLite in 0.232 seconds.
  Set up Products.CMFTestCase.layer.ZCML in 0.368 seconds.
  Set up Products.CMFTestCase.layer.CMFSite in 0.207 seconds.
  Ran 58 tests with 0 failures and 0 errors in 0.227 seconds.
Tearing down left over layers:
  Tear down Products.CMFTestCase.layer.CMFSite in 0.027 seconds.
  Tear down Products.CMFTestCase.layer.ZCML in 0.001 seconds.
  Tear down Testing.ZopeTestCase.layer.ZopeLite in 0.000 seconds.
Running zope.testing.testrunner.layer.UnitTests tests:
  Set up zope.testing.testrunner.layer.UnitTests in 0.000 seconds.
  Ran 35 tests with 0 failures and 0 errors in 0.027 seconds.
Tearing down left over layers:
  Tear down zope.testing.testrunner.layer.UnitTests in 0.000 seconds.
Running Products.PloneTestCase.layer.PloneSite tests:
  Set up Testing.ZopeTestCase.layer.ZopeLite in 1.356 seconds.
  Set up Products.PloneTestCase.layer.ZCML in 2.461 seconds.
  Set up Products.PloneTestCase.layer.PloneSite in 3.867 seconds.


Failure in test /home/stefan/autotest/temp/python26-zope212-cmf22-plone40/src/Products.PasswordResetTool/Products/PasswordResetTool/tests/browser.txt
Failed doctest test for browser.txt
  File "/home/stefan/autotest/temp/python26-zope212-cmf22-plone40/src/Products.PasswordResetTool/Products/PasswordResetTool/tests/browser.txt", line 0

----------------------------------------------------------------------
File "/home/stefan/autotest/temp/python26-zope212-cmf22-plone40/src/Products.PasswordResetTool/Products/PasswordResetTool/tests/browser.txt", line 125, in browser.txt
Failed example:
    open('/tmp/test.html', 'w').write(browser.contents)
Exception raised:
    Traceback (most recent call last):
      File "/home/stefan/autotest/temp/python26-zope212-cmf22-plone40/eggs/zope.testing-3.7.7-py2.6.egg/zope/testing/doctest.py", line 1361, in __run
        compileflags, 1) in test.globs
      File "<doctest browser.txt[line 125, example 27]>", line 1, in <module>
        open('/tmp/test.html', 'w').write(browser.contents)
    IOError: [Errno 13] Permission denied: '/tmp/test.html'
----------------------------------------------------------------------
File "/home/stefan/autotest/temp/python26-zope212-cmf22-plone40/src/Products.PasswordResetTool/Products/PasswordResetTool/tests/browser.txt", line 137, in browser.txt
Failed example:
    open('/tmp/test2.html', 'w').write(browser.contents)
Exception raised:
    Traceback (most recent call last):
      File "/home/stefan/autotest/temp/python26-zope212-cmf22-plone40/eggs/zope.testing-3.7.7-py2.6.egg/zope/testing/doctest.py", line 1361, in __run
        compileflags, 1) in test.globs
      File "<doctest browser.txt[line 137, example 34]>", line 1, in <module>
        open('/tmp/test2.html', 'w').write(browser.contents)
    IOError: [Errno 13] Permission denied: '/tmp/test2.html'
----------------------------------------------------------------------
File "/home/stefan/autotest/temp/python26-zope212-cmf22-plone40/src/Products.PasswordResetTool/Products/PasswordResetTool/tests/browser.txt", line 182, in browser.txt
Failed example:
    browser.open(address)
Exception raised:
    Traceback (most recent call last):
      File "/home/stefan/autotest/temp/python26-zope212-cmf22-plone40/eggs/zope.testing-3.7.7-py2.6.egg/zope/testing/doctest.py", line 1361, in __run
        compileflags, 1) in test.globs
      File "<doctest browser.txt[line 182, example 53]>", line 1, in <module>
        browser.open(address)
      File "/home/stefan/autotest/temp/python26-zope212-cmf22-plone40/eggs/zope.testbrowser-3.6.0a2-py2.6.egg/zope/testbrowser/browser.py", line 239, in open
        self.mech_browser.open(url, data)
      File "build/bdist.linux-x86_64/egg/mechanize/_mechanize.py", line 209, in open
      File "build/bdist.linux-x86_64/egg/mechanize/_mechanize.py", line 236, in _mech_open
      File "build/bdist.linux-x86_64/egg/mechanize/_opener.py", line 191, in open
      File "/usr/local/python2.6/lib/python2.6/urllib2.py", line 407, in _open
        '_open', req)
      File "/usr/local/python2.6/lib/python2.6/urllib2.py", line 367, in _call_chain
        result = func(*args)
      File "/home/stefan/autotest/temp/python26-zope212-cmf22-plone40/eggs/Zope2-2.12.3-py2.6-linux-x86_64.egg/Products/Five/testbrowser.py", line 85, in http_open
        return self.do_open(PublisherConnection, req)
      File "/usr/local/python2.6/lib/python2.6/urllib2.py", line 1118, in do_open
        h.request(req.get_method(), req.get_selector(), req.data, headers)
      File "/home/stefan/autotest/temp/python26-zope212-cmf22-plone40/eggs/zope.testbrowser-3.6.0a2-py2.6.egg/zope/testbrowser/testing.py", line 82, in request
        self.response = self.caller(request_string, handle_errors)
      File "/home/stefan/autotest/temp/python26-zope212-cmf22-plone40/eggs/Zope2-2.12.3-py2.6-linux-x86_64.egg/Testing/ZopeTestCase/functional.py", line 40, in wrapped_func
        return func(*args, **kw)
      File "/home/stefan/autotest/temp/python26-zope212-cmf22-plone40/eggs/Zope2-2.12.3-py2.6-linux-x86_64.egg/Testing/ZopeTestCase/zopedoctest/functional.py", line 182, in http
        debug=not handle_errors,
      File "/home/stefan/autotest/temp/python26-zope212-cmf22-plone40/eggs/Zope2-2.12.3-py2.6-linux-x86_64.egg/ZPublisher/Test.py", line 204, in publish_module
        response = publish(request, module_name, after_list, debug=debug)
      File "/home/stefan/autotest/temp/python26-zope212-cmf22-plone40/eggs/Zope2-2.12.3-py2.6-linux-x86_64.egg/ZPublisher/Publish.py", line 165, in publish
        sys.exc_info()[2],
      File "/home/stefan/autotest/temp/python26-zope212-cmf22-plone40/eggs/Zope2-2.12.3-py2.6-linux-x86_64.egg/Zope2/App/startup.py", line 211, in __call__
        v = view()
      File "/home/stefan/autotest/temp/python26-zope212-cmf22-plone40/src/Products.PlonePAS/Products/PlonePAS/browser/unauthorized.py", line 15, in __call__
        raise self.context
    Unauthorized: You are not allowed to access 'PasswordResetTool' in this context
----------------------------------------------------------------------
File "/home/stefan/autotest/temp/python26-zope212-cmf22-plone40/src/Products.PasswordResetTool/Products/PasswordResetTool/tests/browser.txt", line 183, in browser.txt
Failed example:
    "Set your password" in browser.contents
Exception raised:
    Traceback (most recent call last):
      File "/home/stefan/autotest/temp/python26-zope212-cmf22-plone40/eggs/zope.testing-3.7.7-py2.6.egg/zope/testing/doctest.py", line 1361, in __run
        compileflags, 1) in test.globs
      File "<doctest browser.txt[line 183, example 54]>", line 1, in <module>
        "Set your password" in browser.contents
      File "/home/stefan/autotest/temp/python26-zope212-cmf22-plone40/eggs/zope.testbrowser-3.6.0a2-py2.6.egg/zope/testbrowser/browser.py", line 201, in contents
        old_location = response.tell()
    AttributeError: 'NoneType' object has no attribute 'tell'
----------------------------------------------------------------------
File "/home/stefan/autotest/temp/python26-zope212-cmf22-plone40/src/Products.PasswordResetTool/Products/PasswordResetTool/tests/browser.txt", line 186, in browser.txt
Failed example:
    form = browser.getForm(name='pwreset_action')
Exception raised:
    Traceback (most recent call last):
      File "/home/stefan/autotest/temp/python26-zope212-cmf22-plone40/eggs/zope.testing-3.7.7-py2.6.egg/zope/testing/doctest.py", line 1361, in __run
        compileflags, 1) in test.globs
      File "<doctest browser.txt[line 186, example 55]>", line 1, in <module>
        form = browser.getForm(name='pwreset_action')
      File "/home/stefan/autotest/temp/python26-zope212-cmf22-plone40/eggs/zope.testbrowser-3.6.0a2-py2.6.egg/zope/testbrowser/browser.py", line 384, in getForm
        for form in self.mech_browser.forms():
      File "build/bdist.linux-x86_64/egg/mechanize/_mechanize.py", line 424, in forms
      File "build/bdist.linux-x86_64/egg/mechanize/_mechanize.py", line 449, in viewing_html
    BrowserStateError: not viewing any document
----------------------------------------------------------------------
File "/home/stefan/autotest/temp/python26-zope212-cmf22-plone40/src/Products.PasswordResetTool/Products/PasswordResetTool/tests/browser.txt", line 187, in browser.txt
Failed example:
    form.getControl(name='userid').value = 'jsmith'
Exception raised:
    Traceback (most recent call last):
      File "/home/stefan/autotest/temp/python26-zope212-cmf22-plone40/eggs/zope.testing-3.7.7-py2.6.egg/zope/testing/doctest.py", line 1361, in __run
        compileflags, 1) in test.globs
      File "<doctest browser.txt[line 187, example 56]>", line 1, in <module>
        form.getControl(name='userid').value = 'jsmith'
      File "/home/stefan/autotest/temp/python26-zope212-cmf22-plone40/eggs/zope.testbrowser-3.6.0a2-py2.6.egg/zope/testbrowser/browser.py", line 752, in getControl
        raise zope.testbrowser.interfaces.ExpiredError
    ExpiredError
----------------------------------------------------------------------
File "/home/stefan/autotest/temp/python26-zope212-cmf22-plone40/src/Products.PasswordResetTool/Products/PasswordResetTool/tests/browser.txt", line 188, in browser.txt
Failed example:
    form.getControl(name='password').value = 'secretion'
Exception raised:
    Traceback (most recent call last):
      File "/home/stefan/autotest/temp/python26-zope212-cmf22-plone40/eggs/zope.testing-3.7.7-py2.6.egg/zope/testing/doctest.py", line 1361, in __run
        compileflags, 1) in test.globs
      File "<doctest browser.txt[line 188, example 57]>", line 1, in <module>
        form.getControl(name='password').value = 'secretion'
      File "/home/stefan/autotest/temp/python26-zope212-cmf22-plone40/eggs/zope.testbrowser-3.6.0a2-py2.6.egg/zope/testbrowser/browser.py", line 752, in getControl
        raise zope.testbrowser.interfaces.ExpiredError
    ExpiredError
----------------------------------------------------------------------
File "/home/stefan/autotest/temp/python26-zope212-cmf22-plone40/src/Products.PasswordResetTool/Products/PasswordResetTool/tests/browser.txt", line 189, in browser.txt
Failed example:
    form.getControl(name='password2').value = 'secretion'
Exception raised:
    Traceback (most recent call last):
      File "/home/stefan/autotest/temp/python26-zope212-cmf22-plone40/eggs/zope.testing-3.7.7-py2.6.egg/zope/testing/doctest.py", line 1361, in __run
        compileflags, 1) in test.globs
      File "<doctest browser.txt[line 189, example 58]>", line 1, in <module>
        form.getControl(name='password2').value = 'secretion'
      File "/home/stefan/autotest/temp/python26-zope212-cmf22-plone40/eggs/zope.testbrowser-3.6.0a2-py2.6.egg/zope/testbrowser/browser.py", line 752, in getControl
        raise zope.testbrowser.interfaces.ExpiredError
    ExpiredError
----------------------------------------------------------------------
File "/home/stefan/autotest/temp/python26-zope212-cmf22-plone40/src/Products.PasswordResetTool/Products/PasswordResetTool/tests/browser.txt", line 190, in browser.txt
Failed example:
    form.submit()
Exception raised:
    Traceback (most recent call last):
      File "/home/stefan/autotest/temp/python26-zope212-cmf22-plone40/eggs/zope.testing-3.7.7-py2.6.egg/zope/testing/doctest.py", line 1361, in __run
        compileflags, 1) in test.globs
      File "<doctest browser.txt[line 190, example 59]>", line 1, in <module>
        form.submit()
      File "/home/stefan/autotest/temp/python26-zope212-cmf22-plone40/eggs/zope.testbrowser-3.6.0a2-py2.6.egg/zope/testbrowser/browser.py", line 729, in submit
        raise zope.testbrowser.interfaces.ExpiredError
    ExpiredError
----------------------------------------------------------------------
File "/home/stefan/autotest/temp/python26-zope212-cmf22-plone40/src/Products.PasswordResetTool/Products/PasswordResetTool/tests/browser.txt", line 194, in browser.txt
Failed example:
    "Your password has been set successfully." in browser.contents
Exception raised:
    Traceback (most recent call last):
      File "/home/stefan/autotest/temp/python26-zope212-cmf22-plone40/eggs/zope.testing-3.7.7-py2.6.egg/zope/testing/doctest.py", line 1361, in __run
        compileflags, 1) in test.globs
      File "<doctest browser.txt[line 194, example 60]>", line 1, in <module>
        "Your password has been set successfully." in browser.contents
      File "/home/stefan/autotest/temp/python26-zope212-cmf22-plone40/eggs/zope.testbrowser-3.6.0a2-py2.6.egg/zope/testbrowser/browser.py", line 201, in contents
        old_location = response.tell()
    AttributeError: 'NoneType' object has no attribute 'tell'
----------------------------------------------------------------------
File "/home/stefan/autotest/temp/python26-zope212-cmf22-plone40/src/Products.PasswordResetTool/Products/PasswordResetTool/tests/browser.txt", line 196, in browser.txt
Failed example:
    browser.url
Exception raised:
    Traceback (most recent call last):
      File "/home/stefan/autotest/temp/python26-zope212-cmf22-plone40/eggs/zope.testing-3.7.7-py2.6.egg/zope/testing/doctest.py", line 1361, in __run
        compileflags, 1) in test.globs
      File "<doctest browser.txt[line 196, example 61]>", line 1, in <module>
        browser.url
      File "/home/stefan/autotest/temp/python26-zope212-cmf22-plone40/eggs/zope.testbrowser-3.6.0a2-py2.6.egg/zope/testbrowser/browser.py", line 183, in url
        return self.mech_browser.geturl()
      File "build/bdist.linux-x86_64/egg/mechanize/_mechanize.py", line 340, in geturl
    BrowserStateError: not viewing any document
----------------------------------------------------------------------
File "/home/stefan/autotest/temp/python26-zope212-cmf22-plone40/src/Products.PasswordResetTool/Products/PasswordResetTool/tests/browser.txt", line 205, in browser.txt
Failed example:
    "You are now logged in" in browser.contents
Expected:
    True
Got:
    False
----------------------------------------------------------------------
File "/home/stefan/autotest/temp/python26-zope212-cmf22-plone40/src/Products.PasswordResetTool/Products/PasswordResetTool/tests/browser.txt", line 210, in browser.txt
Failed example:
    browser.getLink('Log out').click()
Exception raised:
    Traceback (most recent call last):
      File "/home/stefan/autotest/temp/python26-zope212-cmf22-plone40/eggs/zope.testing-3.7.7-py2.6.egg/zope/testing/doctest.py", line 1361, in __run
        compileflags, 1) in test.globs
      File "<doctest browser.txt[line 210, example 67]>", line 1, in <module>
        browser.getLink('Log out').click()
      File "/home/stefan/autotest/temp/python26-zope212-cmf22-plone40/eggs/zope.testbrowser-3.6.0a2-py2.6.egg/zope/testbrowser/browser.py", line 327, in getLink
        return Link(self.mech_browser.find_link(**args), self)
      File "build/bdist.linux-x86_64/egg/mechanize/_mechanize.py", line 626, in find_link
    LinkNotFoundError
----------------------------------------------------------------------
File "/home/stefan/autotest/temp/python26-zope212-cmf22-plone40/src/Products.PasswordResetTool/Products/PasswordResetTool/tests/browser.txt", line 211, in browser.txt
Failed example:
    "You are now logged out" in browser.contents
Expected:
    True
Got:
    False
----------------------------------------------------------------------
File "/home/stefan/autotest/temp/python26-zope212-cmf22-plone40/src/Products.PasswordResetTool/Products/PasswordResetTool/tests/browser.txt", line 333, in browser.txt
Failed example:
    browser.open(address)
Exception raised:
    Traceback (most recent call last):
      File "/home/stefan/autotest/temp/python26-zope212-cmf22-plone40/eggs/zope.testing-3.7.7-py2.6.egg/zope/testing/doctest.py", line 1361, in __run
        compileflags, 1) in test.globs
      File "<doctest browser.txt[line 333, example 120]>", line 1, in <module>
        browser.open(address)
      File "/home/stefan/autotest/temp/python26-zope212-cmf22-plone40/eggs/zope.testbrowser-3.6.0a2-py2.6.egg/zope/testbrowser/browser.py", line 239, in open
        self.mech_browser.open(url, data)
      File "build/bdist.linux-x86_64/egg/mechanize/_mechanize.py", line 209, in open
      File "build/bdist.linux-x86_64/egg/mechanize/_mechanize.py", line 236, in _mech_open
      File "build/bdist.linux-x86_64/egg/mechanize/_opener.py", line 191, in open
      File "/usr/local/python2.6/lib/python2.6/urllib2.py", line 407, in _open
        '_open', req)
      File "/usr/local/python2.6/lib/python2.6/urllib2.py", line 367, in _call_chain
        result = func(*args)
      File "/home/stefan/autotest/temp/python26-zope212-cmf22-plone40/eggs/Zope2-2.12.3-py2.6-linux-x86_64.egg/Products/Five/testbrowser.py", line 85, in http_open
        return self.do_open(PublisherConnection, req)
      File "/usr/local/python2.6/lib/python2.6/urllib2.py", line 1118, in do_open
        h.request(req.get_method(), req.get_selector(), req.data, headers)
      File "/home/stefan/autotest/temp/python26-zope212-cmf22-plone40/eggs/zope.testbrowser-3.6.0a2-py2.6.egg/zope/testbrowser/testing.py", line 82, in request
        self.response = self.caller(request_string, handle_errors)
      File "/home/stefan/autotest/temp/python26-zope212-cmf22-plone40/eggs/Zope2-2.12.3-py2.6-linux-x86_64.egg/Testing/ZopeTestCase/functional.py", line 40, in wrapped_func
        return func(*args, **kw)
      File "/home/stefan/autotest/temp/python26-zope212-cmf22-plone40/eggs/Zope2-2.12.3-py2.6-linux-x86_64.egg/Testing/ZopeTestCase/zopedoctest/functional.py", line 182, in http
        debug=not handle_errors,
      File "/home/stefan/autotest/temp/python26-zope212-cmf22-plone40/eggs/Zope2-2.12.3-py2.6-linux-x86_64.egg/ZPublisher/Test.py", line 204, in publish_module
        response = publish(request, module_name, after_list, debug=debug)
      File "/home/stefan/autotest/temp/python26-zope212-cmf22-plone40/eggs/Zope2-2.12.3-py2.6-linux-x86_64.egg/ZPublisher/Publish.py", line 165, in publish
        sys.exc_info()[2],
      File "/home/stefan/autotest/temp/python26-zope212-cmf22-plone40/eggs/Zope2-2.12.3-py2.6-linux-x86_64.egg/Zope2/App/startup.py", line 211, in __call__
        v = view()
      File "/home/stefan/autotest/temp/python26-zope212-cmf22-plone40/src/Products.PlonePAS/Products/PlonePAS/browser/unauthorized.py", line 15, in __call__
        raise self.context
    Unauthorized: You are not allowed to access 'PasswordResetTool' in this context
----------------------------------------------------------------------
File "/home/stefan/autotest/temp/python26-zope212-cmf22-plone40/src/Products.PasswordResetTool/Products/PasswordResetTool/tests/browser.txt", line 334, in browser.txt
Failed example:
    "Please fill out the form below to set your password" in browser.contents
Exception raised:
    Traceback (most recent call last):
      File "/home/stefan/autotest/temp/python26-zope212-cmf22-plone40/eggs/zope.testing-3.7.7-py2.6.egg/zope/testing/doctest.py", line 1361, in __run
        compileflags, 1) in test.globs
      File "<doctest browser.txt[line 334, example 121]>", line 1, in <module>
        "Please fill out the form below to set your password" in browser.contents
      File "/home/stefan/autotest/temp/python26-zope212-cmf22-plone40/eggs/zope.testbrowser-3.6.0a2-py2.6.egg/zope/testbrowser/browser.py", line 201, in contents
        old_location = response.tell()
    AttributeError: 'NoneType' object has no attribute 'tell'
----------------------------------------------------------------------
File "/home/stefan/autotest/temp/python26-zope212-cmf22-plone40/src/Products.PasswordResetTool/Products/PasswordResetTool/tests/browser.txt", line 336, in browser.txt
Failed example:
    browser.getControl(name='password').value = 'secret'
Exception raised:
    Traceback (most recent call last):
      File "/home/stefan/autotest/temp/python26-zope212-cmf22-plone40/eggs/zope.testing-3.7.7-py2.6.egg/zope/testing/doctest.py", line 1361, in __run
        compileflags, 1) in test.globs
      File "<doctest browser.txt[line 336, example 122]>", line 1, in <module>
        browser.getControl(name='password').value = 'secret'
      File "/home/stefan/autotest/temp/python26-zope212-cmf22-plone40/eggs/zope.testbrowser-3.6.0a2-py2.6.egg/zope/testbrowser/browser.py", line 365, in getControl
        label, name, self.mech_browser.forms(), include_subcontrols=True)
      File "build/bdist.linux-x86_64/egg/mechanize/_mechanize.py", line 424, in forms
      File "build/bdist.linux-x86_64/egg/mechanize/_mechanize.py", line 449, in viewing_html
    BrowserStateError: not viewing any document
----------------------------------------------------------------------
File "/home/stefan/autotest/temp/python26-zope212-cmf22-plone40/src/Products.PasswordResetTool/Products/PasswordResetTool/tests/browser.txt", line 337, in browser.txt
Failed example:
    browser.getControl(name='password2').value = 'secret'
Exception raised:
    Traceback (most recent call last):
      File "/home/stefan/autotest/temp/python26-zope212-cmf22-plone40/eggs/zope.testing-3.7.7-py2.6.egg/zope/testing/doctest.py", line 1361, in __run
        compileflags, 1) in test.globs
      File "<doctest browser.txt[line 337, example 123]>", line 1, in <module>
        browser.getControl(name='password2').value = 'secret'
      File "/home/stefan/autotest/temp/python26-zope212-cmf22-plone40/eggs/zope.testbrowser-3.6.0a2-py2.6.egg/zope/testbrowser/browser.py", line 365, in getControl
        label, name, self.mech_browser.forms(), include_subcontrols=True)
      File "build/bdist.linux-x86_64/egg/mechanize/_mechanize.py", line 424, in forms
      File "build/bdist.linux-x86_64/egg/mechanize/_mechanize.py", line 449, in viewing_html
    BrowserStateError: not viewing any document
----------------------------------------------------------------------
File "/home/stefan/autotest/temp/python26-zope212-cmf22-plone40/src/Products.PasswordResetTool/Products/PasswordResetTool/tests/browser.txt", line 338, in browser.txt
Failed example:
    browser.getControl("Set my password").click()
Exception raised:
    Traceback (most recent call last):
      File "/home/stefan/autotest/temp/python26-zope212-cmf22-plone40/eggs/zope.testing-3.7.7-py2.6.egg/zope/testing/doctest.py", line 1361, in __run
        compileflags, 1) in test.globs
      File "<doctest browser.txt[line 338, example 124]>", line 1, in <module>
        browser.getControl("Set my password").click()
      File "/home/stefan/autotest/temp/python26-zope212-cmf22-plone40/eggs/zope.testbrowser-3.6.0a2-py2.6.egg/zope/testbrowser/browser.py", line 365, in getControl
        label, name, self.mech_browser.forms(), include_subcontrols=True)
      File "build/bdist.linux-x86_64/egg/mechanize/_mechanize.py", line 424, in forms
      File "build/bdist.linux-x86_64/egg/mechanize/_mechanize.py", line 449, in viewing_html
    BrowserStateError: not viewing any document
----------------------------------------------------------------------
File "/home/stefan/autotest/temp/python26-zope212-cmf22-plone40/src/Products.PasswordResetTool/Products/PasswordResetTool/tests/browser.txt", line 339, in browser.txt
Failed example:
    "Your password has been set successfully." in browser.contents
Exception raised:
    Traceback (most recent call last):
      File "/home/stefan/autotest/temp/python26-zope212-cmf22-plone40/eggs/zope.testing-3.7.7-py2.6.egg/zope/testing/doctest.py", line 1361, in __run
        compileflags, 1) in test.globs
      File "<doctest browser.txt[line 339, example 125]>", line 1, in <module>
        "Your password has been set successfully." in browser.contents
      File "/home/stefan/autotest/temp/python26-zope212-cmf22-plone40/eggs/zope.testbrowser-3.6.0a2-py2.6.egg/zope/testbrowser/browser.py", line 201, in contents
        old_location = response.tell()
    AttributeError: 'NoneType' object has no attribute 'tell'
----------------------------------------------------------------------
File "/home/stefan/autotest/temp/python26-zope212-cmf22-plone40/src/Products.PasswordResetTool/Products/PasswordResetTool/tests/browser.txt", line 348, in browser.txt
Failed example:
    "You are now logged in" in browser.contents
Expected:
    True
Got:
    False
----------------------------------------------------------------------
File "/home/stefan/autotest/temp/python26-zope212-cmf22-plone40/src/Products.PasswordResetTool/Products/PasswordResetTool/tests/browser.txt", line 353, in browser.txt
Failed example:
    browser.getLink('Log out').click()
Exception raised:
    Traceback (most recent call last):
      File "/home/stefan/autotest/temp/python26-zope212-cmf22-plone40/eggs/zope.testing-3.7.7-py2.6.egg/zope/testing/doctest.py", line 1361, in __run
        compileflags, 1) in test.globs
      File "<doctest browser.txt[line 353, example 131]>", line 1, in <module>
        browser.getLink('Log out').click()
      File "/home/stefan/autotest/temp/python26-zope212-cmf22-plone40/eggs/zope.testbrowser-3.6.0a2-py2.6.egg/zope/testbrowser/browser.py", line 327, in getLink
        return Link(self.mech_browser.find_link(**args), self)
      File "build/bdist.linux-x86_64/egg/mechanize/_mechanize.py", line 626, in find_link
    LinkNotFoundError
----------------------------------------------------------------------
File "/home/stefan/autotest/temp/python26-zope212-cmf22-plone40/src/Products.PasswordResetTool/Products/PasswordResetTool/tests/browser.txt", line 354, in browser.txt
Failed example:
    "You are now logged out" in browser.contents
Expected:
    True
Got:
    False
----------------------------------------------------------------------
File "/home/stefan/autotest/temp/python26-zope212-cmf22-plone40/src/Products.PasswordResetTool/Products/PasswordResetTool/tests/browser.txt", line 415, in browser.txt
Failed example:
    browser.open(address)
Exception raised:
    Traceback (most recent call last):
      File "/home/stefan/autotest/temp/python26-zope212-cmf22-plone40/eggs/zope.testing-3.7.7-py2.6.egg/zope/testing/doctest.py", line 1361, in __run
        compileflags, 1) in test.globs
      File "<doctest browser.txt[line 415, example 159]>", line 1, in <module>
        browser.open(address)
      File "/home/stefan/autotest/temp/python26-zope212-cmf22-plone40/eggs/zope.testbrowser-3.6.0a2-py2.6.egg/zope/testbrowser/browser.py", line 239, in open
        self.mech_browser.open(url, data)
      File "build/bdist.linux-x86_64/egg/mechanize/_mechanize.py", line 209, in open
      File "build/bdist.linux-x86_64/egg/mechanize/_mechanize.py", line 236, in _mech_open
      File "build/bdist.linux-x86_64/egg/mechanize/_opener.py", line 191, in open
      File "/usr/local/python2.6/lib/python2.6/urllib2.py", line 407, in _open
        '_open', req)
      File "/usr/local/python2.6/lib/python2.6/urllib2.py", line 367, in _call_chain
        result = func(*args)
      File "/home/stefan/autotest/temp/python26-zope212-cmf22-plone40/eggs/Zope2-2.12.3-py2.6-linux-x86_64.egg/Products/Five/testbrowser.py", line 85, in http_open
        return self.do_open(PublisherConnection, req)
      File "/usr/local/python2.6/lib/python2.6/urllib2.py", line 1118, in do_open
        h.request(req.get_method(), req.get_selector(), req.data, headers)
      File "/home/stefan/autotest/temp/python26-zope212-cmf22-plone40/eggs/zope.testbrowser-3.6.0a2-py2.6.egg/zope/testbrowser/testing.py", line 82, in request
        self.response = self.caller(request_string, handle_errors)
      File "/home/stefan/autotest/temp/python26-zope212-cmf22-plone40/eggs/Zope2-2.12.3-py2.6-linux-x86_64.egg/Testing/ZopeTestCase/functional.py", line 40, in wrapped_func
        return func(*args, **kw)
      File "/home/stefan/autotest/temp/python26-zope212-cmf22-plone40/eggs/Zope2-2.12.3-py2.6-linux-x86_64.egg/Testing/ZopeTestCase/zopedoctest/functional.py", line 182, in http
        debug=not handle_errors,
      File "/home/stefan/autotest/temp/python26-zope212-cmf22-plone40/eggs/Zope2-2.12.3-py2.6-linux-x86_64.egg/ZPublisher/Test.py", line 204, in publish_module
        response = publish(request, module_name, after_list, debug=debug)
      File "/home/stefan/autotest/temp/python26-zope212-cmf22-plone40/eggs/Zope2-2.12.3-py2.6-linux-x86_64.egg/ZPublisher/Publish.py", line 165, in publish
        sys.exc_info()[2],
      File "/home/stefan/autotest/temp/python26-zope212-cmf22-plone40/eggs/Zope2-2.12.3-py2.6-linux-x86_64.egg/Zope2/App/startup.py", line 211, in __call__
        v = view()
      File "/home/stefan/autotest/temp/python26-zope212-cmf22-plone40/src/Products.PlonePAS/Products/PlonePAS/browser/unauthorized.py", line 15, in __call__
        raise self.context
    Unauthorized: You are not allowed to access 'PasswordResetTool' in this context
----------------------------------------------------------------------
File "/home/stefan/autotest/temp/python26-zope212-cmf22-plone40/src/Products.PasswordResetTool/Products/PasswordResetTool/tests/browser.txt", line 416, in browser.txt
Failed example:
    "Please fill out the form below to set your password" in browser.contents
Exception raised:
    Traceback (most recent call last):
      File "/home/stefan/autotest/temp/python26-zope212-cmf22-plone40/eggs/zope.testing-3.7.7-py2.6.egg/zope/testing/doctest.py", line 1361, in __run
        compileflags, 1) in test.globs
      File "<doctest browser.txt[line 416, example 160]>", line 1, in <module>
        "Please fill out the form below to set your password" in browser.contents
      File "/home/stefan/autotest/temp/python26-zope212-cmf22-plone40/eggs/zope.testbrowser-3.6.0a2-py2.6.egg/zope/testbrowser/browser.py", line 201, in contents
        old_location = response.tell()
    AttributeError: 'NoneType' object has no attribute 'tell'
----------------------------------------------------------------------
File "/home/stefan/autotest/temp/python26-zope212-cmf22-plone40/src/Products.PasswordResetTool/Products/PasswordResetTool/tests/browser.txt", line 418, in browser.txt
Failed example:
    browser.getControl(name='password').value = 'superstr0ng'
Exception raised:
    Traceback (most recent call last):
      File "/home/stefan/autotest/temp/python26-zope212-cmf22-plone40/eggs/zope.testing-3.7.7-py2.6.egg/zope/testing/doctest.py", line 1361, in __run
        compileflags, 1) in test.globs
      File "<doctest browser.txt[line 418, example 161]>", line 1, in <module>
        browser.getControl(name='password').value = 'superstr0ng'
      File "/home/stefan/autotest/temp/python26-zope212-cmf22-plone40/eggs/zope.testbrowser-3.6.0a2-py2.6.egg/zope/testbrowser/browser.py", line 365, in getControl
        label, name, self.mech_browser.forms(), include_subcontrols=True)
      File "build/bdist.linux-x86_64/egg/mechanize/_mechanize.py", line 424, in forms
      File "build/bdist.linux-x86_64/egg/mechanize/_mechanize.py", line 449, in viewing_html
    BrowserStateError: not viewing any document
----------------------------------------------------------------------
File "/home/stefan/autotest/temp/python26-zope212-cmf22-plone40/src/Products.PasswordResetTool/Products/PasswordResetTool/tests/browser.txt", line 419, in browser.txt
Failed example:
    browser.getControl(name='password2').value = 'superstr0ng'
Exception raised:
    Traceback (most recent call last):
      File "/home/stefan/autotest/temp/python26-zope212-cmf22-plone40/eggs/zope.testing-3.7.7-py2.6.egg/zope/testing/doctest.py", line 1361, in __run
        compileflags, 1) in test.globs
      File "<doctest browser.txt[line 419, example 162]>", line 1, in <module>
        browser.getControl(name='password2').value = 'superstr0ng'
      File "/home/stefan/autotest/temp/python26-zope212-cmf22-plone40/eggs/zope.testbrowser-3.6.0a2-py2.6.egg/zope/testbrowser/browser.py", line 365, in getControl
        label, name, self.mech_browser.forms(), include_subcontrols=True)
      File "build/bdist.linux-x86_64/egg/mechanize/_mechanize.py", line 424, in forms
      File "build/bdist.linux-x86_64/egg/mechanize/_mechanize.py", line 449, in viewing_html
    BrowserStateError: not viewing any document
----------------------------------------------------------------------
File "/home/stefan/autotest/temp/python26-zope212-cmf22-plone40/src/Products.PasswordResetTool/Products/PasswordResetTool/tests/browser.txt", line 420, in browser.txt
Failed example:
    browser.getControl("Set my password").click()
Exception raised:
    Traceback (most recent call last):
      File "/home/stefan/autotest/temp/python26-zope212-cmf22-plone40/eggs/zope.testing-3.7.7-py2.6.egg/zope/testing/doctest.py", line 1361, in __run
        compileflags, 1) in test.globs
      File "<doctest browser.txt[line 420, example 163]>", line 1, in <module>
        browser.getControl("Set my password").click()
      File "/home/stefan/autotest/temp/python26-zope212-cmf22-plone40/eggs/zope.testbrowser-3.6.0a2-py2.6.egg/zope/testbrowser/browser.py", line 365, in getControl
        label, name, self.mech_browser.forms(), include_subcontrols=True)
      File "build/bdist.linux-x86_64/egg/mechanize/_mechanize.py", line 424, in forms
      File "build/bdist.linux-x86_64/egg/mechanize/_mechanize.py", line 449, in viewing_html
    BrowserStateError: not viewing any document
----------------------------------------------------------------------
File "/home/stefan/autotest/temp/python26-zope212-cmf22-plone40/src/Products.PasswordResetTool/Products/PasswordResetTool/tests/browser.txt", line 421, in browser.txt
Failed example:
    "Your password has been set successfully." in browser.contents
Exception raised:
    Traceback (most recent call last):
      File "/home/stefan/autotest/temp/python26-zope212-cmf22-plone40/eggs/zope.testing-3.7.7-py2.6.egg/zope/testing/doctest.py", line 1361, in __run
        compileflags, 1) in test.globs
      File "<doctest browser.txt[line 421, example 164]>", line 1, in <module>
        "Your password has been set successfully." in browser.contents
      File "/home/stefan/autotest/temp/python26-zope212-cmf22-plone40/eggs/zope.testbrowser-3.6.0a2-py2.6.egg/zope/testbrowser/browser.py", line 201, in contents
        old_location = response.tell()
    AttributeError: 'NoneType' object has no attribute 'tell'
----------------------------------------------------------------------
File "/home/stefan/autotest/temp/python26-zope212-cmf22-plone40/src/Products.PasswordResetTool/Products/PasswordResetTool/tests/browser.txt", line 430, in browser.txt
Failed example:
    "You are now logged in" in browser.contents
Expected:
    True
Got:
    False
----------------------------------------------------------------------
File "/home/stefan/autotest/temp/python26-zope212-cmf22-plone40/src/Products.PasswordResetTool/Products/PasswordResetTool/tests/browser.txt", line 433, in browser.txt
Failed example:
    browser.getLink('Log out').click()
Exception raised:
    Traceback (most recent call last):
      File "/home/stefan/autotest/temp/python26-zope212-cmf22-plone40/eggs/zope.testing-3.7.7-py2.6.egg/zope/testing/doctest.py", line 1361, in __run
        compileflags, 1) in test.globs
      File "<doctest browser.txt[line 433, example 170]>", line 1, in <module>
        browser.getLink('Log out').click()
      File "/home/stefan/autotest/temp/python26-zope212-cmf22-plone40/eggs/zope.testbrowser-3.6.0a2-py2.6.egg/zope/testbrowser/browser.py", line 327, in getLink
        return Link(self.mech_browser.find_link(**args), self)
      File "build/bdist.linux-x86_64/egg/mechanize/_mechanize.py", line 626, in find_link
    LinkNotFoundError

  Ran 38 tests with 1 failures and 0 errors in 3.695 seconds.
Tearing down left over layers:
  Tear down Products.PloneTestCase.layer.PloneSite in 0.365 seconds.
  Tear down Products.PloneTestCase.layer.ZCML in 0.006 seconds.
  Tear down Testing.ZopeTestCase.layer.ZopeLite in 0.000 seconds.
Running Products.PloneTestCase.layer.PloneSite tests:
  Set up Testing.ZopeTestCase.layer.ZopeLite in 1.441 seconds.
  Set up Products.PloneTestCase.layer.ZCML in 2.448 seconds.
  Set up Products.PloneTestCase.layer.PloneSite in 3.895 seconds.
/home/stefan/autotest/temp/python26-zope212-cmf22-plone40/src/Products.PlonePAS/Products/PlonePAS/tools/membership.py:555: DeprecationWarning: credentialsChanged should be called with 'REQUEST' as second argument. The BBB code will be removed in CMF 2.3.
  self.credentialsChanged(password, REQUEST=REQUEST)
  Ran 61 tests with 0 failures and 0 errors in 1.257 seconds.
Tearing down left over layers:
  Tear down Products.PloneTestCase.layer.PloneSite in 0.372 seconds.
  Tear down Products.PloneTestCase.layer.ZCML in 0.004 seconds.
  Tear down Testing.ZopeTestCase.layer.ZopeLite in 0.000 seconds.
Running Products.PloneTestCase.layer.PloneSite tests:
  Set up Testing.ZopeTestCase.layer.ZopeLite in 1.429 seconds.
  Set up Products.PloneTestCase.layer.ZCML in 2.458 seconds.
  Set up Products.PloneTestCase.layer.PloneSite in 4.091 seconds.
  Ran 245 tests with 0 failures and 0 errors in 17.934 seconds.
Running zope.testing.testrunner.layer.UnitTests tests:
  Tear down Products.PloneTestCase.layer.PloneSite in 0.384 seconds.
  Tear down Products.PloneTestCase.layer.ZCML in 0.005 seconds.
  Tear down Testing.ZopeTestCase.layer.ZopeLite in 0.000 seconds.
  Set up zope.testing.testrunner.layer.UnitTests in 0.000 seconds.
  Ran 59 tests with 0 failures and 0 errors in 0.013 seconds.
Tearing down left over layers:
  Tear down zope.testing.testrunner.layer.UnitTests in 0.000 seconds.
Total: 304 tests, 0 failures, 0 errors in 26.741 seconds.
Running Products.PloneTestCase.layer.PloneSite tests:
  Set up Testing.ZopeTestCase.layer.ZopeLite in 1.425 seconds.
  Set up Products.PloneTestCase.layer.ZCML in 2.436 seconds.
  Set up Products.PloneTestCase.layer.PloneSite in 3.884 seconds.
  Ran 78 tests with 0 failures and 0 errors in 2.974 seconds.
Tearing down left over layers:
  Tear down Products.PloneTestCase.layer.PloneSite in 0.371 seconds.
  Tear down Products.PloneTestCase.layer.ZCML in 0.007 seconds.
  Tear down Testing.ZopeTestCase.layer.ZopeLite in 0.000 seconds.
Running zope.testing.testrunner.layer.UnitTests tests:
  Set up zope.testing.testrunner.layer.UnitTests in 0.000 seconds.
  Ran 76 tests with 0 failures and 0 errors in 1.542 seconds.
Tearing down left over layers:
  Tear down zope.testing.testrunner.layer.UnitTests in 0.000 seconds.
Running Products.contentmigration.tests.layer.TestLayer tests:
  Set up Testing.ZopeTestCase.layer.ZopeLite in 1.428 seconds.
  Set up Products.PloneTestCase.layer.ZCML in 2.431 seconds.
  Set up Products.PloneTestCase.layer.PloneSite in 3.883 seconds.
  Set up Products.contentmigration.tests.layer.TestLayer in 0.002 seconds.
  Ran 18 tests with 0 failures and 0 errors in 4.968 seconds.
Tearing down left over layers:
  Tear down Products.contentmigration.tests.layer.TestLayer in 0.000 seconds.
  Tear down Products.PloneTestCase.layer.PloneSite in 0.364 seconds.
  Tear down Products.PloneTestCase.layer.ZCML in 0.004 seconds.
  Tear down Testing.ZopeTestCase.layer.ZopeLite in 0.000 seconds.
Total: 0 tests, 0 failures, 0 errors in 0.000 seconds.
Running archetypes.referencebrowserwidget.tests.base.layer tests:
  Set up Testing.ZopeTestCase.layer.ZopeLite in 0.000 seconds.
  Set up Products.PloneTestCase.layer.ZCML in 1.883 seconds.
  Set up Products.PloneTestCase.layer.PloneSite in 4.100 seconds.
  Set up archetypes.referencebrowserwidget.tests.base.layer in 0.000 seconds.
  Ran 43 tests with 0 failures and 0 errors in 7.788 seconds.
Running zope.testing.testrunner.layer.UnitTests tests:
  Tear down archetypes.referencebrowserwidget.tests.base.layer in 0.000 seconds.
  Tear down Products.PloneTestCase.layer.PloneSite in 0.380 seconds.
  Tear down Products.PloneTestCase.layer.ZCML in 0.007 seconds.
  Tear down Testing.ZopeTestCase.layer.ZopeLite in 0.000 seconds.
  Set up zope.testing.testrunner.layer.UnitTests in 0.000 seconds.
  Ran 4 tests with 0 failures and 0 errors in 0.001 seconds.
Tearing down left over layers:
  Tear down zope.testing.testrunner.layer.UnitTests in 0.000 seconds.
Total: 47 tests, 0 failures, 0 errors in 14.616 seconds.
Running archetypes.schemaextender.tests.testIntegration.layer tests:
  Set up Testing.ZopeTestCase.layer.ZopeLite in 1.323 seconds.
  Set up Products.PloneTestCase.layer.ZCML in 2.481 seconds.
  Set up Products.PloneTestCase.layer.PloneSite in 3.886 seconds.
  Set up archetypes.schemaextender.tests.testIntegration.layer in 0.000 seconds.
  Ran 17 tests with 0 failures and 0 errors in 3.022 seconds.
Running zope.testing.testrunner.layer.UnitTests tests:
  Tear down archetypes.schemaextender.tests.testIntegration.layer in 0.000 seconds.
  Tear down Products.PloneTestCase.layer.PloneSite in 0.369 seconds.
  Tear down Products.PloneTestCase.layer.ZCML in 0.007 seconds.
  Tear down Testing.ZopeTestCase.layer.ZopeLite in 0.000 seconds.
  Set up zope.testing.testrunner.layer.UnitTests in 0.000 seconds.
  Ran 19 tests with 0 failures and 0 errors in 0.007 seconds.
Tearing down left over layers:
  Tear down zope.testing.testrunner.layer.UnitTests in 0.000 seconds.
Total: 36 tests, 0 failures, 0 errors in 11.531 seconds.
Running zope.testing.testrunner.layer.UnitTests tests:
  Set up zope.testing.testrunner.layer.UnitTests in 0.000 seconds.
  Ran 4 tests with 0 failures and 0 errors in 0.039 seconds.
Tearing down left over layers:
  Tear down zope.testing.testrunner.layer.UnitTests in 0.000 seconds.
Running Testing.ZopeTestCase.layer.ZopeLite tests:
  Set up Testing.ZopeTestCase.layer.ZopeLite in 0.068 seconds.
  Ran 40 tests with 0 failures and 0 errors in 0.779 seconds.
Tearing down left over layers:
  Tear down Testing.ZopeTestCase.layer.ZopeLite in 0.000 seconds.
Running Testing.ZopeTestCase.layer.ZopeLite tests:
  Set up Testing.ZopeTestCase.layer.ZopeLite in 0.034 seconds.
  Ran 40 tests with 0 failures and 0 errors in 1.053 seconds.
Running zope.testing.testrunner.layer.UnitTests tests:
  Tear down Testing.ZopeTestCase.layer.ZopeLite in 0.000 seconds.
  Set up zope.testing.testrunner.layer.UnitTests in 0.000 seconds.
  Ran 1 tests with 0 failures and 0 errors in 0.111 seconds.
Tearing down left over layers:
  Tear down zope.testing.testrunner.layer.UnitTests in 0.000 seconds.
Total: 41 tests, 0 failures, 0 errors in 1.452 seconds.
/home/stefan/autotest/temp/python26-zope212-cmf22-plone40/src/kss.core/kss/core/tests/test_kssview_core.py:165: UserWarning: The test_class you are using doesn't subclass from ZopeTestCase.Functional. Please fix that.
  tearDown=KSSViewTestCase.beforeTearDown.im_func))
Running Testing.ZopeTestCase.layer.ZopeLite tests:
  Set up Testing.ZopeTestCase.layer.ZopeLite in 0.046 seconds.
  Ran 1 tests with 0 failures and 0 errors in 0.262 seconds.
Running kss.core.tests.base.KSSLayer tests:
  Tear down Testing.ZopeTestCase.layer.ZopeLite in 0.000 seconds.
  Set up kss.core.tests.base.KSSCoreLayer in 0.031 seconds.
  Set up kss.core.tests.base.KSSLayer in 0.056 seconds.
  Ran 29 tests with 0 failures and 0 errors in 0.153 seconds.
Running kss.core.tests.test_ttwapi.layer tests:
  Set up kss.core.tests.test_ttwapi.layer in 0.001 seconds.
  Ran 3 tests with 0 failures and 0 errors in 0.026 seconds.
Running zope.testing.testrunner.layer.UnitTests tests:
  Tear down kss.core.tests.test_ttwapi.layer in 0.000 seconds.
  Tear down kss.core.tests.base.KSSLayer in 0.000 seconds.
  Tear down kss.core.tests.base.KSSCoreLayer in 0.000 seconds.
  Set up zope.testing.testrunner.layer.UnitTests in 0.000 seconds.
/home/stefan/autotest/temp/python26-zope212-cmf22-plone40/src/kss.core/kss/core/siteview.txt:1: DeprecationWarning: ISite is deprecated. Moved to zope.location.interfaces. Importing from here will stop working in Zope 3.6
  =========
  Ran 14 tests with 0 failures and 0 errors in 0.009 seconds.
Tearing down left over layers:
  Tear down zope.testing.testrunner.layer.UnitTests in 0.000 seconds.
Total: 47 tests, 0 failures, 0 errors in 0.893 seconds.
***********************************************
WARNING: LinguaPlone not found. Skipping tests.
***********************************************
***********************************************
WARNING: LinguaPlone not found. Skipping tests.
***********************************************
Running plone.app.blob.tests.layer.BlobLayer tests:
  Set up Testing.ZopeTestCase.layer.ZopeLite in 0.937 seconds.
  Set up Products.PloneTestCase.layer.ZCML in 2.854 seconds.
  Set up Products.PloneTestCase.layer.PloneSite in 4.298 seconds.
  Set up plone.app.blob.tests.layer.BlobLayer in 0.095 seconds.
/home/stefan/autotest/temp/python26-zope212-cmf22-plone40/eggs/Products.PortalTransforms-2.0b2-py2.6.egg/Products/PortalTransforms/libtransforms/commandtransform.py:97: DeprecationWarning: os.popen4 is deprecated.  Use the subprocess module.
  cin, couterr = os.popen4(command, 'b')
  Ran 29 tests with 0 failures and 0 errors in 7.769 seconds.
Running plone.app.blob.tests.layer.BlobReplacementLayer tests:
  Set up plone.app.blob.tests.layer.BlobReplacementLayer in 0.197 seconds.
  Ran 45 tests with 0 failures and 0 errors in 12.919 seconds.
Running zope.testing.testrunner.layer.UnitTests tests:
  Tear down plone.app.blob.tests.layer.BlobReplacementLayer in 0.000 seconds.
  Tear down plone.app.blob.tests.layer.BlobLayer in 0.000 seconds.
  Tear down Products.PloneTestCase.layer.PloneSite in 0.365 seconds.
  Tear down Products.PloneTestCase.layer.ZCML in 0.009 seconds.
  Tear down Testing.ZopeTestCase.layer.ZopeLite in 0.000 seconds.
  Set up zope.testing.testrunner.layer.UnitTests in 0.000 seconds.
  Ran 2 tests with 0 failures and 0 errors in 0.001 seconds.
Tearing down left over layers:
  Tear down zope.testing.testrunner.layer.UnitTests in 0.000 seconds.
Total: 76 tests, 0 failures, 0 errors in 30.179 seconds.
Running Testing.ZopeTestCase.layer.ZopeLite tests:
  Set up Testing.ZopeTestCase.layer.ZopeLite in 1.008 seconds.
  Ran 2 tests with 0 failures and 0 errors in 0.008 seconds.
Running plone.app.folder.tests.layer.IntegrationLayer tests:
  Set up Products.PloneTestCase.layer.ZCML in 2.982 seconds.
  Set up Products.PloneTestCase.layer.PloneSite in 3.845 seconds.
  Set up plone.app.folder.tests.layer.IntegrationLayer in 0.090 seconds.
  Ran 12 tests with 0 failures and 0 errors in 2.446 seconds.
Running plone.app.folder.tests.layer.PartialOrderingIntegrationLayer tests:
  Set up plone.app.folder.tests.layer.PartialOrderingIntegrationLayer in 0.000 seconds.
  Ran 3 tests with 0 failures and 0 errors in 0.330 seconds.
Tearing down left over layers:
  Tear down plone.app.folder.tests.layer.PartialOrderingIntegrationLayer in 0.000 seconds.
  Tear down plone.app.folder.tests.layer.IntegrationLayer in 0.000 seconds.
  Tear down Products.PloneTestCase.layer.PloneSite in 0.377 seconds.
  Tear down Products.PloneTestCase.layer.ZCML in 0.004 seconds.
  Tear down Testing.ZopeTestCase.layer.ZopeLite in 0.000 seconds.
Total: 17 tests, 0 failures, 0 errors in 11.673 seconds.
Running plone.app.imaging.tests.layer.ImagingLayer tests:
  Set up Testing.ZopeTestCase.layer.ZopeLite in 0.937 seconds.
  Set up Products.PloneTestCase.layer.ZCML in 2.459 seconds.
  Set up Products.PloneTestCase.layer.PloneSite in 3.955 seconds.
  Set up plone.app.imaging.tests.layer.ImagingLayer in 0.094 seconds.
  Ran 37 tests with 0 failures and 0 errors in 4.179 seconds.
Running zope.testing.testrunner.layer.UnitTests tests:
  Tear down plone.app.imaging.tests.layer.ImagingLayer in 0.000 seconds.
  Tear down Products.PloneTestCase.layer.PloneSite in 0.386 seconds.
  Tear down Products.PloneTestCase.layer.ZCML in 0.005 seconds.
  Tear down Testing.ZopeTestCase.layer.ZopeLite in 0.000 seconds.
  Set up zope.testing.testrunner.layer.UnitTests in 0.000 seconds.
  Ran 7 tests with 0 failures and 0 errors in 0.001 seconds.
Tearing down left over layers:
  Tear down zope.testing.testrunner.layer.UnitTests in 0.000 seconds.
Total: 44 tests, 0 failures, 0 errors in 12.460 seconds.
Running Products.PloneTestCase.layer.PloneSite tests:
  Set up Testing.ZopeTestCase.layer.ZopeLite in 1.459 seconds.
  Set up Products.PloneTestCase.layer.ZCML in 2.534 seconds.
  Set up Products.PloneTestCase.layer.PloneSite in 4.184 seconds.
  Ran 9 tests with 0 failures and 0 errors in 0.129 seconds.
Tearing down left over layers:
  Tear down Products.PloneTestCase.layer.PloneSite in 0.367 seconds.
  Tear down Products.PloneTestCase.layer.ZCML in 0.004 seconds.
  Tear down Testing.ZopeTestCase.layer.ZopeLite in 0.000 seconds.
Total: 0 tests, 0 failures, 0 errors in 0.000 seconds.
Running Products.PloneTestCase.layer.PloneSite tests:
  Set up Testing.ZopeTestCase.layer.ZopeLite in 1.471 seconds.
  Set up Products.PloneTestCase.layer.ZCML in 2.384 seconds.
  Set up Products.PloneTestCase.layer.PloneSite in 3.921 seconds.
  Ran 3 tests with 0 failures and 0 errors in 0.700 seconds.
Tearing down left over layers:
  Tear down Products.PloneTestCase.layer.PloneSite in 0.361 seconds.
  Tear down Products.PloneTestCase.layer.ZCML in 0.004 seconds.
  Tear down Testing.ZopeTestCase.layer.ZopeLite in 0.000 seconds.
Running Products.PloneTestCase.layer.PloneSite tests:
  Set up Testing.ZopeTestCase.layer.ZopeLite in 1.395 seconds.
  Set up Products.PloneTestCase.layer.ZCML in 2.480 seconds.
  Set up Products.PloneTestCase.layer.PloneSite in 3.919 seconds.
  Ran 9 tests with 0 failures and 0 errors in 4.265 seconds.
Tearing down left over layers:
  Tear down Products.PloneTestCase.layer.PloneSite in 0.366 seconds.
  Tear down Products.PloneTestCase.layer.ZCML in 0.006 seconds.
  Tear down Testing.ZopeTestCase.layer.ZopeLite in 0.000 seconds.
Running plone.folder.tests.layer.PloneFolderLayer tests:
  Set up plone.folder.tests.layer.PloneFolderLayer in 0.007 seconds.
  Ran 70 tests with 0 failures and 0 errors in 5.620 seconds.
Tearing down left over layers:
  Tear down plone.folder.tests.layer.PloneFolderLayer in 0.000 seconds.
Running Products.PloneTestCase.layer.PloneSite tests:
  Set up Testing.ZopeTestCase.layer.ZopeLite in 1.451 seconds.
  Set up Products.PloneTestCase.layer.ZCML in 2.520 seconds.
  Set up Products.PloneTestCase.layer.PloneSite in 4.131 seconds.
  Ran 41 tests with 0 failures and 0 errors in 0.371 seconds.
Tearing down left over layers:
  Tear down Products.PloneTestCase.layer.PloneSite in 0.363 seconds.
  Tear down Products.PloneTestCase.layer.ZCML in 0.004 seconds.
  Tear down Testing.ZopeTestCase.layer.ZopeLite in 0.000 seconds.
Total: 0 tests, 0 failures, 0 errors in 0.000 seconds.
Total: 0 tests, 0 failures, 0 errors in 0.000 seconds.
Running Products.PloneTestCase.layer.ZCML tests:
  Set up Testing.ZopeTestCase.layer.ZopeLite in 0.940 seconds.
  Set up Products.PloneTestCase.layer.ZCML in 2.497 seconds.
/home/stefan/autotest/temp/python26-zope212-cmf22-plone40/eggs/wicked-1.1.8alpha1-py2.6.egg/wicked/cache.py:34: DeprecationWarning: object.__init__() takes no parameters
  super(CacheStore, self).__init__(self)
  Ran 16 tests with 0 failures and 0 errors in 0.052 seconds.
Running wicked.at.tests.wickedtestcase.WickedSite tests:
  Set up Products.PloneTestCase.layer.PloneSite in 4.711 seconds.
  Set up wicked.at.tests.wickedtestcase.WickedSite in 0.002 seconds.
/home/stefan/autotest/temp/python26-zope212-cmf22-plone40/eggs/Zope2-2.12.3-py2.6-linux-x86_64.egg/OFS/subscribers.py:73: DeprecationWarning: wicked.atcontent.ironicwiki.IronicWiki.manage_afterAdd is discouraged. You should use event subscribers instead.
  DeprecationWarning)
/home/stefan/autotest/temp/python26-zope212-cmf22-plone40/eggs/Zope2-2.12.3-py2.6-linux-x86_64.egg/OFS/subscribers.py:73: DeprecationWarning: wicked.atcontent.ironicwiki.IronicWiki.manage_beforeDelete is discouraged. You should use event subscribers instead.
  DeprecationWarning)
/home/stefan/autotest/temp/python26-zope212-cmf22-plone40/eggs/Zope2-2.12.3-py2.6-linux-x86_64.egg/OFS/subscribers.py:73: DeprecationWarning: wicked.atcontent.ironicwiki.IronicWiki.manage_afterClone is discouraged. You should use event subscribers instead.
  DeprecationWarning)
  Ran 23 tests with 0 failures and 0 errors in 5.864 seconds.
Running wicked.at.tests.test_scope.Scoped tests:
  Set up wicked.at.tests.test_scope.Scoped in 0.000 seconds.
  Ran 3 tests with 0 failures and 0 errors in 0.640 seconds.
Running wicked.plone.tests.SelectiveATCT tests:
  Tear down wicked.at.tests.test_scope.Scoped in 0.000 seconds.
  Tear down wicked.at.tests.wickedtestcase.WickedSite in 0.002 seconds.
  Set up wicked.plone.tests.SelectiveATCT in 0.003 seconds.
  Ran 22 tests with 0 failures and 0 errors in 6.035 seconds.
Running wicked.plone.tests.ZCMLLayer tests:
  Tear down wicked.plone.tests.SelectiveATCT in 0.004 seconds.
  Set up wicked.plone.tests.ZCMLLayer in 0.020 seconds.
  Ran 8 tests with 0 failures and 0 errors in 0.746 seconds.
Running zope.testing.testrunner.layer.UnitTests tests:
  Tear down wicked.plone.tests.ZCMLLayer in 0.396 seconds.
  Tear down Products.PloneTestCase.layer.PloneSite in 0.001 seconds.
  Tear down Products.PloneTestCase.layer.ZCML in 0.004 seconds.
  Tear down Testing.ZopeTestCase.layer.ZopeLite in 0.000 seconds.
  Set up zope.testing.testrunner.layer.UnitTests in 0.000 seconds.
  Ran 34 tests with 0 failures and 0 errors in 0.016 seconds.
Tearing down left over layers:
  Tear down zope.testing.testrunner.layer.UnitTests in 0.000 seconds.
Total: 106 tests, 0 failures, 0 errors in 23.194 seconds.
#### Running tests for group ATCT ####
#### Finished tests for group ATCT ####

#### Running tests for group Archetypes ####
#### Finished tests for group Archetypes ####

#### Running tests for group CMF ####
#### Finished tests for group CMF ####

#### Running tests for group CMFEditions ####
#### Finished tests for group CMFEditions ####

#### Running tests for group Plone ####
#### Finished tests for group Plone ####

#### Running tests for group PlonePAS ####
#### Finished tests for group PlonePAS ####

#### Running tests for group plone ####
#### Finished tests for group plone ####

#### Running tests for group portlets ####
#### Finished tests for group portlets ####

#### Running tests for group z3c.autoinclude ####
#### Finished tests for group z3c.autoinclude ####

#### Running tests for Products.CMFPlacefulWorkflow ####
#### Finished tests for Products.CMFPlacefulWorkflow ####

#### Running tests for Products.CMFTestCase ####
#### Finished tests for Products.CMFTestCase ####

#### Running tests for Products.ExtendedPathIndex ####
#### Finished tests for Products.ExtendedPathIndex ####

#### Running tests for Products.PasswordResetTool ####
#### Finished tests for Products.PasswordResetTool ####

#### Running tests for Products.PloneTestCase ####
#### Finished tests for Products.PloneTestCase ####

#### Running tests for Products.ResourceRegistries ####
#### Finished tests for Products.ResourceRegistries ####

#### Running tests for Products.TinyMCE ####
#### Finished tests for Products.TinyMCE ####

#### Running tests for Products.ZopeVersionControl ####
#### Finished tests for Products.ZopeVersionControl ####

#### Running tests for Products.contentmigration ####
#### Finished tests for Products.contentmigration ####

#### Running tests for Products.i18ntestcase ####
#### Finished tests for Products.i18ntestcase ####

#### Running tests for archetypes.referencebrowserwidget ####
#### Finished tests for archetypes.referencebrowserwidget ####

#### Running tests for archetypes.schemaextender ####
#### Finished tests for archetypes.schemaextender ####

#### Running tests for collective.monkeypatcher ####
#### Finished tests for collective.monkeypatcher ####

#### Running tests for five.customerize ####
#### Finished tests for five.customerize ####

#### Running tests for five.formlib ####
#### Finished tests for five.formlib ####

#### Running tests for kss.core ####
#### Finished tests for kss.core ####

#### Running tests for plone.app.blob ####
#### Finished tests for plone.app.blob ####

#### Running tests for plone.app.folder ####
#### Finished tests for plone.app.folder ####

#### Running tests for plone.app.imaging ####
#### Finished tests for plone.app.imaging ####

#### Running tests for plone.app.jquerytools ####
#### Finished tests for plone.app.jquerytools ####

#### Running tests for plone.app.locales ####
#### Finished tests for plone.app.locales ####

#### Running tests for plone.app.openid ####
#### Finished tests for plone.app.openid ####

#### Running tests for plone.app.users ####
#### Finished tests for plone.app.users ####

#### Running tests for plone.folder ####
#### Finished tests for plone.folder ####

#### Running tests for plone.stringinterp ####
#### Finished tests for plone.stringinterp ####

#### Running tests for plonetheme.classic ####
#### Finished tests for plonetheme.classic ####

#### Running tests for plonetheme.sunburst ####
#### Finished tests for plonetheme.sunburst ####

#### Running tests for wicked ####
#### Finished tests for wicked ####

Packages with test failures:

Failing tests in group Archetypes
Failing tests in group Plone
Failing tests in group PlonePAS
Failing tests in Products.PasswordResetTool

Total time elapsed: 895.098 seconds

Grand total: 90 packages, 4 failures


FAILED (90 packages, 4 failures)




More information about the Testbot mailing list