[Testbot] FAILED (90 packages, 3 failures) : Plone-4.0 Zope-2.12 Python-2.6.4

Plone Tests plone-tests at epy.co.at
Sat Feb 6 02:39:59 UTC 2010


Plone Tests : FAILED (90 packages, 3 failures)
Plone-4.0 Zope-2.12 Python-2.6.4

Running ./bin/alltests -q --no-color --no-progress
Running Products.CMFTestCase.layer.CMFSite tests:
  Set up Testing.ZopeTestCase.layer.ZopeLite in 1.051 seconds.
  Set up Products.CMFTestCase.layer.ZCML in 3.002 seconds.
  Set up Products.CMFTestCase.layer.CMFSite in 1.473 seconds.
  Ran 31 tests with 0 failures and 0 errors in 0.557 seconds.
Running Products.PloneTestCase.layer.PloneSite tests:
  Tear down Products.CMFTestCase.layer.CMFSite in 0.068 seconds.
  Tear down Products.CMFTestCase.layer.ZCML in 0.004 seconds.
  Set up Products.PloneTestCase.layer.ZCML in 1.724 seconds.
  Set up Products.PloneTestCase.layer.PloneSite in 3.701 seconds.


Failure in test test_discussion (Products.ATContentTypes.tests.test_atfolder.TestATFolderFunctional)
Traceback (most recent call last):
  File "/usr/local/python2.6/lib/python2.6/unittest.py", line 279, in run
    testMethod()
  File "/home/stefan/autotest/temp/python26-zope212-cmf22-plone40/src/Products.ATContentTypes/Products/ATContentTypes/tests/atctftestcase.py", line 140, in test_discussion
    self.failUnlessEqual(response.getStatus(), 200) # ok
  File "/usr/local/python2.6/lib/python2.6/unittest.py", line 350, in failUnlessEqual
    (msg or '%r != %r' % (first, second))
AssertionError: 500 != 200



Failure in test test_discussion (Products.ATContentTypes.tests.test_atfolder.TestATBTreeFolderFunctional)
Traceback (most recent call last):
  File "/usr/local/python2.6/lib/python2.6/unittest.py", line 279, in run
    testMethod()
  File "/home/stefan/autotest/temp/python26-zope212-cmf22-plone40/src/Products.ATContentTypes/Products/ATContentTypes/tests/atctftestcase.py", line 140, in test_discussion
    self.failUnlessEqual(response.getStatus(), 200) # ok
  File "/usr/local/python2.6/lib/python2.6/unittest.py", line 350, in failUnlessEqual
    (msg or '%r != %r' % (first, second))
AssertionError: 500 != 200



Failure in test test_discussion (Products.ATContentTypes.tests.test_atlink.TestATLinkFunctional)
Traceback (most recent call last):
  File "/usr/local/python2.6/lib/python2.6/unittest.py", line 279, in run
    testMethod()
  File "/home/stefan/autotest/temp/python26-zope212-cmf22-plone40/src/Products.ATContentTypes/Products/ATContentTypes/tests/atctftestcase.py", line 140, in test_discussion
    self.failUnlessEqual(response.getStatus(), 200) # ok
  File "/usr/local/python2.6/lib/python2.6/unittest.py", line 350, in failUnlessEqual
    (msg or '%r != %r' % (first, second))
AssertionError: 500 != 200



Failure in test test_discussion (Products.ATContentTypes.tests.test_attopic.TestATTopicFunctional)
Traceback (most recent call last):
  File "/usr/local/python2.6/lib/python2.6/unittest.py", line 279, in run
    testMethod()
  File "/home/stefan/autotest/temp/python26-zope212-cmf22-plone40/src/Products.ATContentTypes/Products/ATContentTypes/tests/atctftestcase.py", line 140, in test_discussion
    self.failUnlessEqual(response.getStatus(), 200) # ok
  File "/usr/local/python2.6/lib/python2.6/unittest.py", line 350, in failUnlessEqual
    (msg or '%r != %r' % (first, second))
AssertionError: 500 != 200

  Ran 712 tests with 4 failures and 0 errors in 1 minutes 12.703 seconds.
Tearing down left over layers:
  Tear down Products.PloneTestCase.layer.PloneSite in 0.370 seconds.
  Tear down Products.PloneTestCase.layer.ZCML in 0.010 seconds.
  Tear down Testing.ZopeTestCase.layer.ZopeLite in 0.000 seconds.
Total: 743 tests, 4 failures, 0 errors in 1 minutes 25.172 seconds.
Running Testing.ZopeTestCase.layer.ZopeLite tests:
  Set up Testing.ZopeTestCase.layer.ZopeLite in 0.823 seconds.
  Ran 36 tests with 0 failures and 0 errors in 0.082 seconds.
Running Products.Archetypes.tests.layer.ZCML tests:
  Set up Products.CMFCore.testing.FunctionalZCMLLayer in 0.191 seconds.
  Set up Products.Archetypes.tests.layer.ZCML in 0.179 seconds.
  Ran 59 tests with 0 failures and 0 errors in 1.183 seconds.
Running Products.Archetypes.tests.layer.ArchetypesSite tests:
  Set up Products.Archetypes.tests.layer.ArchetypesSite in 1.430 seconds.
/home/stefan/autotest/temp/python26-zope212-cmf22-plone40/eggs/Zope2-2.12.3-py2.6-linux-x86_64.egg/OFS/subscribers.py:73: DeprecationWarning: Products.Archetypes.tests.test_classgen.Dummy.manage_afterAdd is discouraged. You should use event subscribers instead.
  DeprecationWarning)
/home/stefan/autotest/temp/python26-zope212-cmf22-plone40/eggs/Zope2-2.12.3-py2.6-linux-x86_64.egg/OFS/subscribers.py:73: DeprecationWarning: Products.Archetypes.tests.test_annotation.AnnDummy.manage_afterAdd is discouraged. You should use event subscribers instead.
  DeprecationWarning)
/home/stefan/autotest/temp/python26-zope212-cmf22-plone40/eggs/Zope2-2.12.3-py2.6-linux-x86_64.egg/OFS/subscribers.py:73: DeprecationWarning: Products.Archetypes.tests.test_event.Dummy.manage_afterAdd is discouraged. You should use event subscribers instead.
  DeprecationWarning)


Failure in test testSame (Products.PortalTransforms.tests.test_transforms.TransformTestSubclass)
Traceback (most recent call last):
  File "/usr/local/python2.6/lib/python2.6/unittest.py", line 279, in run
    testMethod()
  File "/home/stefan/autotest/temp/python26-zope212-cmf22-plone40/eggs/Products.PortalTransforms-2.0b2-py2.6.egg/Products/PortalTransforms/tests/test_transforms.py", line 68, in testSame
    self.do_convert(filename=self.input)
  File "/home/stefan/autotest/temp/python26-zope212-cmf22-plone40/eggs/Products.PortalTransforms-2.0b2-py2.6.egg/Products/PortalTransforms/tests/test_transforms.py", line 60, in do_convert
    got, expected, self.transform.name(), self.input))
  File "/usr/local/python2.6/lib/python2.6/unittest.py", line 350, in failUnlessEqual
    (msg or '%r != %r' % (first, second))
AssertionError: [BM®      6   (               x                ÿÿÿûùøþýùÿÿûÿÿøóñéóòèÿÿöòòæîîâÞÜÒØÕÍÖÒÍìèãøóðÿýùÿÿþíîìÿÿþÿÿþóôòÿÿþüýûüýûÿýüÿÿþÿüøòïêúøðÿÿù÷öìÕÔÊ×ÖÌåäÚôòêìêâëèãàÝØÖÓÏÆÂÁâàßÿÿþîïíúûùÿÿþòóñûüúþÿýüø÷ùöòÿÿûÿÿûöôìÐÎÆÏÎÄêéßæåÛÛÚÐÛÙÑÈƾØÕÐØÕÑñíìôòñåãâÉÊÈýþüÿÿþïðîÿÿþúûùõöôÿú÷ÿÿüúöñáÝØàÝÕñïåèçÝÌËÁõôêíìâÿýõÿÿ÷ÿÿûéæâÛ×ÖËÉÈÍËÊïðîÏÐÎãäâÿÿþóôòüýûüýûÿÿüöñîðìçîëãÝÚÒÎÌÂãâØÿÿøçæÜÞÝÓåãÛñïçÿÿüÿþúÿÿþÿÿþòóñÉÊÈßàÞÚÛÙ×ØÖüýûÿÿþÿÿþÿÿüùôñáÝØÑÎÆßÜÔüúðÿÿöööêèçÝëêàßÝÕÜÚÒÝÜØø÷óÿÿþÿÿÿóôòùúøÓÔÒÑÒÐäåãæçåúûùÿÿþÿýøíéäÝÙÔáÞÖïìä÷õíúøðùúñÐÑÈíîåéçßãàÛÛØÓÿÿûÿÿüú÷óÿÿüòóïëìèßàÜÛÜØéêæóôðûüøÿüó×ÒÉîëãÑÎÆÿýøÿÿüüýùøù÷ÞßÝàáÝàßÛíêåÕÓËÿÿøöñèÿÿõþüôÿÿùÿÿùÄżëìãÊËÂÿÿûÿÿùùóèÜØÍêåÜÝÛÓÿýøÿÿûÿÿþøúú¼¾¾ßàÞåäàÙÙÓÜÙÑþüòÿüñÿÿ÷ÿÿ÷ÿÿøö÷í÷øîâãÙàá×âãÚýþõéãÖåáÖâÝÔðîæÿþùýüøÿÿþüýûÿÿþö÷õâáÝììæÿÿùçåÛ×ÐÇÓÎÅÞÝÓüýóÿÿøÿÿøÂúòóêÜÝÔüýôÜÖÉíêÜØÖËÿÿöÿÿøúúôÿÿüýþüýþüòóñîíéÿÿüÿÿûÏÌÄâÜÕïéâÛÚÐàá×ÿÿøôõëÅƽñòéáâÙúûò×ÔÅïìÞÔÒÇÿÿøÿÿøùùóÿÿüÿÿûÿÿþÿÿþÿÿþÿÿûÑÌÉÒÎÉùóîãßÚýûóÉÊÀ÷øïýþõåæÝèéàÏÏÉýý÷ÝÚËêéÛÓÒÄÿÿöÿÿ÷ûùñÿÿûÿþúÿýüòðïõñðÿþýäßÜïêçüõòÜ×ÔäâÚØÙÏÿÿ÷ÿÿù×ØÏæçÞÈÈÂÿÿûæå×åäÖÔÓÅøøìÿÿöüúòÿÿûÿýøÿÿüøõñÿÿþÿÿþüø÷ÔÐÏËÆÅÛÖÕÐÍÈö÷îÿÿùúûòÃýêêäÕÕÏÿÿûîìááàÒÕÕÉððäÿÿöýüòÿþöÿü÷æãßÖÓÏØÔÓ¸´³ÿÿþÿÿþðêëû÷öÿÿûÿÿùûüóæçÞÛÛÕîîèÚÚÔýý÷ÿÿøÌÌÀüûñ¾½³ýüòúùïÿÿùÿþöÎÊÅùõðâßÛìéåÉÅÄÿÿþÿúûþúùÿÿüööðÿÿûËËÅîîèÍÍÇÿÿüúùõðîæòðèáß×åãÛø÷íÿÿöîëãõòêàÝÕîêåÛ×ÒñîêÜÙÕÿþýöòñÿûúÿÿüèèâÿÿûÆÆÀììæààÚýüøÿÿûÿÿüÿÿûÍÊÅòïêÊÇ¿æãÛÿÿøúõìËƽñîæòïçåáÜÓÐËÿüøÿÿüÿÿüøøòüüöÇÇÁééãÞÝÙòñíÿÿûÿÿüøööÿÿÿóïîÇÄÀÿÿûÄÁ¹úõìñìãøóêÍÈ¿º¸®ÛØÐýûóÿÿûþþøÿÿûööðÍÍÇççáÔÔÎõôðÿþú÷öòÿÿüþýÿþýÿæãåÿþÿÆÁ¾îêåäÞ×äÝÔêäÙÿÿöÿÿ÷ÿÿøýüòö÷îéêáËÍÇ××ÑéèäÈÇÃýüø÷öòûúöÿÿþþüûÿüÿÿýÿÿûÿðíïîéèñíèÒÊÃîèÝëåÚËȺÀ½¯ÌÌÀÚÚÎÓÔÊÝáÖóöíããÝÍÌÈÿÿüäãßÿÿüûúöýûúÿýü÷öÿòïøÿýÿÿýÿý÷øÿÿüìäÝßÙÎÚÔÉõòäÿüîòòäßßÑßáÕ×ÛÏÐÔÉççáûúöñðìÿÿüþýùüû÷ÿÿþûùøýüÿýüÿü÷ÿõñöÿþÿÿüùÿýöÿþóý÷ìéæØÌɺÏÐÀÕÕÇìñâíñåïõêýý÷ÿÿûÿÿüúùõúùõÿÿüÿþýþüû]

!=

[BM®      6   (               x                ÿÿþûùøÿüûÿÿüÿÿúóñéóòèÿÿöòòæîíãÞÜÒØÕÍÖÓËìèãøóðÿüùÿÿþíîìÿÿþÿÿþóôòÿÿþüýûüýûÿýüÿÿþÿüøòïêúøðÿÿù÷öìÕÔÊ×ÖÌåäÚôóéìêâëèãáÜÙ×ÒÏÇ¿àáßÿÿþîïíúûùÿÿþòóñûüúþÿýüø÷ùöòÿÿüÿÿûöôìÐÏÅÏÎÄêéßæåÛÛÚÐÛÙÑÈƾØÕÐØÕÑñíìöòñãäâÉÊÈýþüÿÿþïðîÿÿþúûùõöôÿú÷ÿÿüúöñáÝØàÝÕðïåèçÝÌÌÀõôêíìâÿýõÿþùÿÿûéæâÛ×ÖÍÉÈËÌÊïðîÏÐÎãäâÿÿþóôòüýûüýûÿÿüöñîðìçîëãÝÚÒÎÌÂãâØÿÿ÷çæÜÞÝÓåãÛñîéÿÿüÿýüÿÿþÿÿÿòóñÉÊÈßàÞÚÛÙ×ØÖüýûÿÿþÿÿþÿÿüùõðáÝØÑÎÆßÜÔüúðÿÿ÷ööêèçÝëêàßÝÕÜÙÔÝÜØøöõÿÿþÿÿÿóôòùúøÓÔÒÑÒÐäåãæçåúûùÿÿþÿüùíéäÝÙÔáÞÖïíãøöìûùïûûïÒÑÇïîäéçßãàÛÙØÔÿÿþÿÿþøööÿÿþòóñëìêßàÞÛÜÚéêèóôòûüúÿýòÙÓÈðëâÑÎÆÿýùÿÿþüýûöøøÜÞÞàáßÞßÛíêåÖÓËÿÿ÷øòçÿÿòüýóÿÿøÿÿøÄÅ»ëìâÊËÁÿÿùÿÿ÷ùóèÞØÍêåÜÞÛÓÿýøÿÿûÿÿþøúú¼¾¾ßàÞåäàÛØÓÜÙÑÿûòÿüñÿÿ÷ÿÿ÷ÿÿøö÷í÷øîâãÙàá×âãÚýþõéãÖçáÖâÞÓñîæÿþùýüøÿÿþúýûýÿÿö÷õâàßîëçÿÿûéãÜ×ÐÇÕÏÄÜÝÓüýóÿÿøÿÿøÂùòóêÜÝÔüýôÜÖÉíêÜÚÖËÿÿöÿÿøúúôÿÿüýþüýþüòóñîìëÿÿüÿÿûÑËÆâÜÕñéâÙÚÐàá×ÿÿøôõëÅƽñòéáâÙúûò×ÔÅïìÞÔÓÅÿÿ÷ÿÿøùùóÿÿüþÿûÿÿþÿÿþÿÿþÿþýÑÌÉÒÍÊùóîåßÚûüòÉÊÀ÷øîýþõåæÝèéàÏÐÇýý÷ÝÚËìéÚÓÒÄÿÿöÿÿ÷ùúñÿÿûÿþúÿþúòðïóñðÿþýäßÞïêçüõòÞ×ÔâãÙØÙÏÿÿ÷ÿÿù×ØÏæçÞÈÈÂÿÿûææÖåäÖÔÓÅøøìÿÿöüûñÿÿùþþøÿÿüöõñÿÿþÿÿþüø÷ÕÐÏËÆÅÛÖÕÎÏÆö÷îÿÿùúûòÃÄ»êêäÕÕÏÿÿûîíßáàÒÕÕÇððäÿÿõýüòÿþöÿü÷æãÞÖÓÏØÕѸ´³ÿÿþÿÿþðêëüö÷ÿÿùÿÿùûüóæçÞÛÛÕîîèÚÚÔýý÷ÿÿ÷ÌÌÀüüð¾¾²ýüòúùïÿÿùÿþöÎÊÅùõðâßÛìéåÉÅÄÿÿþÿúûþùúÿÿùö÷îÿÿûËËÅîîèÍÍÇÿÿûúùõîïæðñèáàÖåäÚø÷íÿÿöîìâõòêàÝÕîëãÛ×ÒñîêÜÙÕÿþýôòñýûúÿÿûèèâÿÿûÆÆÀììæààÚýüøÿÿûÿÿüÿÿúËËÅòïêÊÇ¿æãÛÿÿøúõìËƽóîåòïçåáÜÓÐËýüøÿÿüÿÿþøøòüüöÇÇÁééãÞÞØòñíÿÿûÿÿüöööÿÿþñïîÇÄÀÿÿûÄÁ¹úõìñìãøôéÍÈ¿º¸®ÛØÐýûóÿÿûþþøÿÿüööðÍÍÇççáÔÓÏõôðÿþú÷öòÿÿþþýÿþýÿæääÿÿþÆÁ¾ðêåäßÖäÞÓêäÙÿÿöÿÿ÷ÿÿ÷ýüòö÷îçêáËÎÅ××ÑééãÈÇÃýüø÷öòûúöÿÿþþüûýüÿÿýÿÿûÿòíîîéèóíèÒËÂîèÝëåØÍǺÀ½¯Í̾ÚÚÎÓÕÉÝáÖñ÷ìãâÞÍÌÈÿÿüäãßÿÿüûúöýûúÿýü÷öÿòïøÿýÿÿþÿýø÷ÿÿûìäÝßÙÎÚÔÇ÷ñäÿüíóòäßßÑßáÕ×ÛÏÎÕÈçæâûúöñðìÿÿüþýùüúùÿÿþûùøýûÿÿûÿú÷ÿ÷ñöÿþÿÿüùÿýöÿþóý÷êëæ×ÌɺÐÐÀÕÕÇìñâíñåïöéýüøÿÿûÿÿüúùõúùõÿÿþÿþýþüû]

IN image_to_bmp(/home/stefan/autotest/temp/python26-zope212-cmf22-plone40/eggs/Products.PortalTransforms-2.0b2-py2.6.egg/Products/PortalTransforms/tests/input/logo.jpg)



Failure in test testSameNoFilename (Products.PortalTransforms.tests.test_transforms.TransformTestSubclass)
Traceback (most recent call last):
  File "/usr/local/python2.6/lib/python2.6/unittest.py", line 279, in run
    testMethod()
  File "/home/stefan/autotest/temp/python26-zope212-cmf22-plone40/eggs/Products.PortalTransforms-2.0b2-py2.6.egg/Products/PortalTransforms/tests/test_transforms.py", line 74, in testSameNoFilename
    self.do_convert()
  File "/home/stefan/autotest/temp/python26-zope212-cmf22-plone40/eggs/Products.PortalTransforms-2.0b2-py2.6.egg/Products/PortalTransforms/tests/test_transforms.py", line 60, in do_convert
    got, expected, self.transform.name(), self.input))
  File "/usr/local/python2.6/lib/python2.6/unittest.py", line 350, in failUnlessEqual
    (msg or '%r != %r' % (first, second))
AssertionError: [BM®      6   (               x                ÿÿÿûùøþýùÿÿûÿÿøóñéóòèÿÿöòòæîîâÞÜÒØÕÍÖÒÍìèãøóðÿýùÿÿþíîìÿÿþÿÿþóôòÿÿþüýûüýûÿýüÿÿþÿüøòïêúøðÿÿù÷öìÕÔÊ×ÖÌåäÚôòêìêâëèãàÝØÖÓÏÆÂÁâàßÿÿþîïíúûùÿÿþòóñûüúþÿýüø÷ùöòÿÿûÿÿûöôìÐÎÆÏÎÄêéßæåÛÛÚÐÛÙÑÈƾØÕÐØÕÑñíìôòñåãâÉÊÈýþüÿÿþïðîÿÿþúûùõöôÿú÷ÿÿüúöñáÝØàÝÕñïåèçÝÌËÁõôêíìâÿýõÿÿ÷ÿÿûéæâÛ×ÖËÉÈÍËÊïðîÏÐÎãäâÿÿþóôòüýûüýûÿÿüöñîðìçîëãÝÚÒÎÌÂãâØÿÿøçæÜÞÝÓåãÛñïçÿÿüÿþúÿÿþÿÿþòóñÉÊÈßàÞÚÛÙ×ØÖüýûÿÿþÿÿþÿÿüùôñáÝØÑÎÆßÜÔüúðÿÿöööêèçÝëêàßÝÕÜÚÒÝÜØø÷óÿÿþÿÿÿóôòùúøÓÔÒÑÒÐäåãæçåúûùÿÿþÿýøíéäÝÙÔáÞÖïìä÷õíúøðùúñÐÑÈíîåéçßãàÛÛØÓÿÿûÿÿüú÷óÿÿüòóïëìèßàÜÛÜØéêæóôðûüøÿüó×ÒÉîëãÑÎÆÿýøÿÿüüýùøù÷ÞßÝàáÝàßÛíêåÕÓËÿÿøöñèÿÿõþüôÿÿùÿÿùÄżëìãÊËÂÿÿûÿÿùùóèÜØÍêåÜÝÛÓÿýøÿÿûÿÿþøúú¼¾¾ßàÞåäàÙÙÓÜÙÑþüòÿüñÿÿ÷ÿÿ÷ÿÿøö÷í÷øîâãÙàá×âãÚýþõéãÖåáÖâÝÔðîæÿþùýüøÿÿþüýûÿÿþö÷õâáÝììæÿÿùçåÛ×ÐÇÓÎÅÞÝÓüýóÿÿøÿÿøÂúòóêÜÝÔüýôÜÖÉíêÜØÖËÿÿöÿÿøúúôÿÿüýþüýþüòóñîíéÿÿüÿÿûÏÌÄâÜÕïéâÛÚÐàá×ÿÿøôõëÅƽñòéáâÙúûò×ÔÅïìÞÔÒÇÿÿøÿÿøùùóÿÿüÿÿûÿÿþÿÿþÿÿþÿÿûÑÌÉÒÎÉùóîãßÚýûóÉÊÀ÷øïýþõåæÝèéàÏÏÉýý÷ÝÚËêéÛÓÒÄÿÿöÿÿ÷ûùñÿÿûÿþúÿýüòðïõñðÿþýäßÜïêçüõòÜ×ÔäâÚØÙÏÿÿ÷ÿÿù×ØÏæçÞÈÈÂÿÿûæå×åäÖÔÓÅøøìÿÿöüúòÿÿûÿýøÿÿüøõñÿÿþÿÿþüø÷ÔÐÏËÆÅÛÖÕÐÍÈö÷îÿÿùúûòÃýêêäÕÕÏÿÿûîìááàÒÕÕÉððäÿÿöýüòÿþöÿü÷æãßÖÓÏØÔÓ¸´³ÿÿþÿÿþðêëû÷öÿÿûÿÿùûüóæçÞÛÛÕîîèÚÚÔýý÷ÿÿøÌÌÀüûñ¾½³ýüòúùïÿÿùÿþöÎÊÅùõðâßÛìéåÉÅÄÿÿþÿúûþúùÿÿüööðÿÿûËËÅîîèÍÍÇÿÿüúùõðîæòðèáß×åãÛø÷íÿÿöîëãõòêàÝÕîêåÛ×ÒñîêÜÙÕÿþýöòñÿûúÿÿüèèâÿÿûÆÆÀììæààÚýüøÿÿûÿÿüÿÿûÍÊÅòïêÊÇ¿æãÛÿÿøúõìËƽñîæòïçåáÜÓÐËÿüøÿÿüÿÿüøøòüüöÇÇÁééãÞÝÙòñíÿÿûÿÿüøööÿÿÿóïîÇÄÀÿÿûÄÁ¹úõìñìãøóêÍÈ¿º¸®ÛØÐýûóÿÿûþþøÿÿûööðÍÍÇççáÔÔÎõôðÿþú÷öòÿÿüþýÿþýÿæãåÿþÿÆÁ¾îêåäÞ×äÝÔêäÙÿÿöÿÿ÷ÿÿøýüòö÷îéêáËÍÇ××ÑéèäÈÇÃýüø÷öòûúöÿÿþþüûÿüÿÿýÿÿûÿðíïîéèñíèÒÊÃîèÝëåÚËȺÀ½¯ÌÌÀÚÚÎÓÔÊÝáÖóöíããÝÍÌÈÿÿüäãßÿÿüûúöýûúÿýü÷öÿòïøÿýÿÿýÿý÷øÿÿüìäÝßÙÎÚÔÉõòäÿüîòòäßßÑßáÕ×ÛÏÐÔÉççáûúöñðìÿÿüþýùüû÷ÿÿþûùøýüÿýüÿü÷ÿõñöÿþÿÿüùÿýöÿþóý÷ìéæØÌɺÏÐÀÕÕÇìñâíñåïõêýý÷ÿÿûÿÿüúùõúùõÿÿüÿþýþüû]

!=

[BM®      6   (               x                ÿÿþûùøÿüûÿÿüÿÿúóñéóòèÿÿöòòæîíãÞÜÒØÕÍÖÓËìèãøóðÿüùÿÿþíîìÿÿþÿÿþóôòÿÿþüýûüýûÿýüÿÿþÿüøòïêúøðÿÿù÷öìÕÔÊ×ÖÌåäÚôóéìêâëèãáÜÙ×ÒÏÇ¿àáßÿÿþîïíúûùÿÿþòóñûüúþÿýüø÷ùöòÿÿüÿÿûöôìÐÏÅÏÎÄêéßæåÛÛÚÐÛÙÑÈƾØÕÐØÕÑñíìöòñãäâÉÊÈýþüÿÿþïðîÿÿþúûùõöôÿú÷ÿÿüúöñáÝØàÝÕðïåèçÝÌÌÀõôêíìâÿýõÿþùÿÿûéæâÛ×ÖÍÉÈËÌÊïðîÏÐÎãäâÿÿþóôòüýûüýûÿÿüöñîðìçîëãÝÚÒÎÌÂãâØÿÿ÷çæÜÞÝÓåãÛñîéÿÿüÿýüÿÿþÿÿÿòóñÉÊÈßàÞÚÛÙ×ØÖüýûÿÿþÿÿþÿÿüùõðáÝØÑÎÆßÜÔüúðÿÿ÷ööêèçÝëêàßÝÕÜÙÔÝÜØøöõÿÿþÿÿÿóôòùúøÓÔÒÑÒÐäåãæçåúûùÿÿþÿüùíéäÝÙÔáÞÖïíãøöìûùïûûïÒÑÇïîäéçßãàÛÙØÔÿÿþÿÿþøööÿÿþòóñëìêßàÞÛÜÚéêèóôòûüúÿýòÙÓÈðëâÑÎÆÿýùÿÿþüýûöøøÜÞÞàáßÞßÛíêåÖÓËÿÿ÷øòçÿÿòüýóÿÿøÿÿøÄÅ»ëìâÊËÁÿÿùÿÿ÷ùóèÞØÍêåÜÞÛÓÿýøÿÿûÿÿþøúú¼¾¾ßàÞåäàÛØÓÜÙÑÿûòÿüñÿÿ÷ÿÿ÷ÿÿøö÷í÷øîâãÙàá×âãÚýþõéãÖçáÖâÞÓñîæÿþùýüøÿÿþúýûýÿÿö÷õâàßîëçÿÿûéãÜ×ÐÇÕÏÄÜÝÓüýóÿÿøÿÿøÂùòóêÜÝÔüýôÜÖÉíêÜÚÖËÿÿöÿÿøúúôÿÿüýþüýþüòóñîìëÿÿüÿÿûÑËÆâÜÕñéâÙÚÐàá×ÿÿøôõëÅƽñòéáâÙúûò×ÔÅïìÞÔÓÅÿÿ÷ÿÿøùùóÿÿüþÿûÿÿþÿÿþÿÿþÿþýÑÌÉÒÍÊùóîåßÚûüòÉÊÀ÷øîýþõåæÝèéàÏÐÇýý÷ÝÚËìéÚÓÒÄÿÿöÿÿ÷ùúñÿÿûÿþúÿþúòðïóñðÿþýäßÞïêçüõòÞ×ÔâãÙØÙÏÿÿ÷ÿÿù×ØÏæçÞÈÈÂÿÿûææÖåäÖÔÓÅøøìÿÿöüûñÿÿùþþøÿÿüöõñÿÿþÿÿþüø÷ÕÐÏËÆÅÛÖÕÎÏÆö÷îÿÿùúûòÃÄ»êêäÕÕÏÿÿûîíßáàÒÕÕÇððäÿÿõýüòÿþöÿü÷æãÞÖÓÏØÕѸ´³ÿÿþÿÿþðêëüö÷ÿÿùÿÿùûüóæçÞÛÛÕîîèÚÚÔýý÷ÿÿ÷ÌÌÀüüð¾¾²ýüòúùïÿÿùÿþöÎÊÅùõðâßÛìéåÉÅÄÿÿþÿúûþùúÿÿùö÷îÿÿûËËÅîîèÍÍÇÿÿûúùõîïæðñèáàÖåäÚø÷íÿÿöîìâõòêàÝÕîëãÛ×ÒñîêÜÙÕÿþýôòñýûúÿÿûèèâÿÿûÆÆÀììæààÚýüøÿÿûÿÿüÿÿúËËÅòïêÊÇ¿æãÛÿÿøúõìËƽóîåòïçåáÜÓÐËýüøÿÿüÿÿþøøòüüöÇÇÁééãÞÞØòñíÿÿûÿÿüöööÿÿþñïîÇÄÀÿÿûÄÁ¹úõìñìãøôéÍÈ¿º¸®ÛØÐýûóÿÿûþþøÿÿüööðÍÍÇççáÔÓÏõôðÿþú÷öòÿÿþþýÿþýÿæääÿÿþÆÁ¾ðêåäßÖäÞÓêäÙÿÿöÿÿ÷ÿÿ÷ýüòö÷îçêáËÎÅ××ÑééãÈÇÃýüø÷öòûúöÿÿþþüûýüÿÿýÿÿûÿòíîîéèóíèÒËÂîèÝëåØÍǺÀ½¯Í̾ÚÚÎÓÕÉÝáÖñ÷ìãâÞÍÌÈÿÿüäãßÿÿüûúöýûúÿýü÷öÿòïøÿýÿÿþÿýø÷ÿÿûìäÝßÙÎÚÔÇ÷ñäÿüíóòäßßÑßáÕ×ÛÏÎÕÈçæâûúöñðìÿÿüþýùüúùÿÿþûùøýûÿÿûÿú÷ÿ÷ñöÿþÿÿüùÿýöÿþóý÷êëæ×ÌɺÐÐÀÕÕÇìñâíñåïöéýüøÿÿûÿÿüúùõúùõÿÿþÿþýþüû]

IN image_to_bmp(/home/stefan/autotest/temp/python26-zope212-cmf22-plone40/eggs/Products.PortalTransforms-2.0b2-py2.6.egg/Products/PortalTransforms/tests/input/logo.jpg)



Failure in test testSame (Products.PortalTransforms.tests.test_transforms.TransformTestSubclass)
Traceback (most recent call last):
  File "/usr/local/python2.6/lib/python2.6/unittest.py", line 279, in run
    testMethod()
  File "/home/stefan/autotest/temp/python26-zope212-cmf22-plone40/eggs/Products.PortalTransforms-2.0b2-py2.6.egg/Products/PortalTransforms/tests/test_transforms.py", line 68, in testSame
    self.do_convert(filename=self.input)
  File "/home/stefan/autotest/temp/python26-zope212-cmf22-plone40/eggs/Products.PortalTransforms-2.0b2-py2.6.egg/Products/PortalTransforms/tests/test_transforms.py", line 60, in do_convert
    got, expected, self.transform.name(), self.input))
  File "/usr/local/python2.6/lib/python2.6/unittest.py", line 350, in failUnlessEqual
    (msg or '%r != %r' % (first, second))
AssertionError: [ÿØÿà JFIF      ÿÛ C     $.' ",#(7),01444'9=82<.342ÿÛ C  2!!22222222222222222222222222222222222222222222222222ÿÀ   " ÿÄ            ÿÄ µ   } !1AQa"q2‘¡#B±ÁRÑð$3br‚ %&'()*456789:CDEFGHIJSTUVWXYZcdefghijstuvwxyzƒ„…†‡ˆ‰Š’“”•–—˜™š¢£¤¥¦§¨©ª²³´µ¶·¸¹ºÂÃÄÅÆÇÈÉÊÒÓÔÕÖ×ØÙÚáâãäåæçèéêñòóôõö÷øùúÿÄ         ÿÄ µ  w !1AQaq"2B‘¡±Á #3RðbrÑ $4á%ñ&'()*56789:CDEFGHIJSTUVWXYZcdefghijstuvwxyz‚ƒ„…†‡ˆ‰Š’“”•–—˜™š¢£¤¥¦§¨©ª²³´µ¶·¸¹ºÂÃÄÅÆÇÈÉÊÒÓÔÕÖ×ØÙÚâãäåæçèéêòóôõö÷øùúÿÚ    ? ÷ ¦šâw‚±T|Î?ϨÇý1UmbYåÆéÙ7ÇxÓ¹ïÍYÓ0¢elyŠÿ 1ü1ŸÌ5Dí»VÑJC2 Ø]qÁÏUäA=´ò¤æÚ|ÏÊÜò9#úþGêJ…ÑĶi!&p>nrq¸OÐ7äh¤ÊD÷Ò¤­qlØr>e=ùÀôÍS¶™’R–ñ/™ŒmÜ[hüp=;þ´QM+’ôeÛ{WIL³îß’ý?Ï­QRZ?ÿÙ]

!=

[ÿØÿà JFIF      ÿÛ C     $.' ",#(7),01444'9=82<.342ÿÛ C  2!!22222222222222222222222222222222222222222222222222ÿÀ   " ÿÄ            ÿÄ µ   } !1AQa"q2‘¡#B±ÁRÑð$3br‚ %&'()*456789:CDEFGHIJSTUVWXYZcdefghijstuvwxyzƒ„…†‡ˆ‰Š’“”•–—˜™š¢£¤¥¦§¨©ª²³´µ¶·¸¹ºÂÃÄÅÆÇÈÉÊÒÓÔÕÖ×ØÙÚáâãäåæçèéêñòóôõö÷øùúÿÄ         ÿÄ µ  w !1AQaq"2B‘¡±Á #3RðbrÑ $4á%ñ&'()*56789:CDEFGHIJSTUVWXYZcdefghijstuvwxyz‚ƒ„…†‡ˆ‰Š’“”•–—˜™š¢£¤¥¦§¨©ª²³´µ¶·¸¹ºÂÃÄÅÆÇÈÉÊÒÓÔÕÖ×ØÙÚâãäåæçèéêòóôõö÷øùúÿÚ    ? ÷ ¦šâw‚±T|Î?ϨÇý1UmbYåÆéÙ7ÇxÓ¹ïÍYÓ0¢elyŠÿ 1ü1ŸÌ5Dí»VÑJC2 Ø]qÁÏUäC'¶žTœÛO‚Ùù[žG$_ÈýIPº8–Í$$ÎÍÎN7Éúü™HžâÚT•®-›Ģ¡ÿ 8™ªvÓ2JRÞ%ó1»‹mŽ§ÖŠ)­Izmí]%2Ìw»~Kôÿ <~´QEIgÿÙ]

IN image_to_jpeg(/home/stefan/autotest/temp/python26-zope212-cmf22-plone40/eggs/Products.PortalTransforms-2.0b2-py2.6.egg/Products/PortalTransforms/tests/input/logo.gif)



Failure in test testSameNoFilename (Products.PortalTransforms.tests.test_transforms.TransformTestSubclass)
Traceback (most recent call last):
  File "/usr/local/python2.6/lib/python2.6/unittest.py", line 279, in run
    testMethod()
  File "/home/stefan/autotest/temp/python26-zope212-cmf22-plone40/eggs/Products.PortalTransforms-2.0b2-py2.6.egg/Products/PortalTransforms/tests/test_transforms.py", line 74, in testSameNoFilename
    self.do_convert()
  File "/home/stefan/autotest/temp/python26-zope212-cmf22-plone40/eggs/Products.PortalTransforms-2.0b2-py2.6.egg/Products/PortalTransforms/tests/test_transforms.py", line 60, in do_convert
    got, expected, self.transform.name(), self.input))
  File "/usr/local/python2.6/lib/python2.6/unittest.py", line 350, in failUnlessEqual
    (msg or '%r != %r' % (first, second))
AssertionError: [ÿØÿà JFIF      ÿÛ C     $.' ",#(7),01444'9=82<.342ÿÛ C  2!!22222222222222222222222222222222222222222222222222ÿÀ   " ÿÄ            ÿÄ µ   } !1AQa"q2‘¡#B±ÁRÑð$3br‚ %&'()*456789:CDEFGHIJSTUVWXYZcdefghijstuvwxyzƒ„…†‡ˆ‰Š’“”•–—˜™š¢£¤¥¦§¨©ª²³´µ¶·¸¹ºÂÃÄÅÆÇÈÉÊÒÓÔÕÖ×ØÙÚáâãäåæçèéêñòóôõö÷øùúÿÄ         ÿÄ µ  w !1AQaq"2B‘¡±Á #3RðbrÑ $4á%ñ&'()*56789:CDEFGHIJSTUVWXYZcdefghijstuvwxyz‚ƒ„…†‡ˆ‰Š’“”•–—˜™š¢£¤¥¦§¨©ª²³´µ¶·¸¹ºÂÃÄÅÆÇÈÉÊÒÓÔÕÖ×ØÙÚâãäåæçèéêòóôõö÷øùúÿÚ    ? ÷ ¦šâw‚±T|Î?ϨÇý1UmbYåÆéÙ7ÇxÓ¹ïÍYÓ0¢elyŠÿ 1ü1ŸÌ5Dí»VÑJC2 Ø]qÁÏUäA=´ò¤æÚ|ÏÊÜò9#úþGêJ…ÑĶi!&p>nrq¸OÐ7äh¤ÊD÷Ò¤­qlØr>e=ùÀôÍS¶™’R–ñ/™ŒmÜ[hüp=;þ´QM+’ôeÛ{WIL³îß’ý?Ï­QRZ?ÿÙ]

!=

[ÿØÿà JFIF      ÿÛ C     $.' ",#(7),01444'9=82<.342ÿÛ C  2!!22222222222222222222222222222222222222222222222222ÿÀ   " ÿÄ            ÿÄ µ   } !1AQa"q2‘¡#B±ÁRÑð$3br‚ %&'()*456789:CDEFGHIJSTUVWXYZcdefghijstuvwxyzƒ„…†‡ˆ‰Š’“”•–—˜™š¢£¤¥¦§¨©ª²³´µ¶·¸¹ºÂÃÄÅÆÇÈÉÊÒÓÔÕÖ×ØÙÚáâãäåæçèéêñòóôõö÷øùúÿÄ         ÿÄ µ  w !1AQaq"2B‘¡±Á #3RðbrÑ $4á%ñ&'()*56789:CDEFGHIJSTUVWXYZcdefghijstuvwxyz‚ƒ„…†‡ˆ‰Š’“”•–—˜™š¢£¤¥¦§¨©ª²³´µ¶·¸¹ºÂÃÄÅÆÇÈÉÊÒÓÔÕÖ×ØÙÚâãäåæçèéêòóôõö÷øùúÿÚ    ? ÷ ¦šâw‚±T|Î?ϨÇý1UmbYåÆéÙ7ÇxÓ¹ïÍYÓ0¢elyŠÿ 1ü1ŸÌ5Dí»VÑJC2 Ø]qÁÏUäC'¶žTœÛO‚Ùù[žG$_ÈýIPº8–Í$$ÎÍÎN7Éúü™HžâÚT•®-›Ģ¡ÿ 8™ªvÓ2JRÞ%ó1»‹mŽ§ÖŠ)­Izmí]%2Ìw»~Kôÿ <~´QEIgÿÙ]

IN image_to_jpeg(/home/stefan/autotest/temp/python26-zope212-cmf22-plone40/eggs/Products.PortalTransforms-2.0b2-py2.6.egg/Products/PortalTransforms/tests/input/logo.gif)

  Ran 517 tests with 4 failures and 0 errors in 36.496 seconds.
Running Products.PloneTestCase.layer.PloneSite tests:
  Tear down Products.Archetypes.tests.layer.ArchetypesSite in 0.071 seconds.
  Tear down Products.Archetypes.tests.layer.ZCML in 0.005 seconds.
  Tear down Products.CMFCore.testing.FunctionalZCMLLayer in 0.000 seconds.
  Set up Products.PloneTestCase.layer.ZCML in 2.378 seconds.
  Set up Products.PloneTestCase.layer.PloneSite in 3.732 seconds.
  Ran 9 tests with 0 failures and 0 errors in 1.086 seconds.
Running plone.app.kss.tests.kss_and_plone_layer.KSSAndPloneLayer tests:
  Set up plone.app.kss.tests.kss_and_plone_layer.KSSAndPloneLayer in 0.005 seconds.


Error in test testVersionPreviewIsNotInlineEditable (archetypes.kss.tests.test_fields.FieldsViewTestCase)
Traceback (most recent call last):
  File "/usr/local/python2.6/lib/python2.6/unittest.py", line 279, in run
    testMethod()
  File "/home/stefan/autotest/temp/python26-zope212-cmf22-plone40/eggs/archetypes.kss-1.6.0a1-py2.6.egg/archetypes/kss/tests/test_fields.py", line 278, in testVersionPreviewIsNotInlineEditable
    klass = tag['class']
TypeError: 'NoneType' object is unsubscriptable

  Ran 19 tests with 0 failures and 1 errors in 1.351 seconds.
Running zope.testing.testrunner.layer.UnitTests tests:
  Tear down plone.app.kss.tests.kss_and_plone_layer.KSSAndPloneLayer in 0.000 seconds.
  Tear down Products.PloneTestCase.layer.PloneSite in 0.363 seconds.
  Tear down Products.PloneTestCase.layer.ZCML in 0.005 seconds.
  Tear down Testing.ZopeTestCase.layer.ZopeLite in 0.000 seconds.
  Set up zope.testing.testrunner.layer.UnitTests in 0.000 seconds.
/home/stefan/autotest/temp/python26-zope212-cmf22-plone40/src/Products.Archetypes/Products/Archetypes/ClassGen.py:152: UserWarning: The method 'makeFoo' was already protected by a different permission than the one declared on the field. Assuming that the explicit permission declared is the correct one and has preference over the permission declared on the field.
  self.handle_mode(klass, generator, type, field, mode)
  Ran 28 tests with 0 failures and 0 errors in 0.193 seconds.
Tearing down left over layers:
  Tear down zope.testing.testrunner.layer.UnitTests in 0.000 seconds.
Total: 668 tests, 4 failures, 1 errors in 50.947 seconds.
Running Testing.ZopeTestCase.layer.ZopeLite tests:
  Set up Testing.ZopeTestCase.layer.ZopeLite in 0.091 seconds.
  Ran 283 tests with 0 failures and 0 errors in 1.311 seconds.
Running Products.CMFCalendar.testing.FunctionalLayer tests:
  Set up Products.CMFCore.testing.FunctionalZCMLLayer in 0.167 seconds.
  Set up Products.CMFCalendar.testing.FunctionalLayer in 0.325 seconds.
  Ran 24 tests with 0 failures and 0 errors in 1.529 seconds.
Running Products.CMFCore.testing.EventZCMLLayer tests:
  Tear down Products.CMFCalendar.testing.FunctionalLayer in 0.028 seconds.
  Tear down Products.CMFCore.testing.FunctionalZCMLLayer in 0.001 seconds.
  Set up Products.CMFCore.testing.EventZCMLLayer in 0.001 seconds.
  Ran 8 tests with 0 failures and 0 errors in 0.200 seconds.
Running Products.CMFCore.testing.ExportImportZCMLLayer tests:
  Tear down Products.CMFCore.testing.EventZCMLLayer in 0.000 seconds.
  Set up Products.CMFCore.testing.ExportImportZCMLLayer in 0.001 seconds.
  Ran 10 tests with 0 failures and 0 errors in 0.932 seconds.
Running Products.CMFCore.testing.TraversingEventZCMLLayer tests:
  Tear down Products.CMFCore.testing.ExportImportZCMLLayer in 0.000 seconds.
  Set up Products.CMFCore.testing.TraversingEventZCMLLayer in 0.001 seconds.
  Ran 5 tests with 0 failures and 0 errors in 0.159 seconds.
Running Products.CMFDefault.testing.FunctionalLayer tests:
  Tear down Products.CMFCore.testing.TraversingEventZCMLLayer in 0.000 seconds.
  Set up Products.CMFCore.testing.FunctionalZCMLLayer in 0.153 seconds.
  Set up Products.CMFDefault.testing.FunctionalLayer in 0.242 seconds.
  Ran 76 tests with 0 failures and 0 errors in 3.914 seconds.
Running Products.CMFUid.testing.UidEventZCMLLayer tests:
  Tear down Products.CMFDefault.testing.FunctionalLayer in 0.025 seconds.
  Tear down Products.CMFCore.testing.FunctionalZCMLLayer in 0.002 seconds.
  Set up Products.CMFUid.testing.UidEventZCMLLayer in 0.001 seconds.
  Ran 12 tests with 0 failures and 0 errors in 0.323 seconds.
Running Products.DCWorkflow.testing.ExportImportZCMLLayer tests:
  Tear down Products.CMFUid.testing.UidEventZCMLLayer in 0.000 seconds.
  Set up Products.DCWorkflow.testing.ExportImportZCMLLayer in 0.141 seconds.
  Ran 38 tests with 0 failures and 0 errors in 0.738 seconds.
Running Products.GenericSetup.testing.ExportImportZCMLLayer tests:
  Tear down Products.DCWorkflow.testing.ExportImportZCMLLayer in 0.000 seconds.
  Set up Products.GenericSetup.testing.ExportImportZCMLLayer in 0.082 seconds.
  Ran 186 tests with 0 failures and 0 errors in 0.591 seconds.
Running zope.testing.testrunner.layer.UnitTests tests:
  Tear down Products.GenericSetup.testing.ExportImportZCMLLayer in 0.000 seconds.
  Tear down Testing.ZopeTestCase.layer.ZopeLite in 0.000 seconds.
  Set up zope.testing.testrunner.layer.UnitTests in 0.000 seconds.
  Ran 346 tests with 0 failures and 0 errors in 0.258 seconds.
Tearing down left over layers:
  Tear down zope.testing.testrunner.layer.UnitTests in 0.000 seconds.
Total: 988 tests, 0 failures, 0 errors in 12.500 seconds.
Running Testing.ZopeTestCase.layer.ZopeLite tests:
  Set up Testing.ZopeTestCase.layer.ZopeLite in 0.926 seconds.
  Ran 27 tests with 0 failures and 0 errors in 0.056 seconds.
Running Products.PloneTestCase.layer.PloneSite tests:
  Set up Products.PloneTestCase.layer.ZCML in 2.442 seconds.
  Set up Products.PloneTestCase.layer.PloneSite in 4.794 seconds.
/home/stefan/autotest/temp/python26-zope212-cmf22-plone40/eggs/Zope2-2.12.3-py2.6-linux-x86_64.egg/OFS/subscribers.py:73: DeprecationWarning: Products.FAQ.FAQ.FAQ.manage_afterAdd is discouraged. You should use event subscribers instead.
  DeprecationWarning)
/home/stefan/autotest/temp/python26-zope212-cmf22-plone40/eggs/Zope2-2.12.3-py2.6-linux-x86_64.egg/OFS/subscribers.py:73: DeprecationWarning: Products.FAQ.FAQQuestion.FAQQuestion.manage_afterAdd is discouraged. You should use event subscribers instead.
  DeprecationWarning)
  Ran 145 tests with 0 failures and 0 errors in 23.969 seconds.
Running Products.CMFDiffTool.tests.BaseTestCase.CMFDiffToolLayer tests:
  Set up Products.CMFDiffTool.tests.BaseTestCase.CMFDiffToolLayer in 0.013 seconds.
  Ran 2 tests with 0 failures and 0 errors in 0.228 seconds.
Running Products.CMFTestCase.layer.CMFSite tests:
  Tear down Products.CMFDiffTool.tests.BaseTestCase.CMFDiffToolLayer in 0.376 seconds.
  Tear down Products.PloneTestCase.layer.PloneSite in 0.006 seconds.
  Tear down Products.PloneTestCase.layer.ZCML in 0.004 seconds.
  Set up Products.CMFTestCase.layer.ZCML in 1.748 seconds.
  Set up Products.CMFTestCase.layer.CMFSite in 1.332 seconds.
  Ran 20 tests with 0 failures and 0 errors in 0.392 seconds.
Running zope.testing.testrunner.layer.UnitTests tests:
  Tear down Products.CMFTestCase.layer.CMFSite in 0.068 seconds.
  Tear down Products.CMFTestCase.layer.ZCML in 0.003 seconds.
  Tear down Testing.ZopeTestCase.layer.ZopeLite in 0.000 seconds.
  Set up zope.testing.testrunner.layer.UnitTests in 0.000 seconds.
  Ran 10 tests with 0 failures and 0 errors in 0.005 seconds.
Tearing down left over layers:
  Tear down zope.testing.testrunner.layer.UnitTests in 0.000 seconds.
Total: 204 tests, 0 failures, 0 errors in 37.343 seconds.
Running Testing.ZopeTestCase.layer.ZopeLite tests:
  Set up Testing.ZopeTestCase.layer.ZopeLite in 0.574 seconds.
  Ran 126 tests with 0 failures and 0 errors in 0.757 seconds.
Running Products.CMFTestCase.layer.CMFSite tests:
  Set up Products.CMFTestCase.layer.ZCML in 2.328 seconds.
  Set up Products.CMFTestCase.layer.CMFSite in 0.233 seconds.
  Ran 58 tests with 0 failures and 0 errors in 2.036 seconds.
Running Products.PloneTestCase.layer.ZCML tests:
  Tear down Products.CMFTestCase.layer.CMFSite in 0.041 seconds.
  Tear down Products.CMFTestCase.layer.ZCML in 0.004 seconds.
  Set up Products.PloneTestCase.layer.ZCML in 1.772 seconds.
  Ran 12 tests with 0 failures and 0 errors in 0.016 seconds.
Running Products.PloneTestCase.layer.PloneSite tests:
  Set up Products.PloneTestCase.layer.PloneSite in 4.017 seconds.
  Ran 1831 tests with 0 failures and 0 errors in 3 minutes 48.710 seconds.
Running plone.app.contentrules.tests.test_configuration.TestContentrulesGSLayer tests:
  Set up plone.app.contentrules.tests.test_configuration.TestContentrulesGSLayer in 0.002 seconds.
  Ran 6 tests with 0 failures and 0 errors in 2.431 seconds.
Running plone.app.customerize.tests.layer.PloneCustomerize tests:
  Tear down plone.app.contentrules.tests.test_configuration.TestContentrulesGSLayer in 0.000 seconds.
  Set up plone.app.customerize.tests.layer.PloneCustomerize in 0.000 seconds.
  Ran 27 tests with 0 failures and 0 errors in 2.632 seconds.
Running plone.app.kss.tests.kss_and_plone_layer.KSSAndPloneLayer tests:
  Tear down plone.app.customerize.tests.layer.PloneCustomerize in 0.000 seconds.
  Set up plone.app.kss.tests.kss_and_plone_layer.KSSAndPloneLayer in 0.004 seconds.
  Ran 13 tests with 0 failures and 0 errors in 1.156 seconds.
Running plone.app.linkintegrity.tests.layer.PloneLinkintegrity tests:
  Tear down plone.app.kss.tests.kss_and_plone_layer.KSSAndPloneLayer in 0.000 seconds.
  Set up plone.app.linkintegrity.tests.layer.PloneLinkintegrity in 0.444 seconds.
  Ran 117 tests with 0 failures and 0 errors in 25.807 seconds.
Running plone.app.upgrade.tests.base.FunctionalUpgradeLayer tests:
  Tear down plone.app.linkintegrity.tests.layer.PloneLinkintegrity in 0.051 seconds.
  Set up plone.app.upgrade.tests.base.FunctionalUpgradeLayer in 0.000 seconds.
  Ran 11 tests with 0 failures and 0 errors in 55.485 seconds.
Running plone.app.viewletmanager.tests.test_exportimport.Layer tests:
  Tear down plone.app.upgrade.tests.base.FunctionalUpgradeLayer in 0.000 seconds.
  Tear down Products.PloneTestCase.layer.PloneSite in 0.418 seconds.
  Tear down Products.PloneTestCase.layer.ZCML in 0.016 seconds.
  Tear down Testing.ZopeTestCase.layer.ZopeLite in 0.000 seconds.
  Set up plone.app.viewletmanager.tests.test_exportimport.Layer in 0.000 seconds.
  Ran 16 tests with 0 failures and 0 errors in 0.050 seconds.
Running zope.testing.testrunner.layer.UnitTests tests:
  Tear down plone.app.viewletmanager.tests.test_exportimport.Layer in 0.000 seconds.
  Set up zope.testing.testrunner.layer.UnitTests in 0.000 seconds.
  Ran 145 tests with 0 failures and 0 errors in 0.871 seconds.
Tearing down left over layers:
  Tear down zope.testing.testrunner.layer.UnitTests in 0.000 seconds.
Total: 2362 tests, 0 failures, 0 errors in 5 minutes 34.265 seconds.
Running Testing.ZopeTestCase.layer.ZopeLite tests:
  Set up Testing.ZopeTestCase.layer.ZopeLite in 1.460 seconds.
  Ran 165 tests with 0 failures and 0 errors in 0.623 seconds.
Running Products.PloneTestCase.layer.ZCML tests:
  Set up Products.PloneTestCase.layer.ZCML in 2.347 seconds.
  Ran 34 tests with 0 failures and 0 errors in 0.212 seconds.
Running Products.PlonePAS.tests.layer.PlonePASLayer tests:
  Set up Products.PloneTestCase.layer.PloneSite in 3.676 seconds.
  Set up Products.PlonePAS.tests.layer.PlonePASLayer in 0.000 seconds.
  Ran 153 tests with 0 failures and 0 errors in 1.911 seconds.
Running zope.testing.testrunner.layer.UnitTests tests:
  Tear down Products.PlonePAS.tests.layer.PlonePASLayer in 0.000 seconds.
  Tear down Products.PloneTestCase.layer.PloneSite in 0.355 seconds.
  Tear down Products.PloneTestCase.layer.ZCML in 0.004 seconds.
  Tear down Testing.ZopeTestCase.layer.ZopeLite in 0.000 seconds.
  Set up zope.testing.testrunner.layer.UnitTests in 0.000 seconds.
  Ran 337 tests with 0 failures and 0 errors in 0.884 seconds.
Tearing down left over layers:
  Tear down zope.testing.testrunner.layer.UnitTests in 0.000 seconds.
Total: 689 tests, 0 failures, 0 errors in 12.245 seconds.
Running Products.PloneTestCase.layer.PloneSite tests:
  Set up Testing.ZopeTestCase.layer.ZopeLite in 1.406 seconds.
  Set up Products.PloneTestCase.layer.ZCML in 2.388 seconds.
  Set up Products.PloneTestCase.layer.PloneSite in 4.173 seconds.
/home/stefan/autotest/temp/python26-zope212-cmf22-plone40/src/borg.localrole/borg/localrole/bbb/bbb.txt:1: DeprecationWarning: IWorkspace is deprecated. Please use borg.localrole.interfaces.ILocalRoleProvider instead
  =========
/home/stefan/autotest/temp/python26-zope212-cmf22-plone40/src/borg.localrole/borg/localrole/bbb/bbb.txt:1: DeprecationWarning: IGroupAwareWorkspace is deprecated. Please use borg.localrole.interfaces.ILocalRoleProvider instead
  =========
  Ran 39 tests with 0 failures and 0 errors in 0.238 seconds.
Running plone.browserlayer.tests.test_doctest.PloneBrowserLayerLayer tests:
  Set up plone.browserlayer.tests.test_doctest.PloneBrowserLayerLayer in 0.003 seconds.
  Ran 9 tests with 0 failures and 0 errors in 0.750 seconds.
Running plone.theme.tests.test_doctest.PloneThemeLayer tests:
  Tear down plone.browserlayer.tests.test_doctest.PloneBrowserLayerLayer in 0.000 seconds.
  Set up plone.theme.tests.test_doctest.PloneThemeLayer in 0.003 seconds.
  Ran 5 tests with 0 failures and 0 errors in 0.053 seconds.
Running zope.testing.testrunner.layer.UnitTests tests:
  Tear down plone.theme.tests.test_doctest.PloneThemeLayer in 0.000 seconds.
  Tear down Products.PloneTestCase.layer.PloneSite in 0.345 seconds.
  Tear down Products.PloneTestCase.layer.ZCML in 0.004 seconds.
  Tear down Testing.ZopeTestCase.layer.ZopeLite in 0.000 seconds.
  Set up zope.testing.testrunner.layer.UnitTests in 0.000 seconds.
/usr/local/python2.6/lib/python2.6/mhlib.py:83: DeprecationWarning: the multifile module has been deprecated since Python 2.5
  import multifile
  Ran 252 tests with 0 failures and 0 errors in 0.833 seconds.
Tearing down left over layers:
  Tear down zope.testing.testrunner.layer.UnitTests in 0.000 seconds.
Total: 305 tests, 0 failures, 0 errors in 11.078 seconds.
Running Products.PloneTestCase.layer.PloneSite tests:
  Set up Testing.ZopeTestCase.layer.ZopeLite in 0.905 seconds.
  Set up Products.PloneTestCase.layer.ZCML in 2.324 seconds.
  Set up Products.PloneTestCase.layer.PloneSite in 3.978 seconds.
/usr/local/python2.6/lib/python2.6/unittest.py:279: DeprecationWarning: The use of 'hide' has been deprecated and will be removed in plone.portlet.static 2.0. Instead, use the new generic built-in show/hide setting of plone.portlets.
  testMethod()
  Ran 165 tests with 0 failures and 0 errors in 15.163 seconds.
Running plone.app.portlets.tests.test_configuration.TestPortletZCMLLayer tests:
  Set up plone.app.portlets.tests.test_configuration.TestPortletZCMLLayer in 0.006 seconds.
  Ran 5 tests with 0 failures and 0 errors in 0.039 seconds.
Running plone.app.portlets.tests.test_configuration.TestPortletGSLayer tests:
  Set up plone.app.portlets.tests.test_configuration.TestPortletGSLayer in 1.349 seconds.
  Ran 13 tests with 0 failures and 0 errors in 3.697 seconds.
Running zope.testing.testrunner.layer.UnitTests tests:
  Tear down plone.app.portlets.tests.test_configuration.TestPortletGSLayer in 0.000 seconds.
  Tear down plone.app.portlets.tests.test_configuration.TestPortletZCMLLayer in 0.000 seconds.
  Tear down Products.PloneTestCase.layer.PloneSite in 0.360 seconds.
  Tear down Products.PloneTestCase.layer.ZCML in 0.005 seconds.
  Tear down Testing.ZopeTestCase.layer.ZopeLite in 0.000 seconds.
  Set up zope.testing.testrunner.layer.UnitTests in 0.000 seconds.
  Ran 57 tests with 0 failures and 0 errors in 0.149 seconds.
Tearing down left over layers:
  Tear down zope.testing.testrunner.layer.UnitTests in 0.000 seconds.
Total: 240 tests, 0 failures, 0 errors in 28.814 seconds.
Running zope.testing.testrunner.layer.UnitTests tests:
  Set up zope.testing.testrunner.layer.UnitTests in 0.000 seconds.
  Ran 3 tests with 0 failures and 0 errors in 12.375 seconds.
Tearing down left over layers:
  Tear down zope.testing.testrunner.layer.UnitTests in 0.000 seconds.
Running Products.PloneTestCase.layer.PloneSite tests:
  Set up Testing.ZopeTestCase.layer.ZopeLite in 0.000 seconds.
  Set up Products.PloneTestCase.layer.ZCML in 1.866 seconds.
  Set up Products.PloneTestCase.layer.PloneSite in 4.625 seconds.
  Ran 23 tests with 0 failures and 0 errors in 2.762 seconds.
Running Products.CMFPlacefulWorkflow.tests.test_exportimport.ExportImportLayer tests:
  Set up Products.CMFPlacefulWorkflow.tests.test_exportimport.ExportImportLayer in 0.001 seconds.
  Ran 12 tests with 0 failures and 0 errors in 0.927 seconds.
Tearing down left over layers:
  Tear down Products.CMFPlacefulWorkflow.tests.test_exportimport.ExportImportLayer in 0.000 seconds.
  Tear down Products.PloneTestCase.layer.PloneSite in 0.364 seconds.
  Tear down Products.PloneTestCase.layer.ZCML in 0.004 seconds.
  Tear down Testing.ZopeTestCase.layer.ZopeLite in 0.000 seconds.
Total: 35 tests, 0 failures, 0 errors in 10.989 seconds.
Running Products.CMFTestCase.layer.CMFSite tests:
  Set up Testing.ZopeTestCase.layer.ZopeLite in 0.232 seconds.
  Set up Products.CMFTestCase.layer.ZCML in 0.367 seconds.
  Set up Products.CMFTestCase.layer.CMFSite in 0.208 seconds.
  Ran 58 tests with 0 failures and 0 errors in 0.228 seconds.
Tearing down left over layers:
  Tear down Products.CMFTestCase.layer.CMFSite in 0.027 seconds.
  Tear down Products.CMFTestCase.layer.ZCML in 0.001 seconds.
  Tear down Testing.ZopeTestCase.layer.ZopeLite in 0.000 seconds.
Running zope.testing.testrunner.layer.UnitTests tests:
  Set up zope.testing.testrunner.layer.UnitTests in 0.000 seconds.
  Ran 35 tests with 0 failures and 0 errors in 0.026 seconds.
Tearing down left over layers:
  Tear down zope.testing.testrunner.layer.UnitTests in 0.000 seconds.
Running Products.PloneTestCase.layer.PloneSite tests:
  Set up Testing.ZopeTestCase.layer.ZopeLite in 1.363 seconds.
  Set up Products.PloneTestCase.layer.ZCML in 2.425 seconds.
  Set up Products.PloneTestCase.layer.PloneSite in 3.886 seconds.


Failure in test /home/stefan/autotest/temp/python26-zope212-cmf22-plone40/src/Products.PasswordResetTool/Products/PasswordResetTool/tests/browser.txt
Failed doctest test for browser.txt
  File "/home/stefan/autotest/temp/python26-zope212-cmf22-plone40/src/Products.PasswordResetTool/Products/PasswordResetTool/tests/browser.txt", line 0

----------------------------------------------------------------------
File "/home/stefan/autotest/temp/python26-zope212-cmf22-plone40/src/Products.PasswordResetTool/Products/PasswordResetTool/tests/browser.txt", line 125, in browser.txt
Failed example:
    open('/tmp/test.html', 'w').write(browser.contents)
Exception raised:
    Traceback (most recent call last):
      File "/home/stefan/autotest/temp/python26-zope212-cmf22-plone40/eggs/zope.testing-3.7.7-py2.6.egg/zope/testing/doctest.py", line 1361, in __run
        compileflags, 1) in test.globs
      File "<doctest browser.txt[line 125, example 27]>", line 1, in <module>
        open('/tmp/test.html', 'w').write(browser.contents)
    IOError: [Errno 13] Permission denied: '/tmp/test.html'
----------------------------------------------------------------------
File "/home/stefan/autotest/temp/python26-zope212-cmf22-plone40/src/Products.PasswordResetTool/Products/PasswordResetTool/tests/browser.txt", line 137, in browser.txt
Failed example:
    open('/tmp/test2.html', 'w').write(browser.contents)
Exception raised:
    Traceback (most recent call last):
      File "/home/stefan/autotest/temp/python26-zope212-cmf22-plone40/eggs/zope.testing-3.7.7-py2.6.egg/zope/testing/doctest.py", line 1361, in __run
        compileflags, 1) in test.globs
      File "<doctest browser.txt[line 137, example 34]>", line 1, in <module>
        open('/tmp/test2.html', 'w').write(browser.contents)
    IOError: [Errno 13] Permission denied: '/tmp/test2.html'

  Ran 38 tests with 1 failures and 0 errors in 4.079 seconds.
Tearing down left over layers:
  Tear down Products.PloneTestCase.layer.PloneSite in 0.364 seconds.
  Tear down Products.PloneTestCase.layer.ZCML in 0.006 seconds.
  Tear down Testing.ZopeTestCase.layer.ZopeLite in 0.000 seconds.
Running Products.PloneTestCase.layer.PloneSite tests:
  Set up Testing.ZopeTestCase.layer.ZopeLite in 1.459 seconds.
  Set up Products.PloneTestCase.layer.ZCML in 2.418 seconds.
  Set up Products.PloneTestCase.layer.PloneSite in 3.923 seconds.
/home/stefan/autotest/temp/python26-zope212-cmf22-plone40/eggs/Products.PlonePAS-4.0b3-py2.6.egg/Products/PlonePAS/tools/membership.py:552: DeprecationWarning: credentialsChanged should be called with 'REQUEST' as second argument. The BBB code will be removed in CMF 2.3.
  self.credentialsChanged(password, REQUEST=REQUEST)
  Ran 61 tests with 0 failures and 0 errors in 1.282 seconds.
Tearing down left over layers:
  Tear down Products.PloneTestCase.layer.PloneSite in 0.371 seconds.
  Tear down Products.PloneTestCase.layer.ZCML in 0.004 seconds.
  Tear down Testing.ZopeTestCase.layer.ZopeLite in 0.000 seconds.
Running Products.PloneTestCase.layer.PloneSite tests:
  Set up Testing.ZopeTestCase.layer.ZopeLite in 1.432 seconds.
  Set up Products.PloneTestCase.layer.ZCML in 2.449 seconds.
  Set up Products.PloneTestCase.layer.PloneSite in 4.056 seconds.
  Ran 245 tests with 0 failures and 0 errors in 18.001 seconds.
Running zope.testing.testrunner.layer.UnitTests tests:
  Tear down Products.PloneTestCase.layer.PloneSite in 0.383 seconds.
  Tear down Products.PloneTestCase.layer.ZCML in 0.004 seconds.
  Tear down Testing.ZopeTestCase.layer.ZopeLite in 0.000 seconds.
  Set up zope.testing.testrunner.layer.UnitTests in 0.000 seconds.
  Ran 59 tests with 0 failures and 0 errors in 0.013 seconds.
Tearing down left over layers:
  Tear down zope.testing.testrunner.layer.UnitTests in 0.000 seconds.
Total: 304 tests, 0 failures, 0 errors in 26.766 seconds.
Running Products.PloneTestCase.layer.PloneSite tests:
  Set up Testing.ZopeTestCase.layer.ZopeLite in 1.417 seconds.
  Set up Products.PloneTestCase.layer.ZCML in 2.411 seconds.
  Set up Products.PloneTestCase.layer.PloneSite in 3.869 seconds.
  Ran 78 tests with 0 failures and 0 errors in 2.961 seconds.
Tearing down left over layers:
  Tear down Products.PloneTestCase.layer.PloneSite in 0.358 seconds.
  Tear down Products.PloneTestCase.layer.ZCML in 0.006 seconds.
  Tear down Testing.ZopeTestCase.layer.ZopeLite in 0.000 seconds.
Running zope.testing.testrunner.layer.UnitTests tests:
  Set up zope.testing.testrunner.layer.UnitTests in 0.000 seconds.
  Ran 76 tests with 0 failures and 0 errors in 1.514 seconds.
Tearing down left over layers:
  Tear down zope.testing.testrunner.layer.UnitTests in 0.000 seconds.
Running Products.contentmigration.tests.layer.TestLayer tests:
  Set up Testing.ZopeTestCase.layer.ZopeLite in 1.406 seconds.
  Set up Products.PloneTestCase.layer.ZCML in 2.439 seconds.
  Set up Products.PloneTestCase.layer.PloneSite in 3.879 seconds.
  Set up Products.contentmigration.tests.layer.TestLayer in 0.003 seconds.
  Ran 18 tests with 0 failures and 0 errors in 5.039 seconds.
Tearing down left over layers:
  Tear down Products.contentmigration.tests.layer.TestLayer in 0.000 seconds.
  Tear down Products.PloneTestCase.layer.PloneSite in 0.360 seconds.
  Tear down Products.PloneTestCase.layer.ZCML in 0.004 seconds.
  Tear down Testing.ZopeTestCase.layer.ZopeLite in 0.000 seconds.
Total: 0 tests, 0 failures, 0 errors in 0.000 seconds.
Running archetypes.referencebrowserwidget.tests.base.layer tests:
  Set up Testing.ZopeTestCase.layer.ZopeLite in 0.000 seconds.
  Set up Products.PloneTestCase.layer.ZCML in 1.874 seconds.
  Set up Products.PloneTestCase.layer.PloneSite in 3.985 seconds.
  Set up archetypes.referencebrowserwidget.tests.base.layer in 0.000 seconds.
  Ran 43 tests with 0 failures and 0 errors in 7.988 seconds.
Running zope.testing.testrunner.layer.UnitTests tests:
  Tear down archetypes.referencebrowserwidget.tests.base.layer in 0.000 seconds.
  Tear down Products.PloneTestCase.layer.PloneSite in 0.379 seconds.
  Tear down Products.PloneTestCase.layer.ZCML in 0.007 seconds.
  Tear down Testing.ZopeTestCase.layer.ZopeLite in 0.000 seconds.
  Set up zope.testing.testrunner.layer.UnitTests in 0.000 seconds.
  Ran 4 tests with 0 failures and 0 errors in 0.001 seconds.
Tearing down left over layers:
  Tear down zope.testing.testrunner.layer.UnitTests in 0.000 seconds.
Total: 47 tests, 0 failures, 0 errors in 14.721 seconds.
Running archetypes.schemaextender.tests.testIntegration.layer tests:
  Set up Testing.ZopeTestCase.layer.ZopeLite in 1.340 seconds.
  Set up Products.PloneTestCase.layer.ZCML in 2.433 seconds.
  Set up Products.PloneTestCase.layer.PloneSite in 3.905 seconds.
  Set up archetypes.schemaextender.tests.testIntegration.layer in 0.000 seconds.
  Ran 17 tests with 0 failures and 0 errors in 3.110 seconds.
Running zope.testing.testrunner.layer.UnitTests tests:
  Tear down archetypes.schemaextender.tests.testIntegration.layer in 0.000 seconds.
  Tear down Products.PloneTestCase.layer.PloneSite in 0.366 seconds.
  Tear down Products.PloneTestCase.layer.ZCML in 0.007 seconds.
  Tear down Testing.ZopeTestCase.layer.ZopeLite in 0.000 seconds.
  Set up zope.testing.testrunner.layer.UnitTests in 0.000 seconds.
  Ran 19 tests with 0 failures and 0 errors in 0.007 seconds.
Tearing down left over layers:
  Tear down zope.testing.testrunner.layer.UnitTests in 0.000 seconds.
Total: 36 tests, 0 failures, 0 errors in 11.600 seconds.
Running zope.testing.testrunner.layer.UnitTests tests:
  Set up zope.testing.testrunner.layer.UnitTests in 0.000 seconds.
  Ran 4 tests with 0 failures and 0 errors in 0.040 seconds.
Tearing down left over layers:
  Tear down zope.testing.testrunner.layer.UnitTests in 0.000 seconds.
Running Testing.ZopeTestCase.layer.ZopeLite tests:
  Set up Testing.ZopeTestCase.layer.ZopeLite in 0.068 seconds.
  Ran 40 tests with 0 failures and 0 errors in 0.884 seconds.
Tearing down left over layers:
  Tear down Testing.ZopeTestCase.layer.ZopeLite in 0.000 seconds.
Running Testing.ZopeTestCase.layer.ZopeLite tests:
  Set up Testing.ZopeTestCase.layer.ZopeLite in 0.034 seconds.
  Ran 40 tests with 0 failures and 0 errors in 0.988 seconds.
Running zope.testing.testrunner.layer.UnitTests tests:
  Tear down Testing.ZopeTestCase.layer.ZopeLite in 0.000 seconds.
  Set up zope.testing.testrunner.layer.UnitTests in 0.000 seconds.
  Ran 1 tests with 0 failures and 0 errors in 0.098 seconds.
Tearing down left over layers:
  Tear down zope.testing.testrunner.layer.UnitTests in 0.000 seconds.
Total: 41 tests, 0 failures, 0 errors in 1.297 seconds.
/home/stefan/autotest/temp/python26-zope212-cmf22-plone40/src/kss.core/kss/core/tests/test_kssview_core.py:165: UserWarning: The test_class you are using doesn't subclass from ZopeTestCase.Functional. Please fix that.
  tearDown=KSSViewTestCase.beforeTearDown.im_func))
Running Testing.ZopeTestCase.layer.ZopeLite tests:
  Set up Testing.ZopeTestCase.layer.ZopeLite in 0.046 seconds.
  Ran 1 tests with 0 failures and 0 errors in 0.265 seconds.
Running kss.core.tests.base.KSSLayer tests:
  Tear down Testing.ZopeTestCase.layer.ZopeLite in 0.000 seconds.
  Set up kss.core.tests.base.KSSCoreLayer in 0.031 seconds.
  Set up kss.core.tests.base.KSSLayer in 0.058 seconds.
  Ran 29 tests with 0 failures and 0 errors in 0.155 seconds.
Running kss.core.tests.test_ttwapi.layer tests:
  Set up kss.core.tests.test_ttwapi.layer in 0.001 seconds.
  Ran 3 tests with 0 failures and 0 errors in 0.026 seconds.
Running zope.testing.testrunner.layer.UnitTests tests:
  Tear down kss.core.tests.test_ttwapi.layer in 0.000 seconds.
  Tear down kss.core.tests.base.KSSLayer in 0.000 seconds.
  Tear down kss.core.tests.base.KSSCoreLayer in 0.000 seconds.
  Set up zope.testing.testrunner.layer.UnitTests in 0.000 seconds.
/home/stefan/autotest/temp/python26-zope212-cmf22-plone40/src/kss.core/kss/core/siteview.txt:1: DeprecationWarning: ISite is deprecated. Moved to zope.location.interfaces. Importing from here will stop working in Zope 3.6
  =========
  Ran 14 tests with 0 failures and 0 errors in 0.009 seconds.
Tearing down left over layers:
  Tear down zope.testing.testrunner.layer.UnitTests in 0.000 seconds.
Total: 47 tests, 0 failures, 0 errors in 0.901 seconds.
***********************************************
WARNING: LinguaPlone not found. Skipping tests.
***********************************************
***********************************************
WARNING: LinguaPlone not found. Skipping tests.
***********************************************
Running plone.app.blob.tests.layer.BlobLayer tests:
  Set up Testing.ZopeTestCase.layer.ZopeLite in 0.935 seconds.
  Set up Products.PloneTestCase.layer.ZCML in 2.390 seconds.
  Set up Products.PloneTestCase.layer.PloneSite in 3.929 seconds.
  Set up plone.app.blob.tests.layer.BlobLayer in 0.095 seconds.
/home/stefan/autotest/temp/python26-zope212-cmf22-plone40/eggs/Products.PortalTransforms-2.0b2-py2.6.egg/Products/PortalTransforms/libtransforms/commandtransform.py:97: DeprecationWarning: os.popen4 is deprecated.  Use the subprocess module.
  cin, couterr = os.popen4(command, 'b')
  Ran 29 tests with 0 failures and 0 errors in 7.475 seconds.
Running plone.app.blob.tests.layer.BlobReplacementLayer tests:
  Set up plone.app.blob.tests.layer.BlobReplacementLayer in 0.194 seconds.
  Ran 40 tests with 0 failures and 0 errors in 10.952 seconds.
Running zope.testing.testrunner.layer.UnitTests tests:
  Tear down plone.app.blob.tests.layer.BlobReplacementLayer in 0.000 seconds.
  Tear down plone.app.blob.tests.layer.BlobLayer in 0.000 seconds.
  Tear down Products.PloneTestCase.layer.PloneSite in 0.359 seconds.
  Tear down Products.PloneTestCase.layer.ZCML in 0.009 seconds.
  Tear down Testing.ZopeTestCase.layer.ZopeLite in 0.000 seconds.
  Set up zope.testing.testrunner.layer.UnitTests in 0.000 seconds.
  Ran 2 tests with 0 failures and 0 errors in 0.001 seconds.
Tearing down left over layers:
  Tear down zope.testing.testrunner.layer.UnitTests in 0.000 seconds.
Total: 71 tests, 0 failures, 0 errors in 27.073 seconds.
Running Testing.ZopeTestCase.layer.ZopeLite tests:
  Set up Testing.ZopeTestCase.layer.ZopeLite in 0.955 seconds.
  Ran 2 tests with 0 failures and 0 errors in 0.008 seconds.
Running plone.app.folder.tests.layer.IntegrationLayer tests:
  Set up Products.PloneTestCase.layer.ZCML in 2.478 seconds.
  Set up Products.PloneTestCase.layer.PloneSite in 3.861 seconds.
  Set up plone.app.folder.tests.layer.IntegrationLayer in 0.242 seconds.
  Ran 12 tests with 0 failures and 0 errors in 2.421 seconds.
Running plone.app.folder.tests.layer.PartialOrderingIntegrationLayer tests:
  Set up plone.app.folder.tests.layer.PartialOrderingIntegrationLayer in 0.000 seconds.
  Ran 3 tests with 0 failures and 0 errors in 0.324 seconds.
Tearing down left over layers:
  Tear down plone.app.folder.tests.layer.PartialOrderingIntegrationLayer in 0.000 seconds.
  Tear down plone.app.folder.tests.layer.IntegrationLayer in 0.000 seconds.
  Tear down Products.PloneTestCase.layer.PloneSite in 0.375 seconds.
  Tear down Products.PloneTestCase.layer.ZCML in 0.004 seconds.
  Tear down Testing.ZopeTestCase.layer.ZopeLite in 0.000 seconds.
Total: 17 tests, 0 failures, 0 errors in 11.247 seconds.
Running plone.app.imaging.tests.layer.ImagingLayer tests:
  Set up Testing.ZopeTestCase.layer.ZopeLite in 0.944 seconds.
  Set up Products.PloneTestCase.layer.ZCML in 2.424 seconds.
  Set up Products.PloneTestCase.layer.PloneSite in 3.940 seconds.
  Set up plone.app.imaging.tests.layer.ImagingLayer in 0.092 seconds.
  Ran 37 tests with 0 failures and 0 errors in 4.192 seconds.
Running zope.testing.testrunner.layer.UnitTests tests:
  Tear down plone.app.imaging.tests.layer.ImagingLayer in 0.000 seconds.
  Tear down Products.PloneTestCase.layer.PloneSite in 0.380 seconds.
  Tear down Products.PloneTestCase.layer.ZCML in 0.005 seconds.
  Tear down Testing.ZopeTestCase.layer.ZopeLite in 0.000 seconds.
  Set up zope.testing.testrunner.layer.UnitTests in 0.000 seconds.
  Ran 7 tests with 0 failures and 0 errors in 0.001 seconds.
Tearing down left over layers:
  Tear down zope.testing.testrunner.layer.UnitTests in 0.000 seconds.
Total: 44 tests, 0 failures, 0 errors in 12.420 seconds.
Running Products.PloneTestCase.layer.PloneSite tests:
  Set up Testing.ZopeTestCase.layer.ZopeLite in 1.459 seconds.
  Set up Products.PloneTestCase.layer.ZCML in 2.485 seconds.
  Set up Products.PloneTestCase.layer.PloneSite in 3.891 seconds.
  Ran 9 tests with 0 failures and 0 errors in 0.128 seconds.
Tearing down left over layers:
  Tear down Products.PloneTestCase.layer.PloneSite in 0.360 seconds.
  Tear down Products.PloneTestCase.layer.ZCML in 0.004 seconds.
  Tear down Testing.ZopeTestCase.layer.ZopeLite in 0.000 seconds.
Total: 0 tests, 0 failures, 0 errors in 0.000 seconds.
Running Products.PloneTestCase.layer.PloneSite tests:
  Set up Testing.ZopeTestCase.layer.ZopeLite in 1.485 seconds.
  Set up Products.PloneTestCase.layer.ZCML in 2.379 seconds.
  Set up Products.PloneTestCase.layer.PloneSite in 3.920 seconds.
  Ran 3 tests with 0 failures and 0 errors in 0.701 seconds.
Tearing down left over layers:
  Tear down Products.PloneTestCase.layer.PloneSite in 0.357 seconds.
  Tear down Products.PloneTestCase.layer.ZCML in 0.004 seconds.
  Tear down Testing.ZopeTestCase.layer.ZopeLite in 0.000 seconds.
Running Products.PloneTestCase.layer.PloneSite tests:
  Set up Testing.ZopeTestCase.layer.ZopeLite in 1.393 seconds.
  Set up Products.PloneTestCase.layer.ZCML in 2.461 seconds.
  Set up Products.PloneTestCase.layer.PloneSite in 4.046 seconds.
  Ran 9 tests with 0 failures and 0 errors in 4.237 seconds.
Tearing down left over layers:
  Tear down Products.PloneTestCase.layer.PloneSite in 0.366 seconds.
  Tear down Products.PloneTestCase.layer.ZCML in 0.006 seconds.
  Tear down Testing.ZopeTestCase.layer.ZopeLite in 0.000 seconds.
Running plone.folder.tests.layer.PartialOrderingLayer tests:
  Set up plone.folder.tests.layer.PartialOrderingLayer in 0.000 seconds.
  Ran 11 tests with 0 failures and 0 errors in 0.007 seconds.
Running plone.folder.tests.layer.PloneFolderLayer tests:
  Tear down plone.folder.tests.layer.PartialOrderingLayer in 0.000 seconds.
  Set up plone.folder.tests.layer.PloneFolderLayer in 0.000 seconds.
  Ran 54 tests with 0 failures and 0 errors in 0.032 seconds.
Tearing down left over layers:
  Tear down plone.folder.tests.layer.PloneFolderLayer in 0.000 seconds.
Total: 65 tests, 0 failures, 0 errors in 0.178 seconds.
Running Products.PloneTestCase.layer.PloneSite tests:
  Set up Testing.ZopeTestCase.layer.ZopeLite in 1.469 seconds.
  Set up Products.PloneTestCase.layer.ZCML in 2.461 seconds.
  Set up Products.PloneTestCase.layer.PloneSite in 4.170 seconds.
  Ran 41 tests with 0 failures and 0 errors in 0.376 seconds.
Tearing down left over layers:
  Tear down Products.PloneTestCase.layer.PloneSite in 0.362 seconds.
  Tear down Products.PloneTestCase.layer.ZCML in 0.004 seconds.
  Tear down Testing.ZopeTestCase.layer.ZopeLite in 0.000 seconds.
Total: 0 tests, 0 failures, 0 errors in 0.000 seconds.
Total: 0 tests, 0 failures, 0 errors in 0.000 seconds.
Running Products.PloneTestCase.layer.ZCML tests:
  Set up Testing.ZopeTestCase.layer.ZopeLite in 0.941 seconds.
  Set up Products.PloneTestCase.layer.ZCML in 2.457 seconds.
/home/stefan/autotest/temp/python26-zope212-cmf22-plone40/eggs/wicked-1.1.8alpha1-py2.6.egg/wicked/cache.py:34: DeprecationWarning: object.__init__() takes no parameters
  super(CacheStore, self).__init__(self)
  Ran 16 tests with 0 failures and 0 errors in 0.067 seconds.
Running wicked.at.tests.wickedtestcase.WickedSite tests:
  Set up Products.PloneTestCase.layer.PloneSite in 4.697 seconds.
  Set up wicked.at.tests.wickedtestcase.WickedSite in 0.002 seconds.
/home/stefan/autotest/temp/python26-zope212-cmf22-plone40/eggs/Zope2-2.12.3-py2.6-linux-x86_64.egg/OFS/subscribers.py:73: DeprecationWarning: wicked.atcontent.ironicwiki.IronicWiki.manage_afterAdd is discouraged. You should use event subscribers instead.
  DeprecationWarning)
/home/stefan/autotest/temp/python26-zope212-cmf22-plone40/eggs/Zope2-2.12.3-py2.6-linux-x86_64.egg/OFS/subscribers.py:73: DeprecationWarning: wicked.atcontent.ironicwiki.IronicWiki.manage_beforeDelete is discouraged. You should use event subscribers instead.
  DeprecationWarning)
/home/stefan/autotest/temp/python26-zope212-cmf22-plone40/eggs/Zope2-2.12.3-py2.6-linux-x86_64.egg/OFS/subscribers.py:73: DeprecationWarning: wicked.atcontent.ironicwiki.IronicWiki.manage_afterClone is discouraged. You should use event subscribers instead.
  DeprecationWarning)
  Ran 23 tests with 0 failures and 0 errors in 6.036 seconds.
Running wicked.at.tests.test_scope.Scoped tests:
  Set up wicked.at.tests.test_scope.Scoped in 0.000 seconds.
  Ran 3 tests with 0 failures and 0 errors in 0.657 seconds.
Running wicked.plone.tests.SelectiveATCT tests:
  Tear down wicked.at.tests.test_scope.Scoped in 0.000 seconds.
  Tear down wicked.at.tests.wickedtestcase.WickedSite in 0.002 seconds.
  Set up wicked.plone.tests.SelectiveATCT in 0.003 seconds.
  Ran 22 tests with 0 failures and 0 errors in 6.244 seconds.
Running wicked.plone.tests.ZCMLLayer tests:
  Tear down wicked.plone.tests.SelectiveATCT in 0.004 seconds.
  Set up wicked.plone.tests.ZCMLLayer in 0.019 seconds.
  Ran 8 tests with 0 failures and 0 errors in 0.761 seconds.
Running zope.testing.testrunner.layer.UnitTests tests:
  Tear down wicked.plone.tests.ZCMLLayer in 0.392 seconds.
  Tear down Products.PloneTestCase.layer.PloneSite in 0.001 seconds.
  Tear down Products.PloneTestCase.layer.ZCML in 0.004 seconds.
  Tear down Testing.ZopeTestCase.layer.ZopeLite in 0.000 seconds.
  Set up zope.testing.testrunner.layer.UnitTests in 0.000 seconds.
  Ran 34 tests with 0 failures and 0 errors in 0.016 seconds.
Tearing down left over layers:
  Tear down zope.testing.testrunner.layer.UnitTests in 0.000 seconds.
Total: 106 tests, 0 failures, 0 errors in 23.559 seconds.
#### Running tests for group ATCT ####
#### Finished tests for group ATCT ####

#### Running tests for group Archetypes ####
#### Finished tests for group Archetypes ####

#### Running tests for group CMF ####
#### Finished tests for group CMF ####

#### Running tests for group CMFEditions ####
#### Finished tests for group CMFEditions ####

#### Running tests for group Plone ####
#### Finished tests for group Plone ####

#### Running tests for group PlonePAS ####
#### Finished tests for group PlonePAS ####

#### Running tests for group plone ####
#### Finished tests for group plone ####

#### Running tests for group portlets ####
#### Finished tests for group portlets ####

#### Running tests for group z3c.autoinclude ####
#### Finished tests for group z3c.autoinclude ####

#### Running tests for Products.CMFPlacefulWorkflow ####
#### Finished tests for Products.CMFPlacefulWorkflow ####

#### Running tests for Products.CMFTestCase ####
#### Finished tests for Products.CMFTestCase ####

#### Running tests for Products.ExtendedPathIndex ####
#### Finished tests for Products.ExtendedPathIndex ####

#### Running tests for Products.PasswordResetTool ####
#### Finished tests for Products.PasswordResetTool ####

#### Running tests for Products.PloneTestCase ####
#### Finished tests for Products.PloneTestCase ####

#### Running tests for Products.ResourceRegistries ####
#### Finished tests for Products.ResourceRegistries ####

#### Running tests for Products.TinyMCE ####
#### Finished tests for Products.TinyMCE ####

#### Running tests for Products.ZopeVersionControl ####
#### Finished tests for Products.ZopeVersionControl ####

#### Running tests for Products.contentmigration ####
#### Finished tests for Products.contentmigration ####

#### Running tests for Products.i18ntestcase ####
#### Finished tests for Products.i18ntestcase ####

#### Running tests for archetypes.referencebrowserwidget ####
#### Finished tests for archetypes.referencebrowserwidget ####

#### Running tests for archetypes.schemaextender ####
#### Finished tests for archetypes.schemaextender ####

#### Running tests for collective.monkeypatcher ####
#### Finished tests for collective.monkeypatcher ####

#### Running tests for five.customerize ####
#### Finished tests for five.customerize ####

#### Running tests for five.formlib ####
#### Finished tests for five.formlib ####

#### Running tests for kss.core ####
#### Finished tests for kss.core ####

#### Running tests for plone.app.blob ####
#### Finished tests for plone.app.blob ####

#### Running tests for plone.app.folder ####
#### Finished tests for plone.app.folder ####

#### Running tests for plone.app.imaging ####
#### Finished tests for plone.app.imaging ####

#### Running tests for plone.app.jquerytools ####
#### Finished tests for plone.app.jquerytools ####

#### Running tests for plone.app.locales ####
#### Finished tests for plone.app.locales ####

#### Running tests for plone.app.openid ####
#### Finished tests for plone.app.openid ####

#### Running tests for plone.app.users ####
#### Finished tests for plone.app.users ####

#### Running tests for plone.folder ####
#### Finished tests for plone.folder ####

#### Running tests for plone.stringinterp ####
#### Finished tests for plone.stringinterp ####

#### Running tests for plonetheme.classic ####
#### Finished tests for plonetheme.classic ####

#### Running tests for plonetheme.sunburst ####
#### Finished tests for plonetheme.sunburst ####

#### Running tests for wicked ####
#### Finished tests for wicked ####

Packages with test failures:

Failing tests in group ATCT
Failing tests in group Archetypes
Failing tests in Products.PasswordResetTool

Total time elapsed: 917.406 seconds

Grand total: 90 packages, 3 failures


FAILED (90 packages, 3 failures)




More information about the Testbot mailing list