[Testbot] FAILED (90 packages, 3 failures) : Plone-4.0 Zope-2.12 Python-2.6.4

Plone Tests plone-tests at epy.co.at
Mon Feb 1 02:40:24 UTC 2010


Plone Tests : FAILED (90 packages, 3 failures)
Plone-4.0 Zope-2.12 Python-2.6.4

Running ./bin/alltests -q --no-color --no-progress
Running Products.CMFTestCase.layer.CMFSite tests:
  Set up Testing.ZopeTestCase.layer.ZopeLite in 1.038 seconds.
  Set up Products.CMFTestCase.layer.ZCML in 3.009 seconds.
  Set up Products.CMFTestCase.layer.CMFSite in 2.029 seconds.
  Ran 31 tests with 0 failures and 0 errors in 0.570 seconds.
Running Products.PloneTestCase.layer.PloneSite tests:
  Tear down Products.CMFTestCase.layer.CMFSite in 0.068 seconds.
  Tear down Products.CMFTestCase.layer.ZCML in 0.004 seconds.
  Set up Products.PloneTestCase.layer.ZCML in 1.734 seconds.
  Set up Products.PloneTestCase.layer.PloneSite in 3.904 seconds.
  Ran 712 tests with 0 failures and 0 errors in 1 minutes 12.723 seconds.
Tearing down left over layers:
  Tear down Products.PloneTestCase.layer.PloneSite in 0.367 seconds.
  Tear down Products.PloneTestCase.layer.ZCML in 0.010 seconds.
  Tear down Testing.ZopeTestCase.layer.ZopeLite in 0.000 seconds.
Total: 743 tests, 0 failures, 0 errors in 1 minutes 26.099 seconds.
Running Testing.ZopeTestCase.layer.ZopeLite tests:
  Set up Testing.ZopeTestCase.layer.ZopeLite in 0.833 seconds.
  Ran 36 tests with 0 failures and 0 errors in 0.082 seconds.
Running Products.Archetypes.tests.layer.ZCML tests:
  Set up Products.CMFCore.testing.FunctionalZCMLLayer in 0.190 seconds.
  Set up Products.Archetypes.tests.layer.ZCML in 0.176 seconds.
  Ran 59 tests with 0 failures and 0 errors in 1.157 seconds.
Running Products.Archetypes.tests.layer.ArchetypesSite tests:
  Set up Products.Archetypes.tests.layer.ArchetypesSite in 1.999 seconds.
/home/stefan/autotest/temp/python26-zope212-cmf22-plone40/eggs/Zope2-2.12.3-py2.6-linux-x86_64.egg/OFS/subscribers.py:73: DeprecationWarning: Products.Archetypes.tests.test_classgen.Dummy.manage_afterAdd is discouraged. You should use event subscribers instead.
  DeprecationWarning)
/home/stefan/autotest/temp/python26-zope212-cmf22-plone40/eggs/Zope2-2.12.3-py2.6-linux-x86_64.egg/OFS/subscribers.py:73: DeprecationWarning: Products.Archetypes.tests.test_annotation.AnnDummy.manage_afterAdd is discouraged. You should use event subscribers instead.
  DeprecationWarning)
/home/stefan/autotest/temp/python26-zope212-cmf22-plone40/eggs/Zope2-2.12.3-py2.6-linux-x86_64.egg/OFS/subscribers.py:73: DeprecationWarning: Products.Archetypes.tests.test_event.Dummy.manage_afterAdd is discouraged. You should use event subscribers instead.
  DeprecationWarning)
  Ran 516 tests with 0 failures and 0 errors in 36.108 seconds.
Running Products.PloneTestCase.layer.PloneSite tests:
  Tear down Products.Archetypes.tests.layer.ArchetypesSite in 0.070 seconds.
  Tear down Products.Archetypes.tests.layer.ZCML in 0.005 seconds.
  Tear down Products.CMFCore.testing.FunctionalZCMLLayer in 0.000 seconds.
  Set up Products.PloneTestCase.layer.ZCML in 2.377 seconds.
  Set up Products.PloneTestCase.layer.PloneSite in 3.880 seconds.
  Ran 9 tests with 0 failures and 0 errors in 1.069 seconds.
Running plone.app.kss.tests.kss_and_plone_layer.KSSAndPloneLayer tests:
  Set up plone.app.kss.tests.kss_and_plone_layer.KSSAndPloneLayer in 0.005 seconds.


Error in test testVersionPreviewIsNotInlineEditable (archetypes.kss.tests.test_fields.FieldsViewTestCase)
Traceback (most recent call last):
  File "/usr/local/python2.6/lib/python2.6/unittest.py", line 279, in run
    testMethod()
  File "/home/stefan/autotest/temp/python26-zope212-cmf22-plone40/eggs/archetypes.kss-1.6.0a1-py2.6.egg/archetypes/kss/tests/test_fields.py", line 274, in testVersionPreviewIsNotInlineEditable
    rendered = obj.versions_history_form()
  File "/home/stefan/autotest/temp/python26-zope212-cmf22-plone40/eggs/Zope2-2.12.3-py2.6-linux-x86_64.egg/Shared/DC/Scripts/Bindings.py", line 324, in __call__
    return self._bindAndExec(args, kw, None)
  File "/home/stefan/autotest/temp/python26-zope212-cmf22-plone40/eggs/Zope2-2.12.3-py2.6-linux-x86_64.egg/Shared/DC/Scripts/Bindings.py", line 361, in _bindAndExec
    return self._exec(bound_data, args, kw)
  File "/home/stefan/autotest/temp/python26-zope212-cmf22-plone40/eggs/Products.CMFCore-2.2.0-py2.6.egg/Products/CMFCore/FSPageTemplate.py", line 240, in _exec
    result = self.pt_render(extra_context=bound_names)
  File "/home/stefan/autotest/temp/python26-zope212-cmf22-plone40/eggs/Products.CMFCore-2.2.0-py2.6.egg/Products/CMFCore/FSPageTemplate.py", line 180, in pt_render
    self, source, extra_context
  File "/home/stefan/autotest/temp/python26-zope212-cmf22-plone40/eggs/Zope2-2.12.3-py2.6-linux-x86_64.egg/Products/PageTemplates/PageTemplate.py", line 80, in pt_render
    showtal=showtal)
  File "/home/stefan/autotest/temp/python26-zope212-cmf22-plone40/eggs/zope.pagetemplate-3.5.0-py2.6.egg/zope/pagetemplate/pagetemplate.py", line 115, in pt_render
    strictinsert=0, sourceAnnotations=sourceAnnotations)()
   - Warning: Macro expansion failed
   - Warning: <type 'exceptions.KeyError'>: 'view_macro'
  File "/home/stefan/autotest/temp/python26-zope212-cmf22-plone40/eggs/zope.tal-3.5.2-py2.6.egg/zope/tal/talinterpreter.py", line 271, in __call__
    self.interpret(self.program)
  File "/home/stefan/autotest/temp/python26-zope212-cmf22-plone40/eggs/zope.tal-3.5.2-py2.6.egg/zope/tal/talinterpreter.py", line 343, in interpret
    handlers[opcode](self, args)
  File "/home/stefan/autotest/temp/python26-zope212-cmf22-plone40/eggs/zope.tal-3.5.2-py2.6.egg/zope/tal/talinterpreter.py", line 888, in do_useMacro
    self.interpret(macro)
  File "/home/stefan/autotest/temp/python26-zope212-cmf22-plone40/eggs/zope.tal-3.5.2-py2.6.egg/zope/tal/talinterpreter.py", line 343, in interpret
    handlers[opcode](self, args)
  File "/home/stefan/autotest/temp/python26-zope212-cmf22-plone40/eggs/zope.tal-3.5.2-py2.6.egg/zope/tal/talinterpreter.py", line 533, in do_optTag_tal
    self.do_optTag(stuff)
  File "/home/stefan/autotest/temp/python26-zope212-cmf22-plone40/eggs/zope.tal-3.5.2-py2.6.egg/zope/tal/talinterpreter.py", line 518, in do_optTag
    return self.no_tag(start, program)
  File "/home/stefan/autotest/temp/python26-zope212-cmf22-plone40/eggs/zope.tal-3.5.2-py2.6.egg/zope/tal/talinterpreter.py", line 513, in no_tag
    self.interpret(program)
  File "/home/stefan/autotest/temp/python26-zope212-cmf22-plone40/eggs/zope.tal-3.5.2-py2.6.egg/zope/tal/talinterpreter.py", line 343, in interpret
    handlers[opcode](self, args)
  File "/home/stefan/autotest/temp/python26-zope212-cmf22-plone40/eggs/zope.tal-3.5.2-py2.6.egg/zope/tal/talinterpreter.py", line 954, in do_defineSlot
    self.interpret(block)
  File "/home/stefan/autotest/temp/python26-zope212-cmf22-plone40/eggs/zope.tal-3.5.2-py2.6.egg/zope/tal/talinterpreter.py", line 343, in interpret
    handlers[opcode](self, args)
  File "/home/stefan/autotest/temp/python26-zope212-cmf22-plone40/eggs/zope.tal-3.5.2-py2.6.egg/zope/tal/talinterpreter.py", line 531, in do_optTag_tal
    self.no_tag(stuff[-2], stuff[-1])
  File "/home/stefan/autotest/temp/python26-zope212-cmf22-plone40/eggs/zope.tal-3.5.2-py2.6.egg/zope/tal/talinterpreter.py", line 513, in no_tag
    self.interpret(program)
  File "/home/stefan/autotest/temp/python26-zope212-cmf22-plone40/eggs/zope.tal-3.5.2-py2.6.egg/zope/tal/talinterpreter.py", line 343, in interpret
    handlers[opcode](self, args)
  File "/home/stefan/autotest/temp/python26-zope212-cmf22-plone40/eggs/zope.tal-3.5.2-py2.6.egg/zope/tal/talinterpreter.py", line 954, in do_defineSlot
    self.interpret(block)
  File "/home/stefan/autotest/temp/python26-zope212-cmf22-plone40/eggs/zope.tal-3.5.2-py2.6.egg/zope/tal/talinterpreter.py", line 343, in interpret
    handlers[opcode](self, args)
  File "/home/stefan/autotest/temp/python26-zope212-cmf22-plone40/eggs/zope.tal-3.5.2-py2.6.egg/zope/tal/talinterpreter.py", line 531, in do_optTag_tal
    self.no_tag(stuff[-2], stuff[-1])
  File "/home/stefan/autotest/temp/python26-zope212-cmf22-plone40/eggs/zope.tal-3.5.2-py2.6.egg/zope/tal/talinterpreter.py", line 513, in no_tag
    self.interpret(program)
  File "/home/stefan/autotest/temp/python26-zope212-cmf22-plone40/eggs/zope.tal-3.5.2-py2.6.egg/zope/tal/talinterpreter.py", line 343, in interpret
    handlers[opcode](self, args)
  File "/home/stefan/autotest/temp/python26-zope212-cmf22-plone40/eggs/zope.tal-3.5.2-py2.6.egg/zope/tal/talinterpreter.py", line 954, in do_defineSlot
    self.interpret(block)
  File "/home/stefan/autotest/temp/python26-zope212-cmf22-plone40/eggs/zope.tal-3.5.2-py2.6.egg/zope/tal/talinterpreter.py", line 343, in interpret
    handlers[opcode](self, args)
  File "/home/stefan/autotest/temp/python26-zope212-cmf22-plone40/eggs/zope.tal-3.5.2-py2.6.egg/zope/tal/talinterpreter.py", line 531, in do_optTag_tal
    self.no_tag(stuff[-2], stuff[-1])
  File "/home/stefan/autotest/temp/python26-zope212-cmf22-plone40/eggs/zope.tal-3.5.2-py2.6.egg/zope/tal/talinterpreter.py", line 513, in no_tag
    self.interpret(program)
  File "/home/stefan/autotest/temp/python26-zope212-cmf22-plone40/eggs/zope.tal-3.5.2-py2.6.egg/zope/tal/talinterpreter.py", line 343, in interpret
    handlers[opcode](self, args)
  File "/home/stefan/autotest/temp/python26-zope212-cmf22-plone40/eggs/zope.tal-3.5.2-py2.6.egg/zope/tal/talinterpreter.py", line 954, in do_defineSlot
    self.interpret(block)
  File "/home/stefan/autotest/temp/python26-zope212-cmf22-plone40/eggs/zope.tal-3.5.2-py2.6.egg/zope/tal/talinterpreter.py", line 343, in interpret
    handlers[opcode](self, args)
  File "/home/stefan/autotest/temp/python26-zope212-cmf22-plone40/eggs/zope.tal-3.5.2-py2.6.egg/zope/tal/talinterpreter.py", line 533, in do_optTag_tal
    self.do_optTag(stuff)
  File "/home/stefan/autotest/temp/python26-zope212-cmf22-plone40/eggs/zope.tal-3.5.2-py2.6.egg/zope/tal/talinterpreter.py", line 522, in do_optTag
    self.interpret(program)
  File "/home/stefan/autotest/temp/python26-zope212-cmf22-plone40/eggs/zope.tal-3.5.2-py2.6.egg/zope/tal/talinterpreter.py", line 343, in interpret
    handlers[opcode](self, args)
  File "/home/stefan/autotest/temp/python26-zope212-cmf22-plone40/eggs/zope.tal-3.5.2-py2.6.egg/zope/tal/talinterpreter.py", line 858, in do_defineMacro
    self.interpret(macro)
  File "/home/stefan/autotest/temp/python26-zope212-cmf22-plone40/eggs/zope.tal-3.5.2-py2.6.egg/zope/tal/talinterpreter.py", line 343, in interpret
    handlers[opcode](self, args)
  File "/home/stefan/autotest/temp/python26-zope212-cmf22-plone40/eggs/zope.tal-3.5.2-py2.6.egg/zope/tal/talinterpreter.py", line 954, in do_defineSlot
    self.interpret(block)
  File "/home/stefan/autotest/temp/python26-zope212-cmf22-plone40/eggs/zope.tal-3.5.2-py2.6.egg/zope/tal/talinterpreter.py", line 343, in interpret
    handlers[opcode](self, args)
  File "/home/stefan/autotest/temp/python26-zope212-cmf22-plone40/eggs/zope.tal-3.5.2-py2.6.egg/zope/tal/talinterpreter.py", line 533, in do_optTag_tal
    self.do_optTag(stuff)
  File "/home/stefan/autotest/temp/python26-zope212-cmf22-plone40/eggs/zope.tal-3.5.2-py2.6.egg/zope/tal/talinterpreter.py", line 518, in do_optTag
    return self.no_tag(start, program)
  File "/home/stefan/autotest/temp/python26-zope212-cmf22-plone40/eggs/zope.tal-3.5.2-py2.6.egg/zope/tal/talinterpreter.py", line 513, in no_tag
    self.interpret(program)
  File "/home/stefan/autotest/temp/python26-zope212-cmf22-plone40/eggs/zope.tal-3.5.2-py2.6.egg/zope/tal/talinterpreter.py", line 343, in interpret
    handlers[opcode](self, args)
  File "/home/stefan/autotest/temp/python26-zope212-cmf22-plone40/eggs/zope.tal-3.5.2-py2.6.egg/zope/tal/talinterpreter.py", line 946, in do_defineSlot
    self.interpret(slot)
  File "/home/stefan/autotest/temp/python26-zope212-cmf22-plone40/eggs/zope.tal-3.5.2-py2.6.egg/zope/tal/talinterpreter.py", line 343, in interpret
    handlers[opcode](self, args)
  File "/home/stefan/autotest/temp/python26-zope212-cmf22-plone40/eggs/zope.tal-3.5.2-py2.6.egg/zope/tal/talinterpreter.py", line 852, in do_condition
    self.interpret(block)
  File "/home/stefan/autotest/temp/python26-zope212-cmf22-plone40/eggs/zope.tal-3.5.2-py2.6.egg/zope/tal/talinterpreter.py", line 343, in interpret
    handlers[opcode](self, args)
  File "/home/stefan/autotest/temp/python26-zope212-cmf22-plone40/eggs/zope.tal-3.5.2-py2.6.egg/zope/tal/talinterpreter.py", line 852, in do_condition
    self.interpret(block)
  File "/home/stefan/autotest/temp/python26-zope212-cmf22-plone40/eggs/zope.tal-3.5.2-py2.6.egg/zope/tal/talinterpreter.py", line 343, in interpret
    handlers[opcode](self, args)
  File "/home/stefan/autotest/temp/python26-zope212-cmf22-plone40/eggs/zope.tal-3.5.2-py2.6.egg/zope/tal/talinterpreter.py", line 583, in do_setLocal_tal
    self.engine.setLocal(name, self.engine.evaluateValue(expr))
  File "/home/stefan/autotest/temp/python26-zope212-cmf22-plone40/eggs/zope.tales-3.4.0-py2.6.egg/zope/tales/tales.py", line 696, in evaluate
    return expression(self)
   - file:/home/stefan/autotest/temp/python26-zope212-cmf22-plone40/eggs/Products.CMFEditions-2.0b2-py2.6.egg/Products/CMFEditions/skins/CMFEditions/versions_history_form.pt
   - Line 211, Column 6
   - Expression: <PythonExpr context.get_macros(vdata)>
   - Names:
      {'container': <PloneSite at /plone>,
       'context': <ATDocument at /plone/front-page>,
       'default': <object object at 0x2b63ba443750>,
       'here': <ATDocument at /plone/front-page>,
       'loop': {},
       'nothing': None,
       'options': {'args': ()},
       'repeat': <Products.PageTemplates.Expressions.SafeMapping object at 0x8fd9b90>,
       'request': <HTTPRequest, URL=http://nohost>,
       'root': <Application at >,
       'template': <FSPageTemplate at /plone/versions_history_form used for /plone/front-page>,
       'traverse_subpath': [],
       'user': <PropertiedUser 'portal_owner'>}
  File "/home/stefan/autotest/temp/python26-zope212-cmf22-plone40/eggs/Zope2-2.12.3-py2.6-linux-x86_64.egg/Products/PageTemplates/ZRPythonExpr.py", line 49, in __call__
    return eval(self._code, vars, {})
   - __traceback_info__: context.get_macros(vdata)
  File "PythonExpr", line 1, in <expression>
  File "/home/stefan/autotest/temp/python26-zope212-cmf22-plone40/eggs/Products.CMFCore-2.2.0-py2.6.egg/Products/CMFCore/FSPythonScript.py", line 130, in __call__
    return Script.__call__(self, *args, **kw)
  File "/home/stefan/autotest/temp/python26-zope212-cmf22-plone40/eggs/Zope2-2.12.3-py2.6-linux-x86_64.egg/Shared/DC/Scripts/Bindings.py", line 324, in __call__
    return self._bindAndExec(args, kw, None)
  File "/home/stefan/autotest/temp/python26-zope212-cmf22-plone40/eggs/Zope2-2.12.3-py2.6-linux-x86_64.egg/Shared/DC/Scripts/Bindings.py", line 361, in _bindAndExec
    return self._exec(bound_data, args, kw)
  File "/home/stefan/autotest/temp/python26-zope212-cmf22-plone40/eggs/Zope2-2.12.3-py2.6-linux-x86_64.egg/Products/PythonScripts/PythonScript.py", line 344, in _exec
    result = f(*args, **kw)
  File "Script (Python)", line 22, in get_macros
   - Line 22
  File "/home/stefan/autotest/temp/python26-zope212-cmf22-plone40/eggs/Zope2-2.12.3-py2.6-linux-x86_64.egg/AccessControl/ZopeGuards.py", line 67, in guarded_getitem
    v = object[index]
KeyError: 'main'

  Ran 19 tests with 0 failures and 1 errors in 1.270 seconds.
Running zope.testing.testrunner.layer.UnitTests tests:
  Tear down plone.app.kss.tests.kss_and_plone_layer.KSSAndPloneLayer in 0.000 seconds.
  Tear down Products.PloneTestCase.layer.PloneSite in 0.356 seconds.
  Tear down Products.PloneTestCase.layer.ZCML in 0.005 seconds.
  Tear down Testing.ZopeTestCase.layer.ZopeLite in 0.000 seconds.
  Set up zope.testing.testrunner.layer.UnitTests in 0.000 seconds.
/home/stefan/autotest/temp/python26-zope212-cmf22-plone40/eggs/Products.Archetypes-1.6b2-py2.6.egg/Products/Archetypes/ClassGen.py:152: UserWarning: The method 'makeFoo' was already protected by a different permission than the one declared on the field. Assuming that the explicit permission declared is the correct one and has preference over the permission declared on the field.
  self.handle_mode(klass, generator, type, field, mode)
  Ran 28 tests with 0 failures and 0 errors in 0.154 seconds.
Tearing down left over layers:
  Tear down zope.testing.testrunner.layer.UnitTests in 0.000 seconds.
Total: 667 tests, 0 failures, 1 errors in 51.107 seconds.
Running Testing.ZopeTestCase.layer.ZopeLite tests:
  Set up Testing.ZopeTestCase.layer.ZopeLite in 0.090 seconds.
  Ran 283 tests with 0 failures and 0 errors in 1.311 seconds.
Running Products.CMFCalendar.testing.FunctionalLayer tests:
  Set up Products.CMFCore.testing.FunctionalZCMLLayer in 0.166 seconds.
  Set up Products.CMFCalendar.testing.FunctionalLayer in 0.324 seconds.
  Ran 24 tests with 0 failures and 0 errors in 1.515 seconds.
Running Products.CMFCore.testing.EventZCMLLayer tests:
  Tear down Products.CMFCalendar.testing.FunctionalLayer in 0.028 seconds.
  Tear down Products.CMFCore.testing.FunctionalZCMLLayer in 0.001 seconds.
  Set up Products.CMFCore.testing.EventZCMLLayer in 0.001 seconds.
  Ran 8 tests with 0 failures and 0 errors in 0.199 seconds.
Running Products.CMFCore.testing.ExportImportZCMLLayer tests:
  Tear down Products.CMFCore.testing.EventZCMLLayer in 0.000 seconds.
  Set up Products.CMFCore.testing.ExportImportZCMLLayer in 0.001 seconds.
  Ran 10 tests with 0 failures and 0 errors in 0.926 seconds.
Running Products.CMFCore.testing.TraversingEventZCMLLayer tests:
  Tear down Products.CMFCore.testing.ExportImportZCMLLayer in 0.000 seconds.
  Set up Products.CMFCore.testing.TraversingEventZCMLLayer in 0.001 seconds.
  Ran 5 tests with 0 failures and 0 errors in 0.158 seconds.
Running Products.CMFDefault.testing.FunctionalLayer tests:
  Tear down Products.CMFCore.testing.TraversingEventZCMLLayer in 0.000 seconds.
  Set up Products.CMFCore.testing.FunctionalZCMLLayer in 0.152 seconds.
  Set up Products.CMFDefault.testing.FunctionalLayer in 0.242 seconds.
  Ran 76 tests with 0 failures and 0 errors in 3.915 seconds.
Running Products.CMFUid.testing.UidEventZCMLLayer tests:
  Tear down Products.CMFDefault.testing.FunctionalLayer in 0.025 seconds.
  Tear down Products.CMFCore.testing.FunctionalZCMLLayer in 0.002 seconds.
  Set up Products.CMFUid.testing.UidEventZCMLLayer in 0.001 seconds.
  Ran 12 tests with 0 failures and 0 errors in 0.321 seconds.
Running Products.DCWorkflow.testing.ExportImportZCMLLayer tests:
  Tear down Products.CMFUid.testing.UidEventZCMLLayer in 0.000 seconds.
  Set up Products.DCWorkflow.testing.ExportImportZCMLLayer in 0.140 seconds.
  Ran 38 tests with 0 failures and 0 errors in 0.736 seconds.
Running Products.GenericSetup.testing.ExportImportZCMLLayer tests:
  Tear down Products.DCWorkflow.testing.ExportImportZCMLLayer in 0.000 seconds.
  Set up Products.GenericSetup.testing.ExportImportZCMLLayer in 0.081 seconds.
  Ran 186 tests with 0 failures and 0 errors in 0.598 seconds.
Running zope.testing.testrunner.layer.UnitTests tests:
  Tear down Products.GenericSetup.testing.ExportImportZCMLLayer in 0.000 seconds.
  Tear down Testing.ZopeTestCase.layer.ZopeLite in 0.000 seconds.
  Set up zope.testing.testrunner.layer.UnitTests in 0.000 seconds.
  Ran 346 tests with 0 failures and 0 errors in 0.256 seconds.
Tearing down left over layers:
  Tear down zope.testing.testrunner.layer.UnitTests in 0.000 seconds.
Total: 988 tests, 0 failures, 0 errors in 12.474 seconds.
Running Testing.ZopeTestCase.layer.ZopeLite tests:
  Set up Testing.ZopeTestCase.layer.ZopeLite in 0.927 seconds.
  Ran 27 tests with 0 failures and 0 errors in 0.056 seconds.
Running Products.PloneTestCase.layer.PloneSite tests:
  Set up Products.PloneTestCase.layer.ZCML in 2.449 seconds.
  Set up Products.PloneTestCase.layer.PloneSite in 5.081 seconds.
/home/stefan/autotest/temp/python26-zope212-cmf22-plone40/eggs/Zope2-2.12.3-py2.6-linux-x86_64.egg/OFS/subscribers.py:73: DeprecationWarning: Products.FAQ.FAQ.FAQ.manage_afterAdd is discouraged. You should use event subscribers instead.
  DeprecationWarning)
/home/stefan/autotest/temp/python26-zope212-cmf22-plone40/eggs/Zope2-2.12.3-py2.6-linux-x86_64.egg/OFS/subscribers.py:73: DeprecationWarning: Products.FAQ.FAQQuestion.FAQQuestion.manage_afterAdd is discouraged. You should use event subscribers instead.
  DeprecationWarning)
  Ran 145 tests with 0 failures and 0 errors in 24.061 seconds.
Running Products.CMFDiffTool.tests.BaseTestCase.CMFDiffToolLayer tests:
  Set up Products.CMFDiffTool.tests.BaseTestCase.CMFDiffToolLayer in 0.013 seconds.
  Ran 2 tests with 0 failures and 0 errors in 0.224 seconds.
Running Products.CMFTestCase.layer.CMFSite tests:
  Tear down Products.CMFDiffTool.tests.BaseTestCase.CMFDiffToolLayer in 0.375 seconds.
  Tear down Products.PloneTestCase.layer.PloneSite in 0.006 seconds.
  Tear down Products.PloneTestCase.layer.ZCML in 0.004 seconds.
  Set up Products.CMFTestCase.layer.ZCML in 1.750 seconds.
  Set up Products.CMFTestCase.layer.CMFSite in 1.638 seconds.
  Ran 20 tests with 0 failures and 0 errors in 0.393 seconds.
Running zope.testing.testrunner.layer.UnitTests tests:
  Tear down Products.CMFTestCase.layer.CMFSite in 0.069 seconds.
  Tear down Products.CMFTestCase.layer.ZCML in 0.003 seconds.
  Tear down Testing.ZopeTestCase.layer.ZopeLite in 0.000 seconds.
  Set up zope.testing.testrunner.layer.UnitTests in 0.000 seconds.
  Ran 10 tests with 0 failures and 0 errors in 0.005 seconds.
Tearing down left over layers:
  Tear down zope.testing.testrunner.layer.UnitTests in 0.000 seconds.
Total: 204 tests, 0 failures, 0 errors in 38.032 seconds.
Running Testing.ZopeTestCase.layer.ZopeLite tests:
  Set up Testing.ZopeTestCase.layer.ZopeLite in 0.567 seconds.
  Ran 126 tests with 0 failures and 0 errors in 0.763 seconds.
Running Products.CMFTestCase.layer.CMFSite tests:
  Set up Products.CMFTestCase.layer.ZCML in 2.296 seconds.
  Set up Products.CMFTestCase.layer.CMFSite in 0.235 seconds.
  Ran 58 tests with 0 failures and 0 errors in 3.022 seconds.
Running Products.PloneTestCase.layer.ZCML tests:
  Tear down Products.CMFTestCase.layer.CMFSite in 0.041 seconds.
  Tear down Products.CMFTestCase.layer.ZCML in 0.003 seconds.
  Set up Products.PloneTestCase.layer.ZCML in 1.766 seconds.
  Ran 12 tests with 0 failures and 0 errors in 0.016 seconds.
Running Products.PloneTestCase.layer.PloneSite tests:
  Set up Products.PloneTestCase.layer.PloneSite in 4.187 seconds.
  Ran 1827 tests with 0 failures and 0 errors in 3 minutes 54.092 seconds.
Running plone.app.contentrules.tests.test_configuration.TestContentrulesGSLayer tests:
  Set up plone.app.contentrules.tests.test_configuration.TestContentrulesGSLayer in 0.002 seconds.
  Ran 6 tests with 0 failures and 0 errors in 3.758 seconds.
Running plone.app.customerize.tests.layer.PloneCustomerize tests:
  Tear down plone.app.contentrules.tests.test_configuration.TestContentrulesGSLayer in 0.000 seconds.
  Set up plone.app.customerize.tests.layer.PloneCustomerize in 0.000 seconds.
  Ran 27 tests with 0 failures and 0 errors in 2.858 seconds.
Running plone.app.kss.tests.kss_and_plone_layer.KSSAndPloneLayer tests:
  Tear down plone.app.customerize.tests.layer.PloneCustomerize in 0.000 seconds.
  Set up plone.app.kss.tests.kss_and_plone_layer.KSSAndPloneLayer in 0.005 seconds.


Error in test test_update_of_nav_portlet (plone.app.kss.tests.test_part_reloading.TestPortletReloading)
Traceback (most recent call last):
  File "/usr/local/python2.6/lib/python2.6/unittest.py", line 279, in run
    testMethod()
  File "/home/stefan/autotest/temp/python26-zope212-cmf22-plone40/eggs/plone.app.kss-1.6.0a1-py2.6.egg/plone/app/kss/tests/test_part_reloading.py", line 62, in test_update_of_nav_portlet
    attributesTriggerNavigationPortletReload(folder, self.view, modified_event)
  File "/home/stefan/autotest/temp/python26-zope212-cmf22-plone40/eggs/plone.app.kss-1.6.0a1-py2.6.egg/plone/app/kss/portlets.py", line 20, in attributesTriggerNavigationPortletReload
    portletReloader.reloadPortletsByInterface(INavigationPortlet)
  File "/home/stefan/autotest/temp/python26-zope212-cmf22-plone40/eggs/plone.app.kss-1.6.0a1-py2.6.egg/plone/app/kss/portlets.py", line 58, in reloadPortletsByInterface
    self.reloadPortletByInfo(info)
  File "/home/stefan/autotest/temp/python26-zope212-cmf22-plone40/eggs/plone.app.kss-1.6.0a1-py2.6.egg/plone/app/kss/portlets.py", line 70, in reloadPortletByInfo
    result = renderer.render()
  File "/home/stefan/autotest/temp/python26-zope212-cmf22-plone40/eggs/plone.app.portlets-2.0b3-py2.6.egg/plone/app/portlets/portlets/navigation.py", line 205, in render
    return self._template()
  File "/home/stefan/autotest/temp/python26-zope212-cmf22-plone40/eggs/Zope2-2.12.3-py2.6-linux-x86_64.egg/Products/Five/browser/pagetemplatefile.py", line 126, in __call__
    return self.im_func(im_self, *args, **kw)
  File "/home/stefan/autotest/temp/python26-zope212-cmf22-plone40/eggs/Zope2-2.12.3-py2.6-linux-x86_64.egg/Products/Five/browser/pagetemplatefile.py", line 60, in __call__
    sourceAnnotations=getattr(debug_flags, 'sourceAnnotations', 0),
  File "/home/stefan/autotest/temp/python26-zope212-cmf22-plone40/eggs/zope.pagetemplate-3.5.0-py2.6.egg/zope/pagetemplate/pagetemplate.py", line 115, in pt_render
    strictinsert=0, sourceAnnotations=sourceAnnotations)()
  File "/home/stefan/autotest/temp/python26-zope212-cmf22-plone40/eggs/zope.tal-3.5.2-py2.6.egg/zope/tal/talinterpreter.py", line 271, in __call__
    self.interpret(self.program)
  File "/home/stefan/autotest/temp/python26-zope212-cmf22-plone40/eggs/zope.tal-3.5.2-py2.6.egg/zope/tal/talinterpreter.py", line 343, in interpret
    handlers[opcode](self, args)
  File "/home/stefan/autotest/temp/python26-zope212-cmf22-plone40/eggs/zope.tal-3.5.2-py2.6.egg/zope/tal/talinterpreter.py", line 533, in do_optTag_tal
    self.do_optTag(stuff)
  File "/home/stefan/autotest/temp/python26-zope212-cmf22-plone40/eggs/zope.tal-3.5.2-py2.6.egg/zope/tal/talinterpreter.py", line 518, in do_optTag
    return self.no_tag(start, program)
  File "/home/stefan/autotest/temp/python26-zope212-cmf22-plone40/eggs/zope.tal-3.5.2-py2.6.egg/zope/tal/talinterpreter.py", line 513, in no_tag
    self.interpret(program)
  File "/home/stefan/autotest/temp/python26-zope212-cmf22-plone40/eggs/zope.tal-3.5.2-py2.6.egg/zope/tal/talinterpreter.py", line 343, in interpret
    handlers[opcode](self, args)
  File "/home/stefan/autotest/temp/python26-zope212-cmf22-plone40/eggs/zope.tal-3.5.2-py2.6.egg/zope/tal/talinterpreter.py", line 531, in do_optTag_tal
    self.no_tag(stuff[-2], stuff[-1])
  File "/home/stefan/autotest/temp/python26-zope212-cmf22-plone40/eggs/zope.tal-3.5.2-py2.6.egg/zope/tal/talinterpreter.py", line 513, in no_tag
    self.interpret(program)
  File "/home/stefan/autotest/temp/python26-zope212-cmf22-plone40/eggs/zope.tal-3.5.2-py2.6.egg/zope/tal/talinterpreter.py", line 343, in interpret
    handlers[opcode](self, args)
  File "/home/stefan/autotest/temp/python26-zope212-cmf22-plone40/eggs/zope.tal-3.5.2-py2.6.egg/zope/tal/talinterpreter.py", line 742, in do_insertStructure_tal
    structure = self.engine.evaluateStructure(expr)
  File "/home/stefan/autotest/temp/python26-zope212-cmf22-plone40/eggs/Zope2-2.12.3-py2.6-linux-x86_64.egg/Products/PageTemplates/Expressions.py", line 220, in evaluateStructure
    text = super(ZopeContext, self).evaluateStructure(expr)
  File "/home/stefan/autotest/temp/python26-zope212-cmf22-plone40/eggs/zope.tales-3.4.0-py2.6.egg/zope/tales/tales.py", line 696, in evaluate
    return expression(self)
   - /home/stefan/autotest/temp/python26-zope212-cmf22-plone40/eggs/plone.app.portlets-2.0b3-py2.6.egg/plone/app/portlets/portlets/navigation.pt
   - Line 41, Column 12
   - Expression: <PathExpr standard:u'view/createNavTree'>
   - Names:
      {'args': (),
       'container': <ATFolder at /plone/testfolder>,
       'context': <ATFolder at /plone/testfolder>,
       'default': <object object at 0x2aac33dd1760>,
       'here': <ATFolder at /plone/testfolder>,
       'loop': {},
       'nothing': None,
       'options': {},
       'repeat': <Products.PageTemplates.Expressions.SafeMapping object at 0xe47f248>,
       'request': <HTTPRequest, URL=http://nohost>,
       'root': <Application at >,
       'template': <Products.Five.browser.pagetemplatefile.ViewPageTemplateFile object at 0x4fe0790>,
       'traverse_subpath': [],
       'user': <PropertiedUser 'portal_owner'>,
       'view': <plone.app.portlets.portlets.navigation.Renderer object at 0xf32c210>,
       'views': <Products.Five.browser.pagetemplatefile.ViewMapper object at 0x104d18d0>}
  File "/home/stefan/autotest/temp/python26-zope212-cmf22-plone40/eggs/zope.tales-3.4.0-py2.6.egg/zope/tales/expressions.py", line 217, in __call__
    return self._eval(econtext)
  File "/home/stefan/autotest/temp/python26-zope212-cmf22-plone40/eggs/Zope2-2.12.3-py2.6-linux-x86_64.egg/Products/PageTemplates/Expressions.py", line 157, in _eval
    return render(ob, econtext.vars)
  File "/home/stefan/autotest/temp/python26-zope212-cmf22-plone40/eggs/Zope2-2.12.3-py2.6-linux-x86_64.egg/Products/PageTemplates/Expressions.py", line 119, in render
    ob = ob()
  File "/home/stefan/autotest/temp/python26-zope212-cmf22-plone40/eggs/plone.app.portlets-2.0b3-py2.6.egg/plone/app/portlets/portlets/navigation.py", line 168, in createNavTree
    return self.recurse(children=data.get('children', []), level=1, bottomLevel=bottomLevel)
  File "/home/stefan/autotest/temp/python26-zope212-cmf22-plone40/eggs/Zope2-2.12.3-py2.6-linux-x86_64.egg/Products/Five/browser/pagetemplatefile.py", line 126, in __call__
    return self.im_func(im_self, *args, **kw)
  File "/home/stefan/autotest/temp/python26-zope212-cmf22-plone40/eggs/Zope2-2.12.3-py2.6-linux-x86_64.egg/Products/Five/browser/pagetemplatefile.py", line 60, in __call__
    sourceAnnotations=getattr(debug_flags, 'sourceAnnotations', 0),
  File "/home/stefan/autotest/temp/python26-zope212-cmf22-plone40/eggs/zope.pagetemplate-3.5.0-py2.6.egg/zope/pagetemplate/pagetemplate.py", line 115, in pt_render
    strictinsert=0, sourceAnnotations=sourceAnnotations)()
  File "/home/stefan/autotest/temp/python26-zope212-cmf22-plone40/eggs/zope.tal-3.5.2-py2.6.egg/zope/tal/talinterpreter.py", line 271, in __call__
    self.interpret(self.program)
  File "/home/stefan/autotest/temp/python26-zope212-cmf22-plone40/eggs/zope.tal-3.5.2-py2.6.egg/zope/tal/talinterpreter.py", line 343, in interpret
    handlers[opcode](self, args)
  File "/home/stefan/autotest/temp/python26-zope212-cmf22-plone40/eggs/zope.tal-3.5.2-py2.6.egg/zope/tal/talinterpreter.py", line 533, in do_optTag_tal
    self.do_optTag(stuff)
  File "/home/stefan/autotest/temp/python26-zope212-cmf22-plone40/eggs/zope.tal-3.5.2-py2.6.egg/zope/tal/talinterpreter.py", line 518, in do_optTag
    return self.no_tag(start, program)
  File "/home/stefan/autotest/temp/python26-zope212-cmf22-plone40/eggs/zope.tal-3.5.2-py2.6.egg/zope/tal/talinterpreter.py", line 513, in no_tag
    self.interpret(program)
  File "/home/stefan/autotest/temp/python26-zope212-cmf22-plone40/eggs/zope.tal-3.5.2-py2.6.egg/zope/tal/talinterpreter.py", line 343, in interpret
    handlers[opcode](self, args)
  File "/home/stefan/autotest/temp/python26-zope212-cmf22-plone40/eggs/zope.tal-3.5.2-py2.6.egg/zope/tal/talinterpreter.py", line 858, in do_defineMacro
    self.interpret(macro)
  File "/home/stefan/autotest/temp/python26-zope212-cmf22-plone40/eggs/zope.tal-3.5.2-py2.6.egg/zope/tal/talinterpreter.py", line 343, in interpret
    handlers[opcode](self, args)
  File "/home/stefan/autotest/temp/python26-zope212-cmf22-plone40/eggs/zope.tal-3.5.2-py2.6.egg/zope/tal/talinterpreter.py", line 533, in do_optTag_tal
    self.do_optTag(stuff)
  File "/home/stefan/autotest/temp/python26-zope212-cmf22-plone40/eggs/zope.tal-3.5.2-py2.6.egg/zope/tal/talinterpreter.py", line 518, in do_optTag
    return self.no_tag(start, program)
  File "/home/stefan/autotest/temp/python26-zope212-cmf22-plone40/eggs/zope.tal-3.5.2-py2.6.egg/zope/tal/talinterpreter.py", line 513, in no_tag
    self.interpret(program)
  File "/home/stefan/autotest/temp/python26-zope212-cmf22-plone40/eggs/zope.tal-3.5.2-py2.6.egg/zope/tal/talinterpreter.py", line 343, in interpret
    handlers[opcode](self, args)
  File "/home/stefan/autotest/temp/python26-zope212-cmf22-plone40/eggs/zope.tal-3.5.2-py2.6.egg/zope/tal/talinterpreter.py", line 821, in do_loop_tal
    self.interpret(block)
  File "/home/stefan/autotest/temp/python26-zope212-cmf22-plone40/eggs/zope.tal-3.5.2-py2.6.egg/zope/tal/talinterpreter.py", line 343, in interpret
    handlers[opcode](self, args)
  File "/home/stefan/autotest/temp/python26-zope212-cmf22-plone40/eggs/zope.tal-3.5.2-py2.6.egg/zope/tal/talinterpreter.py", line 533, in do_optTag_tal
    self.do_optTag(stuff)
  File "/home/stefan/autotest/temp/python26-zope212-cmf22-plone40/eggs/zope.tal-3.5.2-py2.6.egg/zope/tal/talinterpreter.py", line 518, in do_optTag
    return self.no_tag(start, program)
  File "/home/stefan/autotest/temp/python26-zope212-cmf22-plone40/eggs/zope.tal-3.5.2-py2.6.egg/zope/tal/talinterpreter.py", line 513, in no_tag
    self.interpret(program)
  File "/home/stefan/autotest/temp/python26-zope212-cmf22-plone40/eggs/zope.tal-3.5.2-py2.6.egg/zope/tal/talinterpreter.py", line 343, in interpret
    handlers[opcode](self, args)
  File "/home/stefan/autotest/temp/python26-zope212-cmf22-plone40/eggs/zope.tal-3.5.2-py2.6.egg/zope/tal/talinterpreter.py", line 852, in do_condition
    self.interpret(block)
  File "/home/stefan/autotest/temp/python26-zope212-cmf22-plone40/eggs/zope.tal-3.5.2-py2.6.egg/zope/tal/talinterpreter.py", line 343, in interpret
    handlers[opcode](self, args)
  File "/home/stefan/autotest/temp/python26-zope212-cmf22-plone40/eggs/zope.tal-3.5.2-py2.6.egg/zope/tal/talinterpreter.py", line 533, in do_optTag_tal
    self.do_optTag(stuff)
  File "/home/stefan/autotest/temp/python26-zope212-cmf22-plone40/eggs/zope.tal-3.5.2-py2.6.egg/zope/tal/talinterpreter.py", line 518, in do_optTag
    return self.no_tag(start, program)
  File "/home/stefan/autotest/temp/python26-zope212-cmf22-plone40/eggs/zope.tal-3.5.2-py2.6.egg/zope/tal/talinterpreter.py", line 513, in no_tag
    self.interpret(program)
  File "/home/stefan/autotest/temp/python26-zope212-cmf22-plone40/eggs/zope.tal-3.5.2-py2.6.egg/zope/tal/talinterpreter.py", line 343, in interpret
    handlers[opcode](self, args)
  File "/home/stefan/autotest/temp/python26-zope212-cmf22-plone40/eggs/zope.tal-3.5.2-py2.6.egg/zope/tal/talinterpreter.py", line 531, in do_optTag_tal
    self.no_tag(stuff[-2], stuff[-1])
  File "/home/stefan/autotest/temp/python26-zope212-cmf22-plone40/eggs/zope.tal-3.5.2-py2.6.egg/zope/tal/talinterpreter.py", line 513, in no_tag
    self.interpret(program)
  File "/home/stefan/autotest/temp/python26-zope212-cmf22-plone40/eggs/zope.tal-3.5.2-py2.6.egg/zope/tal/talinterpreter.py", line 343, in interpret
    handlers[opcode](self, args)
  File "/home/stefan/autotest/temp/python26-zope212-cmf22-plone40/eggs/zope.tal-3.5.2-py2.6.egg/zope/tal/talinterpreter.py", line 742, in do_insertStructure_tal
    structure = self.engine.evaluateStructure(expr)
  File "/home/stefan/autotest/temp/python26-zope212-cmf22-plone40/eggs/Zope2-2.12.3-py2.6-linux-x86_64.egg/Products/PageTemplates/Expressions.py", line 220, in evaluateStructure
    text = super(ZopeContext, self).evaluateStructure(expr)
  File "/home/stefan/autotest/temp/python26-zope212-cmf22-plone40/eggs/zope.tales-3.4.0-py2.6.egg/zope/tales/tales.py", line 696, in evaluate
    return expression(self)
   - /home/stefan/autotest/temp/python26-zope212-cmf22-plone40/eggs/plone.app.portlets-2.0b3-py2.6.egg/plone/app/portlets/portlets/navigation_recurse.pt
   - Line 27, Column 12
   - Expression: <PathExpr standard:u'item_icon/html_tag'>
   - Names:
      {'args': (),
       'container': <ATFolder at /plone/testfolder>,
       'context': <ATFolder at /plone/testfolder>,
       'default': <object object at 0x2aac33dd1760>,
       'here': <ATFolder at /plone/testfolder>,
       'loop': {},
       'nothing': None,
       'options': {'bottomLevel': 0,
                   'children': [{'Creator': 'portal_owner',
                                 'Description': 'Site News',
                                 'Title': 'News',
                                 'absolute_url': 'http://nohost/plone/news',
                                 'children': [],
                                 'creation_date': '2010-02-01 03:06:17',
                                 'currentItem': False,
                                 'currentParent': False,
                                 'depth': 1,
                                 'getRemoteUrl': Missing.Value,
                                 'getURL': 'http://nohost/plone/news',
                                 'item': <Products.ZCatalog.Catalog.mybrains object at 0x1008f8e8>,
                                 'item_icon': <plone.app.layout.icons.icons.CatalogBrainContentIcon object at 0x104d8790>,
                                 'link_remote': Missing.Value,
                                 'no_display': False,
                                 'normalized_portal_type': 'folder',
                                 'normalized_review_state': 'visible',
                                 'path': '/plone/news',
                                 'portal_type': 'Folder',
                                 'review_state': 'visible',
                                 'show_children': True},
                                {'Creator': 'portal_owner',
                                 'Description': 'Site Events',
                                 'Title': 'Events',
                                 'absolute_url': 'http://nohost/plone/events',
                                 'children': [],
                                 'creation_date': '2010-02-01 03:06:17',
                                 'currentItem': False,
                                 'currentParent': False,
                                 'depth': 1,
                                 'getRemoteUrl': Missing.Value,
                                 'getURL': 'http://nohost/plone/events',
                                 'item': <Products.ZCatalog.Catalog.mybrains object at 0x1008f3c0>,
                                 'item_icon': <plone.app.layout.icons.icons.CatalogBrainContentIcon object at 0x104d8590>,
                                 'link_remote': Missing.Value,
                                 'no_display': False,
                                 'normalized_portal_type': 'folder',
                                 'normalized_review_state': 'visible',
                                 'path': '/plone/events',
                                 'portal_type': 'Folder',
                                 'review_state': 'visible',
                                 'show_children': True},
                                {'Creator': 'portal_owner',
                                 'Description': "Container for users' home directories",
                                 'Title': 'Users',
                                 'absolute_url': 'http://nohost/plone/Members',
                                 'children': [],
                                 'creation_date': '2010-02-01 03:06:17',
                                 'currentItem': False,
                                 'currentParent': False,
                                 'depth': 1,
                                 'getRemoteUrl': Missing.Value,
                                 'getURL': 'http://nohost/plone/Members',
                                 'item': <Products.ZCatalog.Catalog.mybrains object at 0x1008f368>,
                                 'item_icon': <plone.app.layout.icons.icons.CatalogBrainContentIcon object at 0x104d8b90>,
                                 'link_remote': Missing.Value,
                                 'no_display': False,
                                 'normalized_portal_type': 'folder',
                                 'normalized_review_state': 'visible',
                                 'path': '/plone/Members',
                                 'portal_type': 'Folder',
                                 'review_state': 'visible',
                                 'show_children': True},
                                {'Creator': 'portal_owner',
                                 'Description': '',
                                 'Title': 'testfolder',
                                 'absolute_url': 'http://nohost/plone/testfolder',
                                 'children': [],
                                 'creation_date': '2010-02-01 03:10:21',
                                 'currentItem': True,
                                 'currentParent': False,
                                 'depth': 1,
                                 'getRemoteUrl': Missing.Value,
                                 'getURL': 'http://nohost/plone/testfolder',
                                 'item': <Products.ZCatalog.Catalog.mybrains object at 0x1008f0a8>,
                                 'item_icon': <plone.app.layout.icons.icons.CatalogBrainContentIcon object at 0x104d8bd0>,
                                 'link_remote': Missing.Value,
                                 'no_display': False,
                                 'normalized_portal_type': 'folder',
                                 'normalized_review_state': 'visible',
                                 'path': '/plone/testfolder',
                                 'portal_type': 'Folder',
                                 'review_state': 'visible',
                                 'show_children': True}],
                   'level': 1},
       'repeat': <Products.PageTemplates.Expressions.SafeMapping object at 0xe4a6098>,
       'request': <HTTPRequest, URL=http://nohost>,
       'root': <Application at >,
       'template': <Products.Five.browser.pagetemplatefile.ViewPageTemplateFile object at 0x4fe07d0>,
       'traverse_subpath': [],
       'user': <PropertiedUser 'portal_owner'>,
       'view': <plone.app.portlets.portlets.navigation.Renderer object at 0xf32c210>,
       'views': <Products.Five.browser.pagetemplatefile.ViewMapper object at 0x1039ef10>}
  File "/home/stefan/autotest/temp/python26-zope212-cmf22-plone40/eggs/zope.tales-3.4.0-py2.6.egg/zope/tales/expressions.py", line 217, in __call__
    return self._eval(econtext)
  File "/home/stefan/autotest/temp/python26-zope212-cmf22-plone40/eggs/Zope2-2.12.3-py2.6-linux-x86_64.egg/Products/PageTemplates/Expressions.py", line 149, in _eval
    ob = self._subexprs[-1](econtext)
  File "/home/stefan/autotest/temp/python26-zope212-cmf22-plone40/eggs/zope.tales-3.4.0-py2.6.egg/zope/tales/expressions.py", line 124, in _eval
    ob = self._traverser(ob, element, econtext)
  File "/home/stefan/autotest/temp/python26-zope212-cmf22-plone40/eggs/Zope2-2.12.3-py2.6-linux-x86_64.egg/Products/PageTemplates/Expressions.py", line 99, in trustedBoboAwareZopeTraverse
    request=request)
  File "/home/stefan/autotest/temp/python26-zope212-cmf22-plone40/eggs/zope.traversing-3.7.1-py2.6.egg/zope/traversing/adapters.py", line 139, in traversePathElement
    return traversable.traverse(nm, further_path)
   - __traceback_info__: (u'<img width="16" height="16" src="http://nohost/plone/folder_icon.png" alt="Folder" />', 'html_tag')
  File "/home/stefan/autotest/temp/python26-zope212-cmf22-plone40/eggs/zope.traversing-3.7.1-py2.6.egg/zope/traversing/adapters.py", line 53, in traverse
    raise LocationError(subject, name)
   - __traceback_info__: (u'<img width="16" height="16" src="http://nohost/plone/folder_icon.png" alt="Folder" />', 'html_tag', [])
LocationError: (u'<img width="16" height="16" src="http://nohost/plone/folder_icon.png" alt="Folder" />', 'html_tag')

  Ran 13 tests with 0 failures and 1 errors in 1.174 seconds.
Running plone.app.linkintegrity.tests.layer.PloneLinkintegrity tests:
  Tear down plone.app.kss.tests.kss_and_plone_layer.KSSAndPloneLayer in 0.000 seconds.
  Set up plone.app.linkintegrity.tests.layer.PloneLinkintegrity in 0.442 seconds.
  Ran 117 tests with 0 failures and 0 errors in 24.667 seconds.
Running plone.app.upgrade.tests.base.FunctionalUpgradeLayer tests:
  Tear down plone.app.linkintegrity.tests.layer.PloneLinkintegrity in 0.051 seconds.
  Set up plone.app.upgrade.tests.base.FunctionalUpgradeLayer in 0.000 seconds.
  Ran 11 tests with 0 failures and 0 errors in 1 minutes 0.752 seconds.
Running plone.app.viewletmanager.tests.test_exportimport.Layer tests:
  Tear down plone.app.upgrade.tests.base.FunctionalUpgradeLayer in 0.000 seconds.
  Tear down Products.PloneTestCase.layer.PloneSite in 0.410 seconds.
  Tear down Products.PloneTestCase.layer.ZCML in 0.016 seconds.
  Tear down Testing.ZopeTestCase.layer.ZopeLite in 0.000 seconds.
  Set up plone.app.viewletmanager.tests.test_exportimport.Layer in 0.000 seconds.
  Ran 16 tests with 0 failures and 0 errors in 0.050 seconds.
Running zope.testing.testrunner.layer.UnitTests tests:
  Tear down plone.app.viewletmanager.tests.test_exportimport.Layer in 0.000 seconds.
  Set up zope.testing.testrunner.layer.UnitTests in 0.000 seconds.
  Ran 145 tests with 0 failures and 0 errors in 0.881 seconds.
Tearing down left over layers:
  Tear down zope.testing.testrunner.layer.UnitTests in 0.000 seconds.
Total: 2358 tests, 0 failures, 1 errors in 5 minutes 46.905 seconds.
Running Testing.ZopeTestCase.layer.ZopeLite tests:
  Set up Testing.ZopeTestCase.layer.ZopeLite in 1.468 seconds.
  Ran 165 tests with 0 failures and 0 errors in 0.630 seconds.
Running Products.PloneTestCase.layer.ZCML tests:
  Set up Products.PloneTestCase.layer.ZCML in 2.337 seconds.
  Ran 34 tests with 0 failures and 0 errors in 0.211 seconds.
Running Products.PlonePAS.tests.layer.PlonePASLayer tests:
  Set up Products.PloneTestCase.layer.PloneSite in 3.890 seconds.
  Set up Products.PlonePAS.tests.layer.PlonePASLayer in 0.000 seconds.
  Ran 153 tests with 0 failures and 0 errors in 1.894 seconds.
Running zope.testing.testrunner.layer.UnitTests tests:
  Tear down Products.PlonePAS.tests.layer.PlonePASLayer in 0.000 seconds.
  Tear down Products.PloneTestCase.layer.PloneSite in 0.350 seconds.
  Tear down Products.PloneTestCase.layer.ZCML in 0.004 seconds.
  Tear down Testing.ZopeTestCase.layer.ZopeLite in 0.000 seconds.
  Set up zope.testing.testrunner.layer.UnitTests in 0.000 seconds.
  Ran 337 tests with 0 failures and 0 errors in 0.689 seconds.
Tearing down left over layers:
  Tear down zope.testing.testrunner.layer.UnitTests in 0.000 seconds.
Total: 689 tests, 0 failures, 0 errors in 12.247 seconds.
Running Products.PloneTestCase.layer.PloneSite tests:
  Set up Testing.ZopeTestCase.layer.ZopeLite in 1.416 seconds.
  Set up Products.PloneTestCase.layer.ZCML in 2.378 seconds.
  Set up Products.PloneTestCase.layer.PloneSite in 4.364 seconds.
/home/stefan/autotest/temp/python26-zope212-cmf22-plone40/eggs/borg.localrole-3.0a1-py2.6.egg/borg/localrole/bbb/bbb.txt:1: DeprecationWarning: IWorkspace is deprecated. Please use borg.localrole.interfaces.ILocalRoleProvider instead
  =========
/home/stefan/autotest/temp/python26-zope212-cmf22-plone40/eggs/borg.localrole-3.0a1-py2.6.egg/borg/localrole/bbb/bbb.txt:1: DeprecationWarning: IGroupAwareWorkspace is deprecated. Please use borg.localrole.interfaces.ILocalRoleProvider instead
  =========
  Ran 39 tests with 0 failures and 0 errors in 0.234 seconds.
Running plone.browserlayer.tests.test_doctest.PloneBrowserLayerLayer tests:
  Set up plone.browserlayer.tests.test_doctest.PloneBrowserLayerLayer in 0.003 seconds.
  Ran 9 tests with 0 failures and 0 errors in 0.956 seconds.
Running plone.theme.tests.test_doctest.PloneThemeLayer tests:
  Tear down plone.browserlayer.tests.test_doctest.PloneBrowserLayerLayer in 0.000 seconds.
  Set up plone.theme.tests.test_doctest.PloneThemeLayer in 0.003 seconds.
  Ran 5 tests with 0 failures and 0 errors in 0.052 seconds.
Running zope.testing.testrunner.layer.UnitTests tests:
  Tear down plone.theme.tests.test_doctest.PloneThemeLayer in 0.000 seconds.
  Tear down Products.PloneTestCase.layer.PloneSite in 0.346 seconds.
  Tear down Products.PloneTestCase.layer.ZCML in 0.004 seconds.
  Tear down Testing.ZopeTestCase.layer.ZopeLite in 0.000 seconds.
  Set up zope.testing.testrunner.layer.UnitTests in 0.000 seconds.
/usr/local/python2.6/lib/python2.6/mhlib.py:83: DeprecationWarning: the multifile module has been deprecated since Python 2.5
  import multifile
  Ran 252 tests with 0 failures and 0 errors in 0.839 seconds.
Tearing down left over layers:
  Tear down zope.testing.testrunner.layer.UnitTests in 0.000 seconds.
Total: 305 tests, 0 failures, 0 errors in 11.471 seconds.
Running Products.PloneTestCase.layer.PloneSite tests:
  Set up Testing.ZopeTestCase.layer.ZopeLite in 0.901 seconds.
  Set up Products.PloneTestCase.layer.ZCML in 2.351 seconds.
  Set up Products.PloneTestCase.layer.PloneSite in 4.166 seconds.
/usr/local/python2.6/lib/python2.6/unittest.py:279: DeprecationWarning: The use of 'hide' has been deprecated and will be removed in plone.portlet.static 2.0. Instead, use the new generic built-in show/hide setting of plone.portlets.
  testMethod()
  Ran 165 tests with 0 failures and 0 errors in 15.071 seconds.
Running plone.app.portlets.tests.test_configuration.TestPortletZCMLLayer tests:
  Set up plone.app.portlets.tests.test_configuration.TestPortletZCMLLayer in 0.006 seconds.
  Ran 5 tests with 0 failures and 0 errors in 0.039 seconds.
Running plone.app.portlets.tests.test_configuration.TestPortletGSLayer tests:
  Set up plone.app.portlets.tests.test_configuration.TestPortletGSLayer in 1.559 seconds.
  Ran 13 tests with 0 failures and 0 errors in 4.126 seconds.
Running zope.testing.testrunner.layer.UnitTests tests:
  Tear down plone.app.portlets.tests.test_configuration.TestPortletGSLayer in 0.000 seconds.
  Tear down plone.app.portlets.tests.test_configuration.TestPortletZCMLLayer in 0.000 seconds.
  Tear down Products.PloneTestCase.layer.PloneSite in 0.358 seconds.
  Tear down Products.PloneTestCase.layer.ZCML in 0.005 seconds.
  Tear down Testing.ZopeTestCase.layer.ZopeLite in 0.000 seconds.
  Set up zope.testing.testrunner.layer.UnitTests in 0.000 seconds.
  Ran 57 tests with 0 failures and 0 errors in 0.149 seconds.
Tearing down left over layers:
  Tear down zope.testing.testrunner.layer.UnitTests in 0.000 seconds.
Total: 240 tests, 0 failures, 0 errors in 29.568 seconds.
Running zope.testing.testrunner.layer.UnitTests tests:
  Set up zope.testing.testrunner.layer.UnitTests in 0.000 seconds.
  Ran 3 tests with 0 failures and 0 errors in 12.457 seconds.
Tearing down left over layers:
  Tear down zope.testing.testrunner.layer.UnitTests in 0.000 seconds.
Running Products.PloneTestCase.layer.PloneSite tests:
  Set up Testing.ZopeTestCase.layer.ZopeLite in 0.000 seconds.
  Set up Products.PloneTestCase.layer.ZCML in 1.852 seconds.
  Set up Products.PloneTestCase.layer.PloneSite in 5.350 seconds.
  Ran 23 tests with 0 failures and 0 errors in 3.499 seconds.
Running Products.CMFPlacefulWorkflow.tests.test_exportimport.ExportImportLayer tests:
  Set up Products.CMFPlacefulWorkflow.tests.test_exportimport.ExportImportLayer in 0.001 seconds.
  Ran 12 tests with 0 failures and 0 errors in 0.917 seconds.
Tearing down left over layers:
  Tear down Products.CMFPlacefulWorkflow.tests.test_exportimport.ExportImportLayer in 0.000 seconds.
  Tear down Products.PloneTestCase.layer.PloneSite in 0.360 seconds.
  Tear down Products.PloneTestCase.layer.ZCML in 0.004 seconds.
  Tear down Testing.ZopeTestCase.layer.ZopeLite in 0.000 seconds.
Total: 35 tests, 0 failures, 0 errors in 12.424 seconds.
Running Products.CMFTestCase.layer.CMFSite tests:
  Set up Testing.ZopeTestCase.layer.ZopeLite in 0.231 seconds.
  Set up Products.CMFTestCase.layer.ZCML in 0.368 seconds.
  Set up Products.CMFTestCase.layer.CMFSite in 0.209 seconds.
  Ran 58 tests with 0 failures and 0 errors in 0.229 seconds.
Tearing down left over layers:
  Tear down Products.CMFTestCase.layer.CMFSite in 0.028 seconds.
  Tear down Products.CMFTestCase.layer.ZCML in 0.001 seconds.
  Tear down Testing.ZopeTestCase.layer.ZopeLite in 0.000 seconds.
Running zope.testing.testrunner.layer.UnitTests tests:
  Set up zope.testing.testrunner.layer.UnitTests in 0.000 seconds.
  Ran 35 tests with 0 failures and 0 errors in 0.026 seconds.
Tearing down left over layers:
  Tear down zope.testing.testrunner.layer.UnitTests in 0.000 seconds.
Running Products.PloneTestCase.layer.PloneSite tests:
  Set up Testing.ZopeTestCase.layer.ZopeLite in 1.362 seconds.
  Set up Products.PloneTestCase.layer.ZCML in 2.419 seconds.
  Set up Products.PloneTestCase.layer.PloneSite in 4.063 seconds.


Failure in test /home/stefan/autotest/temp/python26-zope212-cmf22-plone40/eggs/Products.PasswordResetTool-2.0b5-py2.6.egg/Products/PasswordResetTool/tests/browser.txt
Failed doctest test for browser.txt
  File "/home/stefan/autotest/temp/python26-zope212-cmf22-plone40/eggs/Products.PasswordResetTool-2.0b5-py2.6.egg/Products/PasswordResetTool/tests/browser.txt", line 0

----------------------------------------------------------------------
File "/home/stefan/autotest/temp/python26-zope212-cmf22-plone40/eggs/Products.PasswordResetTool-2.0b5-py2.6.egg/Products/PasswordResetTool/tests/browser.txt", line 125, in browser.txt
Failed example:
    open('/tmp/test.html', 'w').write(browser.contents)
Exception raised:
    Traceback (most recent call last):
      File "/home/stefan/autotest/temp/python26-zope212-cmf22-plone40/eggs/zope.testing-3.7.7-py2.6.egg/zope/testing/doctest.py", line 1361, in __run
        compileflags, 1) in test.globs
      File "<doctest browser.txt[line 125, example 27]>", line 1, in <module>
        open('/tmp/test.html', 'w').write(browser.contents)
    IOError: [Errno 13] Permission denied: '/tmp/test.html'
----------------------------------------------------------------------
File "/home/stefan/autotest/temp/python26-zope212-cmf22-plone40/eggs/Products.PasswordResetTool-2.0b5-py2.6.egg/Products/PasswordResetTool/tests/browser.txt", line 137, in browser.txt
Failed example:
    open('/tmp/test2.html', 'w').write(browser.contents)
Exception raised:
    Traceback (most recent call last):
      File "/home/stefan/autotest/temp/python26-zope212-cmf22-plone40/eggs/zope.testing-3.7.7-py2.6.egg/zope/testing/doctest.py", line 1361, in __run
        compileflags, 1) in test.globs
      File "<doctest browser.txt[line 137, example 34]>", line 1, in <module>
        open('/tmp/test2.html', 'w').write(browser.contents)
    IOError: [Errno 13] Permission denied: '/tmp/test2.html'

  Ran 38 tests with 1 failures and 0 errors in 3.998 seconds.
Tearing down left over layers:
  Tear down Products.PloneTestCase.layer.PloneSite in 0.366 seconds.
  Tear down Products.PloneTestCase.layer.ZCML in 0.006 seconds.
  Tear down Testing.ZopeTestCase.layer.ZopeLite in 0.000 seconds.
Running Products.PloneTestCase.layer.PloneSite tests:
  Set up Testing.ZopeTestCase.layer.ZopeLite in 1.446 seconds.
  Set up Products.PloneTestCase.layer.ZCML in 2.415 seconds.
  Set up Products.PloneTestCase.layer.PloneSite in 4.083 seconds.
/home/stefan/autotest/temp/python26-zope212-cmf22-plone40/eggs/Products.PlonePAS-4.0b3-py2.6.egg/Products/PlonePAS/tools/membership.py:552: DeprecationWarning: credentialsChanged should be called with 'REQUEST' as second argument. The BBB code will be removed in CMF 2.3.
  self.credentialsChanged(password, REQUEST=REQUEST)
  Ran 61 tests with 0 failures and 0 errors in 1.255 seconds.
Tearing down left over layers:
  Tear down Products.PloneTestCase.layer.PloneSite in 0.364 seconds.
  Tear down Products.PloneTestCase.layer.ZCML in 0.004 seconds.
  Tear down Testing.ZopeTestCase.layer.ZopeLite in 0.000 seconds.
Running Products.PloneTestCase.layer.PloneSite tests:
  Set up Testing.ZopeTestCase.layer.ZopeLite in 1.438 seconds.
  Set up Products.PloneTestCase.layer.ZCML in 2.666 seconds.
  Set up Products.PloneTestCase.layer.PloneSite in 4.193 seconds.
  Ran 245 tests with 0 failures and 0 errors in 17.813 seconds.
Running zope.testing.testrunner.layer.UnitTests tests:
  Tear down Products.PloneTestCase.layer.PloneSite in 0.373 seconds.
  Tear down Products.PloneTestCase.layer.ZCML in 0.005 seconds.
  Tear down Testing.ZopeTestCase.layer.ZopeLite in 0.000 seconds.
  Set up zope.testing.testrunner.layer.UnitTests in 0.000 seconds.
  Ran 59 tests with 0 failures and 0 errors in 0.013 seconds.
Tearing down left over layers:
  Tear down zope.testing.testrunner.layer.UnitTests in 0.000 seconds.
Total: 304 tests, 0 failures, 0 errors in 26.937 seconds.
Running Products.PloneTestCase.layer.PloneSite tests:
  Set up Testing.ZopeTestCase.layer.ZopeLite in 1.412 seconds.
  Set up Products.PloneTestCase.layer.ZCML in 2.390 seconds.
  Set up Products.PloneTestCase.layer.PloneSite in 4.052 seconds.
  Ran 78 tests with 0 failures and 0 errors in 2.929 seconds.
Tearing down left over layers:
  Tear down Products.PloneTestCase.layer.PloneSite in 0.363 seconds.
  Tear down Products.PloneTestCase.layer.ZCML in 0.007 seconds.
  Tear down Testing.ZopeTestCase.layer.ZopeLite in 0.000 seconds.
Running zope.testing.testrunner.layer.UnitTests tests:
  Set up zope.testing.testrunner.layer.UnitTests in 0.000 seconds.
  Ran 76 tests with 0 failures and 0 errors in 1.515 seconds.
Tearing down left over layers:
  Tear down zope.testing.testrunner.layer.UnitTests in 0.000 seconds.
Running Products.contentmigration.tests.layer.TestLayer tests:
  Set up Testing.ZopeTestCase.layer.ZopeLite in 1.417 seconds.
  Set up Products.PloneTestCase.layer.ZCML in 2.394 seconds.
  Set up Products.PloneTestCase.layer.PloneSite in 4.097 seconds.
  Set up Products.contentmigration.tests.layer.TestLayer in 0.002 seconds.
  Ran 18 tests with 0 failures and 0 errors in 5.362 seconds.
Tearing down left over layers:
  Tear down Products.contentmigration.tests.layer.TestLayer in 0.000 seconds.
  Tear down Products.PloneTestCase.layer.PloneSite in 0.371 seconds.
  Tear down Products.PloneTestCase.layer.ZCML in 0.004 seconds.
  Tear down Testing.ZopeTestCase.layer.ZopeLite in 0.000 seconds.
Total: 0 tests, 0 failures, 0 errors in 0.000 seconds.
Running archetypes.referencebrowserwidget.tests.base.layer tests:
  Set up Testing.ZopeTestCase.layer.ZopeLite in 0.000 seconds.
  Set up Products.PloneTestCase.layer.ZCML in 1.851 seconds.
  Set up Products.PloneTestCase.layer.PloneSite in 4.716 seconds.
  Set up archetypes.referencebrowserwidget.tests.base.layer in 0.000 seconds.
  Ran 43 tests with 0 failures and 0 errors in 7.807 seconds.
Running zope.testing.testrunner.layer.UnitTests tests:
  Tear down archetypes.referencebrowserwidget.tests.base.layer in 0.000 seconds.
  Tear down Products.PloneTestCase.layer.PloneSite in 0.372 seconds.
  Tear down Products.PloneTestCase.layer.ZCML in 0.007 seconds.
  Tear down Testing.ZopeTestCase.layer.ZopeLite in 0.000 seconds.
  Set up zope.testing.testrunner.layer.UnitTests in 0.000 seconds.
  Ran 4 tests with 0 failures and 0 errors in 0.001 seconds.
Tearing down left over layers:
  Tear down zope.testing.testrunner.layer.UnitTests in 0.000 seconds.
Total: 47 tests, 0 failures, 0 errors in 15.241 seconds.
Running archetypes.schemaextender.tests.testIntegration.layer tests:
  Set up Testing.ZopeTestCase.layer.ZopeLite in 1.360 seconds.
  Set up Products.PloneTestCase.layer.ZCML in 2.422 seconds.
  Set up Products.PloneTestCase.layer.PloneSite in 4.131 seconds.
  Set up archetypes.schemaextender.tests.testIntegration.layer in 0.000 seconds.
  Ran 17 tests with 0 failures and 0 errors in 3.154 seconds.
Running zope.testing.testrunner.layer.UnitTests tests:
  Tear down archetypes.schemaextender.tests.testIntegration.layer in 0.000 seconds.
  Tear down Products.PloneTestCase.layer.PloneSite in 0.371 seconds.
  Tear down Products.PloneTestCase.layer.ZCML in 0.007 seconds.
  Tear down Testing.ZopeTestCase.layer.ZopeLite in 0.000 seconds.
  Set up zope.testing.testrunner.layer.UnitTests in 0.000 seconds.
  Ran 19 tests with 0 failures and 0 errors in 0.007 seconds.
Tearing down left over layers:
  Tear down zope.testing.testrunner.layer.UnitTests in 0.000 seconds.
Total: 36 tests, 0 failures, 0 errors in 11.917 seconds.
Running zope.testing.testrunner.layer.UnitTests tests:
  Set up zope.testing.testrunner.layer.UnitTests in 0.000 seconds.
  Ran 4 tests with 0 failures and 0 errors in 0.040 seconds.
Tearing down left over layers:
  Tear down zope.testing.testrunner.layer.UnitTests in 0.000 seconds.
Running Testing.ZopeTestCase.layer.ZopeLite tests:
  Set up Testing.ZopeTestCase.layer.ZopeLite in 0.068 seconds.
  Ran 40 tests with 0 failures and 0 errors in 0.786 seconds.
Tearing down left over layers:
  Tear down Testing.ZopeTestCase.layer.ZopeLite in 0.000 seconds.
Running Testing.ZopeTestCase.layer.ZopeLite tests:
  Set up Testing.ZopeTestCase.layer.ZopeLite in 0.034 seconds.
  Ran 40 tests with 0 failures and 0 errors in 0.982 seconds.
Running zope.testing.testrunner.layer.UnitTests tests:
  Tear down Testing.ZopeTestCase.layer.ZopeLite in 0.000 seconds.
  Set up zope.testing.testrunner.layer.UnitTests in 0.000 seconds.
  Ran 1 tests with 0 failures and 0 errors in 0.099 seconds.
Tearing down left over layers:
  Tear down zope.testing.testrunner.layer.UnitTests in 0.000 seconds.
Total: 41 tests, 0 failures, 0 errors in 1.294 seconds.
/home/stefan/autotest/temp/python26-zope212-cmf22-plone40/src/kss.core/kss/core/tests/test_kssview_core.py:165: UserWarning: The test_class you are using doesn't subclass from ZopeTestCase.Functional. Please fix that.
  tearDown=KSSViewTestCase.beforeTearDown.im_func))
Running Testing.ZopeTestCase.layer.ZopeLite tests:
  Set up Testing.ZopeTestCase.layer.ZopeLite in 0.049 seconds.
  Ran 1 tests with 0 failures and 0 errors in 0.264 seconds.
Running kss.core.tests.base.KSSLayer tests:
  Tear down Testing.ZopeTestCase.layer.ZopeLite in 0.000 seconds.
  Set up kss.core.tests.base.KSSCoreLayer in 0.031 seconds.
  Set up kss.core.tests.base.KSSLayer in 0.057 seconds.
  Ran 29 tests with 0 failures and 0 errors in 0.164 seconds.
Running kss.core.tests.test_ttwapi.layer tests:
  Set up kss.core.tests.test_ttwapi.layer in 0.001 seconds.
  Ran 3 tests with 0 failures and 0 errors in 0.026 seconds.
Running zope.testing.testrunner.layer.UnitTests tests:
  Tear down kss.core.tests.test_ttwapi.layer in 0.000 seconds.
  Tear down kss.core.tests.base.KSSLayer in 0.000 seconds.
  Tear down kss.core.tests.base.KSSCoreLayer in 0.000 seconds.
  Set up zope.testing.testrunner.layer.UnitTests in 0.000 seconds.
/home/stefan/autotest/temp/python26-zope212-cmf22-plone40/src/kss.core/kss/core/siteview.txt:1: DeprecationWarning: ISite is deprecated. Moved to zope.location.interfaces. Importing from here will stop working in Zope 3.6
  =========
  Ran 14 tests with 0 failures and 0 errors in 0.009 seconds.
Tearing down left over layers:
  Tear down zope.testing.testrunner.layer.UnitTests in 0.000 seconds.
Total: 47 tests, 0 failures, 0 errors in 0.914 seconds.
***********************************************
WARNING: LinguaPlone not found. Skipping tests.
***********************************************
***********************************************
WARNING: LinguaPlone not found. Skipping tests.
***********************************************
Running plone.app.blob.tests.layer.BlobLayer tests:
  Set up Testing.ZopeTestCase.layer.ZopeLite in 0.934 seconds.
  Set up Products.PloneTestCase.layer.ZCML in 2.415 seconds.
  Set up Products.PloneTestCase.layer.PloneSite in 5.385 seconds.
  Set up plone.app.blob.tests.layer.BlobLayer in 0.104 seconds.
/home/stefan/autotest/temp/python26-zope212-cmf22-plone40/eggs/Products.PortalTransforms-2.0b1-py2.6.egg/Products/PortalTransforms/libtransforms/commandtransform.py:97: DeprecationWarning: os.popen4 is deprecated.  Use the subprocess module.
  cin, couterr = os.popen4(command, 'b')
  Ran 29 tests with 0 failures and 0 errors in 7.563 seconds.
Running plone.app.blob.tests.layer.BlobReplacementLayer tests:
  Set up plone.app.blob.tests.layer.BlobReplacementLayer in 0.195 seconds.
  Ran 40 tests with 0 failures and 0 errors in 10.869 seconds.
Running zope.testing.testrunner.layer.UnitTests tests:
  Tear down plone.app.blob.tests.layer.BlobReplacementLayer in 0.000 seconds.
  Tear down plone.app.blob.tests.layer.BlobLayer in 0.000 seconds.
  Tear down Products.PloneTestCase.layer.PloneSite in 0.357 seconds.
  Tear down Products.PloneTestCase.layer.ZCML in 0.009 seconds.
  Tear down Testing.ZopeTestCase.layer.ZopeLite in 0.000 seconds.
  Set up zope.testing.testrunner.layer.UnitTests in 0.000 seconds.
  Ran 2 tests with 0 failures and 0 errors in 0.001 seconds.
Tearing down left over layers:
  Tear down zope.testing.testrunner.layer.UnitTests in 0.000 seconds.
Total: 71 tests, 0 failures, 0 errors in 28.574 seconds.
Running Testing.ZopeTestCase.layer.ZopeLite tests:
  Set up Testing.ZopeTestCase.layer.ZopeLite in 0.936 seconds.
  Ran 2 tests with 0 failures and 0 errors in 0.008 seconds.
Running plone.app.folder.tests.layer.IntegrationLayer tests:
  Set up Products.PloneTestCase.layer.ZCML in 2.443 seconds.
  Set up Products.PloneTestCase.layer.PloneSite in 3.975 seconds.
  Set up plone.app.folder.tests.layer.IntegrationLayer in 0.471 seconds.
  Ran 12 tests with 0 failures and 0 errors in 2.377 seconds.
Running plone.app.folder.tests.layer.PartialOrderingIntegrationLayer tests:
  Set up plone.app.folder.tests.layer.PartialOrderingIntegrationLayer in 0.000 seconds.
  Ran 3 tests with 0 failures and 0 errors in 0.318 seconds.
Tearing down left over layers:
  Tear down plone.app.folder.tests.layer.PartialOrderingIntegrationLayer in 0.000 seconds.
  Tear down plone.app.folder.tests.layer.IntegrationLayer in 0.000 seconds.
  Tear down Products.PloneTestCase.layer.PloneSite in 0.367 seconds.
  Tear down Products.PloneTestCase.layer.ZCML in 0.004 seconds.
  Tear down Testing.ZopeTestCase.layer.ZopeLite in 0.000 seconds.
Total: 17 tests, 0 failures, 0 errors in 11.470 seconds.
Running plone.app.imaging.tests.layer.ImagingLayer tests:
  Set up Testing.ZopeTestCase.layer.ZopeLite in 0.931 seconds.
  Set up Products.PloneTestCase.layer.ZCML in 2.416 seconds.
  Set up Products.PloneTestCase.layer.PloneSite in 4.142 seconds.
  Set up plone.app.imaging.tests.layer.ImagingLayer in 0.101 seconds.
  Ran 37 tests with 0 failures and 0 errors in 4.189 seconds.
Running zope.testing.testrunner.layer.UnitTests tests:
  Tear down plone.app.imaging.tests.layer.ImagingLayer in 0.000 seconds.
  Tear down Products.PloneTestCase.layer.PloneSite in 0.381 seconds.
  Tear down Products.PloneTestCase.layer.ZCML in 0.005 seconds.
  Tear down Testing.ZopeTestCase.layer.ZopeLite in 0.000 seconds.
  Set up zope.testing.testrunner.layer.UnitTests in 0.000 seconds.
  Ran 7 tests with 0 failures and 0 errors in 0.001 seconds.
Tearing down left over layers:
  Tear down zope.testing.testrunner.layer.UnitTests in 0.000 seconds.
Total: 44 tests, 0 failures, 0 errors in 12.609 seconds.
Running Products.PloneTestCase.layer.PloneSite tests:
  Set up Testing.ZopeTestCase.layer.ZopeLite in 1.463 seconds.
  Set up Products.PloneTestCase.layer.ZCML in 2.456 seconds.
  Set up Products.PloneTestCase.layer.PloneSite in 4.137 seconds.
  Ran 9 tests with 0 failures and 0 errors in 0.130 seconds.
Tearing down left over layers:
  Tear down Products.PloneTestCase.layer.PloneSite in 0.367 seconds.
  Tear down Products.PloneTestCase.layer.ZCML in 0.004 seconds.
  Tear down Testing.ZopeTestCase.layer.ZopeLite in 0.000 seconds.
Total: 0 tests, 0 failures, 0 errors in 0.000 seconds.
Running Products.PloneTestCase.layer.PloneSite tests:
  Set up Testing.ZopeTestCase.layer.ZopeLite in 1.496 seconds.
  Set up Products.PloneTestCase.layer.ZCML in 2.369 seconds.
  Set up Products.PloneTestCase.layer.PloneSite in 4.131 seconds.
  Ran 3 tests with 0 failures and 0 errors in 1.169 seconds.
Tearing down left over layers:
  Tear down Products.PloneTestCase.layer.PloneSite in 0.354 seconds.
  Tear down Products.PloneTestCase.layer.ZCML in 0.004 seconds.
  Tear down Testing.ZopeTestCase.layer.ZopeLite in 0.000 seconds.
Running Products.PloneTestCase.layer.PloneSite tests:
  Set up Testing.ZopeTestCase.layer.ZopeLite in 1.383 seconds.
  Set up Products.PloneTestCase.layer.ZCML in 2.427 seconds.
  Set up Products.PloneTestCase.layer.PloneSite in 4.114 seconds.
  Ran 9 tests with 0 failures and 0 errors in 4.225 seconds.
Tearing down left over layers:
  Tear down Products.PloneTestCase.layer.PloneSite in 0.366 seconds.
  Tear down Products.PloneTestCase.layer.ZCML in 0.006 seconds.
  Tear down Testing.ZopeTestCase.layer.ZopeLite in 0.000 seconds.
Running plone.folder.tests.layer.PartialOrderingLayer tests:
  Set up plone.folder.tests.layer.PartialOrderingLayer in 0.000 seconds.
  Ran 11 tests with 0 failures and 0 errors in 0.007 seconds.
Running plone.folder.tests.layer.PloneFolderLayer tests:
  Tear down plone.folder.tests.layer.PartialOrderingLayer in 0.000 seconds.
  Set up plone.folder.tests.layer.PloneFolderLayer in 0.000 seconds.
  Ran 54 tests with 0 failures and 0 errors in 0.031 seconds.
Tearing down left over layers:
  Tear down plone.folder.tests.layer.PloneFolderLayer in 0.000 seconds.
Total: 65 tests, 0 failures, 0 errors in 0.173 seconds.
Running Products.PloneTestCase.layer.PloneSite tests:
  Set up Testing.ZopeTestCase.layer.ZopeLite in 1.469 seconds.
  Set up Products.PloneTestCase.layer.ZCML in 2.434 seconds.
  Set up Products.PloneTestCase.layer.PloneSite in 4.362 seconds.
  Ran 41 tests with 0 failures and 0 errors in 0.375 seconds.
Tearing down left over layers:
  Tear down Products.PloneTestCase.layer.PloneSite in 0.364 seconds.
  Tear down Products.PloneTestCase.layer.ZCML in 0.004 seconds.
  Tear down Testing.ZopeTestCase.layer.ZopeLite in 0.000 seconds.
Total: 0 tests, 0 failures, 0 errors in 0.000 seconds.
Total: 0 tests, 0 failures, 0 errors in 0.000 seconds.
Running Products.PloneTestCase.layer.ZCML tests:
  Set up Testing.ZopeTestCase.layer.ZopeLite in 0.943 seconds.
  Set up Products.PloneTestCase.layer.ZCML in 2.420 seconds.
/home/stefan/autotest/temp/python26-zope212-cmf22-plone40/eggs/wicked-1.1.8alpha1-py2.6.egg/wicked/cache.py:34: DeprecationWarning: object.__init__() takes no parameters
  super(CacheStore, self).__init__(self)
  Ran 16 tests with 0 failures and 0 errors in 0.052 seconds.
Running wicked.at.tests.wickedtestcase.WickedSite tests:
  Set up Products.PloneTestCase.layer.PloneSite in 4.964 seconds.
  Set up wicked.at.tests.wickedtestcase.WickedSite in 0.002 seconds.
/home/stefan/autotest/temp/python26-zope212-cmf22-plone40/eggs/Zope2-2.12.3-py2.6-linux-x86_64.egg/OFS/subscribers.py:73: DeprecationWarning: wicked.atcontent.ironicwiki.IronicWiki.manage_afterAdd is discouraged. You should use event subscribers instead.
  DeprecationWarning)
/home/stefan/autotest/temp/python26-zope212-cmf22-plone40/eggs/Zope2-2.12.3-py2.6-linux-x86_64.egg/OFS/subscribers.py:73: DeprecationWarning: wicked.atcontent.ironicwiki.IronicWiki.manage_beforeDelete is discouraged. You should use event subscribers instead.
  DeprecationWarning)
/home/stefan/autotest/temp/python26-zope212-cmf22-plone40/eggs/Zope2-2.12.3-py2.6-linux-x86_64.egg/OFS/subscribers.py:73: DeprecationWarning: wicked.atcontent.ironicwiki.IronicWiki.manage_afterClone is discouraged. You should use event subscribers instead.
  DeprecationWarning)
  Ran 23 tests with 0 failures and 0 errors in 5.861 seconds.
Running wicked.at.tests.test_scope.Scoped tests:
  Set up wicked.at.tests.test_scope.Scoped in 0.000 seconds.
  Ran 3 tests with 0 failures and 0 errors in 0.638 seconds.
Running wicked.plone.tests.SelectiveATCT tests:
  Tear down wicked.at.tests.test_scope.Scoped in 0.000 seconds.
  Tear down wicked.at.tests.wickedtestcase.WickedSite in 0.002 seconds.
  Set up wicked.plone.tests.SelectiveATCT in 0.003 seconds.
  Ran 22 tests with 0 failures and 0 errors in 6.027 seconds.
Running wicked.plone.tests.ZCMLLayer tests:
  Tear down wicked.plone.tests.SelectiveATCT in 0.004 seconds.
  Set up wicked.plone.tests.ZCMLLayer in 0.019 seconds.
  Ran 8 tests with 0 failures and 0 errors in 0.739 seconds.
Running zope.testing.testrunner.layer.UnitTests tests:
  Tear down wicked.plone.tests.ZCMLLayer in 0.389 seconds.
  Tear down Products.PloneTestCase.layer.PloneSite in 0.001 seconds.
  Tear down Products.PloneTestCase.layer.ZCML in 0.004 seconds.
  Tear down Testing.ZopeTestCase.layer.ZopeLite in 0.000 seconds.
  Set up zope.testing.testrunner.layer.UnitTests in 0.000 seconds.
  Ran 34 tests with 0 failures and 0 errors in 0.016 seconds.
Tearing down left over layers:
  Tear down zope.testing.testrunner.layer.UnitTests in 0.000 seconds.
Total: 106 tests, 0 failures, 0 errors in 23.330 seconds.
#### Running tests for group ATCT ####
#### Finished tests for group ATCT ####

#### Running tests for group Archetypes ####
#### Finished tests for group Archetypes ####

#### Running tests for group CMF ####
#### Finished tests for group CMF ####

#### Running tests for group CMFEditions ####
#### Finished tests for group CMFEditions ####

#### Running tests for group Plone ####
#### Finished tests for group Plone ####

#### Running tests for group PlonePAS ####
#### Finished tests for group PlonePAS ####

#### Running tests for group plone ####
#### Finished tests for group plone ####

#### Running tests for group portlets ####
#### Finished tests for group portlets ####

#### Running tests for group z3c.autoinclude ####
#### Finished tests for group z3c.autoinclude ####

#### Running tests for Products.CMFPlacefulWorkflow ####
#### Finished tests for Products.CMFPlacefulWorkflow ####

#### Running tests for Products.CMFTestCase ####
#### Finished tests for Products.CMFTestCase ####

#### Running tests for Products.ExtendedPathIndex ####
#### Finished tests for Products.ExtendedPathIndex ####

#### Running tests for Products.PasswordResetTool ####
#### Finished tests for Products.PasswordResetTool ####

#### Running tests for Products.PloneTestCase ####
#### Finished tests for Products.PloneTestCase ####

#### Running tests for Products.ResourceRegistries ####
#### Finished tests for Products.ResourceRegistries ####

#### Running tests for Products.TinyMCE ####
#### Finished tests for Products.TinyMCE ####

#### Running tests for Products.ZopeVersionControl ####
#### Finished tests for Products.ZopeVersionControl ####

#### Running tests for Products.contentmigration ####
#### Finished tests for Products.contentmigration ####

#### Running tests for Products.i18ntestcase ####
#### Finished tests for Products.i18ntestcase ####

#### Running tests for archetypes.referencebrowserwidget ####
#### Finished tests for archetypes.referencebrowserwidget ####

#### Running tests for archetypes.schemaextender ####
#### Finished tests for archetypes.schemaextender ####

#### Running tests for collective.monkeypatcher ####
#### Finished tests for collective.monkeypatcher ####

#### Running tests for five.customerize ####
#### Finished tests for five.customerize ####

#### Running tests for five.formlib ####
#### Finished tests for five.formlib ####

#### Running tests for kss.core ####
#### Finished tests for kss.core ####

#### Running tests for plone.app.blob ####
#### Finished tests for plone.app.blob ####

#### Running tests for plone.app.folder ####
#### Finished tests for plone.app.folder ####

#### Running tests for plone.app.imaging ####
#### Finished tests for plone.app.imaging ####

#### Running tests for plone.app.jquerytools ####
#### Finished tests for plone.app.jquerytools ####

#### Running tests for plone.app.locales ####
#### Finished tests for plone.app.locales ####

#### Running tests for plone.app.openid ####
#### Finished tests for plone.app.openid ####

#### Running tests for plone.app.users ####
#### Finished tests for plone.app.users ####

#### Running tests for plone.folder ####
#### Finished tests for plone.folder ####

#### Running tests for plone.stringinterp ####
#### Finished tests for plone.stringinterp ####

#### Running tests for plonetheme.classic ####
#### Finished tests for plonetheme.classic ####

#### Running tests for plonetheme.sunburst ####
#### Finished tests for plonetheme.sunburst ####

#### Running tests for wicked ####
#### Finished tests for wicked ####

Packages with test failures:

Failing tests in group Archetypes
Failing tests in group Plone
Failing tests in Products.PasswordResetTool

Total time elapsed: 938.292 seconds

Grand total: 90 packages, 3 failures


FAILED (90 packages, 3 failures)




More information about the Testbot mailing list