[Testbot] FAILED (failures=1) : Plone-4.0 Zope-2.12 Python-2.6.2

Plone Products Tests plone-tests at epy.co.at
Fri Oct 2 02:24:04 UTC 2009


Plone Products Tests : FAILED (failures=1) 
Plone-4.0 Zope-2.12 Python-2.6.2

Running /usr/local/python2.6/bin/python ./bin/test -q --no-color --no-progress --package Products.CMFPlone --package Products.CMFDynamicViewFTI --package Products.CMFFormController --package Products.CMFQuickInstallerTool --package Products.ExtendedPathIndex --package Products.PasswordResetTool --package Products.PloneLanguageTool --package Products.ResourceRegistries --package Products.statusmessages
/home/stefan/autotest/temp/python26-zope212-cmf22-plone40/src/Products.ResourceRegistries/Products/ResourceRegistries/tests/testExportImport.py:16: SyntaxWarning: assertion is always true, perhaps remove parentheses?
  assert("resourceregistry: Javascript registry imported." in \
Running Testing.ZopeTestCase.layer.ZopeLite tests:
  Set up Testing.ZopeTestCase.layer.ZopeLite in 0.847 seconds.
  Ran 162 tests with 0 failures and 0 errors in 0.854 seconds.
Running Products.CMFTestCase.layer.CMFSite tests:
  Set up Products.CMFTestCase.layer.ZCML in 2.744 seconds.
  Set up Products.CMFTestCase.layer.CMFSite in 0.246 seconds.
  Ran 84 tests with 0 failures and 0 errors in 2.991 seconds.
Running Products.PloneTestCase.layer.ZCML tests:
  Tear down Products.CMFTestCase.layer.CMFSite in 0.042 seconds.
  Tear down Products.CMFTestCase.layer.ZCML in 0.003 seconds.
  Set up Products.PloneTestCase.layer.ZCML in 1.603 seconds.
  Ran 12 tests with 0 failures and 0 errors in 0.017 seconds.
Running Products.PloneTestCase.layer.PloneSite tests:
  Set up Products.PloneTestCase.layer.PloneSite in 5.400 seconds.
/home/stefan/autotest/temp/python26-zope212-cmf22-plone40/src/Products.PortalTransforms/Products/PortalTransforms/libtransforms/commandtransform.py:95: DeprecationWarning: os.popen4 is deprecated.  Use the subprocess module.
  cin, couterr = os.popen4(command, 'b')


Failure in test /home/stefan/autotest/temp/python26-zope212-cmf22-plone40/src/Plone/Products/CMFPlone/tests/mails.txt
Failed doctest test for mails.txt
  File "/home/stefan/autotest/temp/python26-zope212-cmf22-plone40/src/Plone/Products/CMFPlone/tests/mails.txt", line 0

----------------------------------------------------------------------
File "/home/stefan/autotest/temp/python26-zope212-cmf22-plone40/src/Plone/Products/CMFPlone/tests/mails.txt", line 57, in mails.txt
Failed example:
    b64decode(msg.message.get_payload())
Expected:
    '...You are receiving this mail because T\xc3\xa4st user\ntest at plone.test...is sending feedback about the site administered by you at...The message sent was:...Another t\xc3\xa4st message...
Got:
    'b\x8b\x9a\xad\xea\xdeq\xe8\xaf\x8ax-\x86+&j)[y\xc6\xae\xb1\xe4'

  Ran 1336 tests with 1 failures and 0 errors in 3 minutes 21.273 seconds.
Running zope.testing.testrunner.layer.UnitTests tests:
  Tear down Products.PloneTestCase.layer.PloneSite in 0.299 seconds.
  Tear down Products.PloneTestCase.layer.ZCML in 0.014 seconds.
  Tear down Testing.ZopeTestCase.layer.ZopeLite in 0.000 seconds.
  Set up zope.testing.testrunner.layer.UnitTests in 0.000 seconds.
  Ran 129 tests with 0 failures and 0 errors in 0.056 seconds.
Tearing down left over layers:
  Tear down zope.testing.testrunner.layer.UnitTests in 0.000 seconds.
Total: 1723 tests, 1 failures, 0 errors in 3 minutes 37.516 seconds.

FAILED (failures=1) 




More information about the Testbot mailing list