[Testbot] FAILED (failures=1) : ATCT-1.3 Plone[next]-3.3 Zope-2.10 Python-2.4.6

ATContentTypes Tests plone-tests at epy.co.at
Mon Nov 23 02:40:14 UTC 2009


ATContentTypes Tests : FAILED (failures=1)
ATCT-1.3 Plone[next]-3.3 Zope-2.10 Python-2.4.6

Running ./bin/instance test -q --package Products.ATContentTypes
Installing SiteAccess ... done (0.047s)
/home/stefan/autotest/temp/cache/Zope-2.10.9-final-py2.4/lib/python/zope/configuration/xmlconfig.py:323: DeprecationWarning: zope.app.annotation has moved to zope.annotation. Import of zope.app.annotation will become unsupported in Zope 3.5
  __import__(arguments[0])
/home/stefan/autotest/temp/python24-zope210-cmf21-plone33next/eggs/Products.PlonePAS-3.12-py2.4.egg/Products/PlonePAS/setuphandlers.py:39: DeprecationWarning: portal_groups.getGroupIds is deprecated and will be removed in Plone 4.0. Use PAS searchGroups instead
  existing = gtool.listGroupIds()
Running Products.PloneTestCase.layer.PloneSite tests:
  Set up Products.PloneTestCase.layer.ZCML in 2.091 seconds.
  Set up Products.PloneTestCase.layer.PloneSite in 4.381 seconds.


Failure in test testFormatDate (Products.ATContentTypes.tests.test_skinScripts.TestFormatCatalogMetadata)
Traceback (most recent call last):
  File "/home/stefan/autotest/temp/cache/Zope-2.10.9-final-py2.4/lib/python/Testing/ZopeTestCase/profiler.py", line 98, in __call__
    testMethod()
  File "/home/stefan/autotest/temp/python24-zope210-cmf21-plone33next/eggs/Products.ATContentTypes-1.3.4-py2.4.egg/Products/ATContentTypes/tests/test_skinScripts.py", line 45, in testFormatDate
    DateTime(date).strftime(format))
  File "/usr/local/python2.4/lib/python2.4/unittest.py", line 333, in failUnlessEqual
    raise self.failureException, \
AssertionError: u'Nov 02, 2005 01:52 PM' != '11-02-2005 01:52 PM'

  Ran 809 tests with 1 failures and 0 errors in 75.146 seconds.
Tearing down left over layers:
  Tear down Products.PloneTestCase.layer.PloneSite in 0.274 seconds.
  Tear down Products.PloneTestCase.layer.ZCML in 0.006 seconds.

FAILED (failures=1)




More information about the Testbot mailing list