[Testbot] FAILED (86 packages, 2 failures) : Plone-4.0 Zope-2.12 Python-2.6.4

Plone Tests plone-tests at epy.co.at
Fri Nov 20 03:12:27 UTC 2009


Plone Tests : FAILED (86 packages, 2 failures)
Plone-4.0 Zope-2.12 Python-2.6.4

Running ./bin/alltests -q --no-color --no-progress
Running Products.CMFTestCase.layer.CMFSite tests:
  Set up Testing.ZopeTestCase.layer.ZopeLite in 0.952 seconds.
  Set up Products.CMFTestCase.layer.ZCML in 2.719 seconds.
  Set up Products.CMFTestCase.layer.CMFSite in 2.000 seconds.
  Ran 31 tests with 0 failures and 0 errors in 0.553 seconds.
Running Products.PloneTestCase.layer.PloneSite tests:
  Tear down Products.CMFTestCase.layer.CMFSite in 0.068 seconds.
  Tear down Products.CMFTestCase.layer.ZCML in 0.004 seconds.
  Set up Products.PloneTestCase.layer.ZCML in 1.705 seconds.
  Set up Products.PloneTestCase.layer.PloneSite in 3.921 seconds.
  Ran 711 tests with 0 failures and 0 errors in 1 minutes 8.040 seconds.
Tearing down left over layers:
  Tear down Products.PloneTestCase.layer.PloneSite in 0.363 seconds.
  Tear down Products.PloneTestCase.layer.ZCML in 0.010 seconds.
  Tear down Testing.ZopeTestCase.layer.ZopeLite in 0.000 seconds.
Total: 742 tests, 0 failures, 0 errors in 1 minutes 20.833 seconds.
Running Testing.ZopeTestCase.layer.ZopeLite tests:
  Set up Testing.ZopeTestCase.layer.ZopeLite in 0.767 seconds.
  Ran 36 tests with 0 failures and 0 errors in 0.080 seconds.
Running Products.Archetypes.tests.layer.ZCML tests:
  Set up Products.CMFCore.testing.FunctionalZCMLLayer in 0.188 seconds.
  Set up Products.Archetypes.tests.layer.ZCML in 0.172 seconds.
  Ran 59 tests with 0 failures and 0 errors in 1.134 seconds.
Running Products.Archetypes.tests.layer.ArchetypesSite tests:
  Set up Products.Archetypes.tests.layer.ArchetypesSite in 1.938 seconds.
/home/stefan/autotest/temp/python26-zope212-cmf22-plone40/eggs/Zope2-2.12.1-py2.6-linux-x86_64.egg/OFS/subscribers.py:73: DeprecationWarning: Products.Archetypes.tests.test_classgen.Dummy.manage_afterAdd is discouraged. You should use event subscribers instead.
  DeprecationWarning)
/home/stefan/autotest/temp/python26-zope212-cmf22-plone40/eggs/Zope2-2.12.1-py2.6-linux-x86_64.egg/OFS/subscribers.py:73: DeprecationWarning: Products.Archetypes.tests.test_annotation.AnnDummy.manage_afterAdd is discouraged. You should use event subscribers instead.
  DeprecationWarning)
/home/stefan/autotest/temp/python26-zope212-cmf22-plone40/eggs/Zope2-2.12.1-py2.6-linux-x86_64.egg/OFS/subscribers.py:73: DeprecationWarning: Products.Archetypes.tests.test_event.Dummy.manage_afterAdd is discouraged. You should use event subscribers instead.
  DeprecationWarning)
  Ran 511 tests with 0 failures and 0 errors in 38.330 seconds.
Running Products.PloneTestCase.layer.PloneSite tests:
  Tear down Products.Archetypes.tests.layer.ArchetypesSite in 0.066 seconds.
  Tear down Products.Archetypes.tests.layer.ZCML in 0.004 seconds.
  Tear down Products.CMFCore.testing.FunctionalZCMLLayer in 0.000 seconds.
  Set up Products.PloneTestCase.layer.ZCML in 2.282 seconds.
  Set up Products.PloneTestCase.layer.PloneSite in 3.866 seconds.
  Ran 9 tests with 0 failures and 0 errors in 1.047 seconds.
Running plone.app.kss.tests.kss_and_plone_layer.KSSAndPloneLayer tests:
  Set up plone.app.kss.tests.kss_and_plone_layer.KSSAndPloneLayer in 0.005 seconds.
  Ran 19 tests with 0 failures and 0 errors in 1.531 seconds.
Running zope.testing.testrunner.layer.UnitTests tests:
  Tear down plone.app.kss.tests.kss_and_plone_layer.KSSAndPloneLayer in 0.000 seconds.
  Tear down Products.PloneTestCase.layer.PloneSite in 0.352 seconds.
  Tear down Products.PloneTestCase.layer.ZCML in 0.005 seconds.
  Tear down Testing.ZopeTestCase.layer.ZopeLite in 0.000 seconds.
  Set up zope.testing.testrunner.layer.UnitTests in 0.000 seconds.
/home/stefan/autotest/temp/python26-zope212-cmf22-plone40/eggs/Products.Archetypes-1.6a2-py2.6.egg/Products/Archetypes/ClassGen.py:152: UserWarning: The method 'makeFoo' was already protected by a different permission than the one declared on the field. Assuming that the explicit permission declared is the correct one and has preference over the permission declared on the field.
  self.handle_mode(klass, generator, type, field, mode)
  Ran 28 tests with 0 failures and 0 errors in 0.156 seconds.
Tearing down left over layers:
  Tear down zope.testing.testrunner.layer.UnitTests in 0.000 seconds.
Total: 662 tests, 0 failures, 0 errors in 53.263 seconds.
Running Testing.ZopeTestCase.layer.ZopeLite tests:
  Set up Testing.ZopeTestCase.layer.ZopeLite in 0.053 seconds.
  Ran 170 tests with 0 failures and 0 errors in 0.702 seconds.
Running Products.CMFCore.testing.ExportImportZCMLLayer tests:
  Set up Products.CMFCore.testing.ExportImportZCMLLayer in 0.000 seconds.
  Ran 10 tests with 0 failures and 0 errors in 0.632 seconds.
Running Products.GenericSetup.testing.ExportImportZCMLLayer tests:
  Tear down Products.CMFCore.testing.ExportImportZCMLLayer in 0.000 seconds.
  Set up Products.GenericSetup.testing.ExportImportZCMLLayer in 0.047 seconds.
  Ran 186 tests with 0 failures and 0 errors in 0.673 seconds.
Running zope.testing.testrunner.layer.UnitTests tests:
  Tear down Products.GenericSetup.testing.ExportImportZCMLLayer in 0.000 seconds.
  Tear down Testing.ZopeTestCase.layer.ZopeLite in 0.000 seconds.
  Set up zope.testing.testrunner.layer.UnitTests in 0.000 seconds.
  Ran 166 tests with 0 failures and 0 errors in 0.148 seconds.
Tearing down left over layers:
  Tear down zope.testing.testrunner.layer.UnitTests in 0.000 seconds.
Total: 532 tests, 0 failures, 0 errors in 2.619 seconds.
Running Testing.ZopeTestCase.layer.ZopeLite tests:
  Set up Testing.ZopeTestCase.layer.ZopeLite in 0.879 seconds.
  Ran 27 tests with 0 failures and 0 errors in 0.056 seconds.
Running Products.PloneTestCase.layer.PloneSite tests:
  Set up Products.PloneTestCase.layer.ZCML in 2.397 seconds.
  Set up Products.PloneTestCase.layer.PloneSite in 5.037 seconds.
/home/stefan/autotest/temp/python26-zope212-cmf22-plone40/eggs/Zope2-2.12.1-py2.6-linux-x86_64.egg/OFS/subscribers.py:73: DeprecationWarning: Products.FAQ.FAQ.FAQ.manage_afterAdd is discouraged. You should use event subscribers instead.
  DeprecationWarning)
/home/stefan/autotest/temp/python26-zope212-cmf22-plone40/eggs/Zope2-2.12.1-py2.6-linux-x86_64.egg/OFS/subscribers.py:73: DeprecationWarning: Products.FAQ.FAQQuestion.FAQQuestion.manage_afterAdd is discouraged. You should use event subscribers instead.
  DeprecationWarning)
  Ran 145 tests with 0 failures and 0 errors in 51.546 seconds.
Running Products.CMFDiffTool.tests.BaseTestCase.CMFDiffToolLayer tests:
  Set up Products.CMFDiffTool.tests.BaseTestCase.CMFDiffToolLayer in 0.013 seconds.
  Ran 2 tests with 0 failures and 0 errors in 0.176 seconds.
Running Products.CMFTestCase.layer.CMFSite tests:
  Tear down Products.CMFDiffTool.tests.BaseTestCase.CMFDiffToolLayer in 0.380 seconds.
  Tear down Products.PloneTestCase.layer.PloneSite in 0.006 seconds.
  Tear down Products.PloneTestCase.layer.ZCML in 0.004 seconds.
  Set up Products.CMFTestCase.layer.ZCML in 1.717 seconds.
  Set up Products.CMFTestCase.layer.CMFSite in 1.508 seconds.
  Ran 20 tests with 0 failures and 0 errors in 0.394 seconds.
Running zope.testing.testrunner.layer.UnitTests tests:
  Tear down Products.CMFTestCase.layer.CMFSite in 0.069 seconds.
  Tear down Products.CMFTestCase.layer.ZCML in 0.003 seconds.
  Tear down Testing.ZopeTestCase.layer.ZopeLite in 0.000 seconds.
  Set up zope.testing.testrunner.layer.UnitTests in 0.000 seconds.
  Ran 10 tests with 0 failures and 0 errors in 0.005 seconds.
Tearing down left over layers:
  Tear down zope.testing.testrunner.layer.UnitTests in 0.000 seconds.
Total: 204 tests, 0 failures, 0 errors in 1 minutes 5.162 seconds.
Running Testing.ZopeTestCase.layer.ZopeLite tests:
  Set up Testing.ZopeTestCase.layer.ZopeLite in 0.607 seconds.
  Ran 126 tests with 0 failures and 0 errors in 0.754 seconds.
Running Products.CMFTestCase.layer.CMFSite tests:
  Set up Products.CMFTestCase.layer.ZCML in 2.253 seconds.
  Set up Products.CMFTestCase.layer.CMFSite in 0.229 seconds.
  Ran 53 tests with 0 failures and 0 errors in 2.560 seconds.
Running Products.PloneTestCase.layer.ZCML tests:
  Tear down Products.CMFTestCase.layer.CMFSite in 0.041 seconds.
  Tear down Products.CMFTestCase.layer.ZCML in 0.003 seconds.
  Set up Products.PloneTestCase.layer.ZCML in 1.717 seconds.
  Ran 12 tests with 0 failures and 0 errors in 0.016 seconds.
Running Products.PloneTestCase.layer.PloneSite tests:
  Set up Products.PloneTestCase.layer.PloneSite in 4.169 seconds.
  Ran 1811 tests with 0 failures and 0 errors in 4 minutes 10.081 seconds.
Running plone.app.contentrules.tests.test_configuration.TestContentrulesGSLayer tests:
  Set up plone.app.contentrules.tests.test_configuration.TestContentrulesGSLayer in 0.002 seconds.
  Ran 6 tests with 0 failures and 0 errors in 3.676 seconds.
Running plone.app.customerize.tests.layer.PloneCustomerize tests:
  Tear down plone.app.contentrules.tests.test_configuration.TestContentrulesGSLayer in 0.000 seconds.
  Set up plone.app.customerize.tests.layer.PloneCustomerize in 0.000 seconds.
  Ran 27 tests with 0 failures and 0 errors in 59.754 seconds.
Running plone.app.kss.tests.kss_and_plone_layer.KSSAndPloneLayer tests:
  Tear down plone.app.customerize.tests.layer.PloneCustomerize in 0.000 seconds.
  Set up plone.app.kss.tests.kss_and_plone_layer.KSSAndPloneLayer in 0.004 seconds.
  Ran 13 tests with 0 failures and 0 errors in 1.173 seconds.
Running plone.app.linkintegrity.tests.layer.PloneLinkintegrity tests:
  Tear down plone.app.kss.tests.kss_and_plone_layer.KSSAndPloneLayer in 0.000 seconds.
  Set up plone.app.linkintegrity.tests.layer.PloneLinkintegrity in 0.453 seconds.
  Ran 117 tests with 0 failures and 0 errors in 28.862 seconds.
Running plone.app.viewletmanager.tests.test_exportimport.Layer tests:
  Tear down plone.app.linkintegrity.tests.layer.PloneLinkintegrity in 0.052 seconds.
  Tear down Products.PloneTestCase.layer.PloneSite in 0.413 seconds.
  Tear down Products.PloneTestCase.layer.ZCML in 0.015 seconds.
  Tear down Testing.ZopeTestCase.layer.ZopeLite in 0.000 seconds.
  Set up plone.app.viewletmanager.tests.test_exportimport.Layer in 0.000 seconds.
  Ran 16 tests with 0 failures and 0 errors in 0.051 seconds.
Running zope.testing.testrunner.layer.UnitTests tests:
  Tear down plone.app.viewletmanager.tests.test_exportimport.Layer in 0.000 seconds.
  Set up zope.testing.testrunner.layer.UnitTests in 0.000 seconds.
  Ran 143 tests with 0 failures and 0 errors in 0.854 seconds.
Tearing down left over layers:
  Tear down zope.testing.testrunner.layer.UnitTests in 0.000 seconds.
Total: 2324 tests, 0 failures, 0 errors in 6 minutes 1.519 seconds.
Running Testing.ZopeTestCase.layer.ZopeLite tests:
  Set up Testing.ZopeTestCase.layer.ZopeLite in 1.369 seconds.
  Ran 165 tests with 0 failures and 0 errors in 0.630 seconds.
Running Products.PloneTestCase.layer.ZCML tests:
  Set up Products.PloneTestCase.layer.ZCML in 2.297 seconds.
  Ran 34 tests with 0 failures and 0 errors in 0.211 seconds.
Running Products.PlonePAS.tests.layer.PlonePASLayer tests:
  Set up Products.PloneTestCase.layer.PloneSite in 3.853 seconds.
  Set up Products.PlonePAS.tests.layer.PlonePASLayer in 0.000 seconds.
  Ran 152 tests with 0 failures and 0 errors in 1.814 seconds.
Running zope.testing.testrunner.layer.UnitTests tests:
  Tear down Products.PlonePAS.tests.layer.PlonePASLayer in 0.000 seconds.
  Tear down Products.PloneTestCase.layer.PloneSite in 0.349 seconds.
  Tear down Products.PloneTestCase.layer.ZCML in 0.004 seconds.
  Tear down Testing.ZopeTestCase.layer.ZopeLite in 0.000 seconds.
  Set up zope.testing.testrunner.layer.UnitTests in 0.000 seconds.
  Ran 371 tests with 0 failures and 0 errors in 0.948 seconds.
Tearing down left over layers:
  Tear down zope.testing.testrunner.layer.UnitTests in 0.000 seconds.
Total: 722 tests, 0 failures, 0 errors in 12.244 seconds.
Running Products.PloneTestCase.layer.PloneSite tests:
  Set up Testing.ZopeTestCase.layer.ZopeLite in 1.393 seconds.
  Set up Products.PloneTestCase.layer.ZCML in 2.370 seconds.
  Set up Products.PloneTestCase.layer.PloneSite in 4.139 seconds.
/home/stefan/autotest/temp/python26-zope212-cmf22-plone40/eggs/borg.localrole-3.0a1-py2.6.egg/borg/localrole/bbb/bbb.txt:1: DeprecationWarning: IWorkspace is deprecated. Please use borg.localrole.interfaces.ILocalRoleProvider instead
  =========
/home/stefan/autotest/temp/python26-zope212-cmf22-plone40/eggs/borg.localrole-3.0a1-py2.6.egg/borg/localrole/bbb/bbb.txt:1: DeprecationWarning: IGroupAwareWorkspace is deprecated. Please use borg.localrole.interfaces.ILocalRoleProvider instead
  =========
  Ran 36 tests with 0 failures and 0 errors in 0.133 seconds.
Running plone.browserlayer.tests.test_doctest.PloneBrowserLayerLayer tests:
  Set up plone.browserlayer.tests.test_doctest.PloneBrowserLayerLayer in 0.003 seconds.
  Ran 9 tests with 0 failures and 0 errors in 0.966 seconds.
Running plone.theme.tests.test_doctest.PloneThemeLayer tests:
  Tear down plone.browserlayer.tests.test_doctest.PloneBrowserLayerLayer in 0.000 seconds.
  Set up plone.theme.tests.test_doctest.PloneThemeLayer in 0.003 seconds.
  Ran 5 tests with 0 failures and 0 errors in 0.053 seconds.
Running zope.testing.testrunner.layer.UnitTests tests:
  Tear down plone.theme.tests.test_doctest.PloneThemeLayer in 0.000 seconds.
  Tear down Products.PloneTestCase.layer.PloneSite in 0.364 seconds.
  Tear down Products.PloneTestCase.layer.ZCML in 0.004 seconds.
  Tear down Testing.ZopeTestCase.layer.ZopeLite in 0.000 seconds.
  Set up zope.testing.testrunner.layer.UnitTests in 0.000 seconds.
/usr/local/python2.6/lib/python2.6/mhlib.py:83: DeprecationWarning: the multifile module has been deprecated since Python 2.5
  import multifile


Failure in test /home/stefan/autotest/temp/python26-zope212-cmf22-plone40/eggs/z3c.autoinclude-0.3.1-py2.6.egg/z3c/autoinclude/tests/../dependency.txt
Traceback (most recent call last):
  File "/usr/local/python2.6/lib/python2.6/unittest.py", line 279, in run
    testMethod()
  File "/usr/local/python2.6/lib/python2.6/doctest.py", line 2145, in runTest
    raise self.failureException(self.format_failure(new.getvalue()))
AssertionError: Failed doctest test for dependency.txt
  File "/home/stefan/autotest/temp/python26-zope212-cmf22-plone40/eggs/z3c.autoinclude-0.3.1-py2.6.egg/z3c/autoinclude/tests/../dependency.txt", line 0

----------------------------------------------------------------------
File "/home/stefan/autotest/temp/python26-zope212-cmf22-plone40/eggs/z3c.autoinclude-0.3.1-py2.6.egg/z3c/autoinclude/tests/../dependency.txt", line 102, in dependency.txt
Failed example:
    sibling_include_finder.dottedNames()
Expected:
    ['F.G', 'F.H']
Got:
    ['F.H', 'F.G']
----------------------------------------------------------------------
File "/home/stefan/autotest/temp/python26-zope212-cmf22-plone40/eggs/z3c.autoinclude-0.3.1-py2.6.egg/z3c/autoinclude/tests/../dependency.txt", line 108, in dependency.txt
Failed example:
    pprint(b_include_finder.includableInfo(['configure.zcml',
                                            'meta.zcml']))
Expected:
    {'configure.zcml': ['F.H'], 'meta.zcml': ['testdirective', 'F.G', 'F.H']}
Got:
    {'configure.zcml': ['F.H'], 'meta.zcml': ['testdirective', 'F.H', 'F.G']}
----------------------------------------------------------------------
File "/home/stefan/autotest/temp/python26-zope212-cmf22-plone40/eggs/z3c.autoinclude-0.3.1-py2.6.egg/z3c/autoinclude/tests/../dependency.txt", line 142, in dependency.txt
Failed example:
    pprint(package_includes('BCPackage'))
Expected:
    {'configure.zcml': ['F.H'],
     'meta.zcml': ['testdirective', 'F.G', 'F.H'],
     'overrides.zcml': []}
Got:
    {'configure.zcml': ['F.H'],
     'meta.zcml': ['testdirective', 'F.H', 'F.G'],
     'overrides.zcml': []}


  Ran 262 tests with 1 failures and 0 errors in 14.744 seconds.
Tearing down left over layers:
  Tear down zope.testing.testrunner.layer.UnitTests in 0.000 seconds.
Total: 312 tests, 1 failures, 0 errors in 25.088 seconds.
Running Products.PloneTestCase.layer.PloneSite tests:
  Set up Testing.ZopeTestCase.layer.ZopeLite in 0.859 seconds.
  Set up Products.PloneTestCase.layer.ZCML in 2.267 seconds.
  Set up Products.PloneTestCase.layer.PloneSite in 4.162 seconds.
/usr/local/python2.6/lib/python2.6/unittest.py:279: DeprecationWarning: The use of 'hide' has been deprecated and will be removed in plone.portlet.static 2.0. Instead, use the new generic built-in show/hide setting of plone.portlets.
  testMethod()
  Ran 169 tests with 0 failures and 0 errors in 14.452 seconds.
Running plone.app.portlets.tests.test_configuration.TestPortletZCMLLayer tests:
  Set up plone.app.portlets.tests.test_configuration.TestPortletZCMLLayer in 0.006 seconds.
  Ran 5 tests with 0 failures and 0 errors in 0.038 seconds.
Running plone.app.portlets.tests.test_configuration.TestPortletGSLayer tests:
  Set up plone.app.portlets.tests.test_configuration.TestPortletGSLayer in 1.556 seconds.
  Ran 12 tests with 0 failures and 0 errors in 4.113 seconds.
Running zope.testing.testrunner.layer.UnitTests tests:
  Tear down plone.app.portlets.tests.test_configuration.TestPortletGSLayer in 0.000 seconds.
  Tear down plone.app.portlets.tests.test_configuration.TestPortletZCMLLayer in 0.000 seconds.
  Tear down Products.PloneTestCase.layer.PloneSite in 0.356 seconds.
  Tear down Products.PloneTestCase.layer.ZCML in 0.004 seconds.
  Tear down Testing.ZopeTestCase.layer.ZopeLite in 0.000 seconds.
  Set up zope.testing.testrunner.layer.UnitTests in 0.000 seconds.
  Ran 54 tests with 0 failures and 0 errors in 0.146 seconds.
Tearing down left over layers:
  Tear down zope.testing.testrunner.layer.UnitTests in 0.000 seconds.
Total: 240 tests, 0 failures, 0 errors in 28.780 seconds.
Running Products.PloneTestCase.layer.PloneSite tests:
  Set up Testing.ZopeTestCase.layer.ZopeLite in 0.000 seconds.
  Set up Products.PloneTestCase.layer.ZCML in 1.827 seconds.
  Set up Products.PloneTestCase.layer.PloneSite in 5.344 seconds.
  Ran 23 tests with 0 failures and 0 errors in 3.482 seconds.
Running Products.CMFPlacefulWorkflow.tests.test_exportimport.ExportImportLayer tests:
  Set up Products.CMFPlacefulWorkflow.tests.test_exportimport.ExportImportLayer in 0.001 seconds.
  Ran 12 tests with 0 failures and 0 errors in 0.923 seconds.
Tearing down left over layers:
  Tear down Products.CMFPlacefulWorkflow.tests.test_exportimport.ExportImportLayer in 0.000 seconds.
  Tear down Products.PloneTestCase.layer.PloneSite in 0.362 seconds.
  Tear down Products.PloneTestCase.layer.ZCML in 0.004 seconds.
  Tear down Testing.ZopeTestCase.layer.ZopeLite in 0.000 seconds.
Total: 35 tests, 0 failures, 0 errors in 12.380 seconds.
Running Products.CMFTestCase.layer.CMFSite tests:
  Set up Testing.ZopeTestCase.layer.ZopeLite in 0.200 seconds.
  Set up Products.CMFTestCase.layer.ZCML in 0.364 seconds.
  Set up Products.CMFTestCase.layer.CMFSite in 0.206 seconds.
  Ran 58 tests with 0 failures and 0 errors in 0.231 seconds.
Tearing down left over layers:
  Tear down Products.CMFTestCase.layer.CMFSite in 0.027 seconds.
  Tear down Products.CMFTestCase.layer.ZCML in 0.001 seconds.
  Tear down Testing.ZopeTestCase.layer.ZopeLite in 0.000 seconds.
Running zope.testing.testrunner.layer.UnitTests tests:
  Set up zope.testing.testrunner.layer.UnitTests in 0.000 seconds.
  Ran 35 tests with 0 failures and 0 errors in 0.026 seconds.
Tearing down left over layers:
  Tear down zope.testing.testrunner.layer.UnitTests in 0.000 seconds.
Running Products.PloneTestCase.layer.PloneSite tests:
  Set up Testing.ZopeTestCase.layer.ZopeLite in 1.341 seconds.
  Set up Products.PloneTestCase.layer.ZCML in 2.411 seconds.
  Set up Products.PloneTestCase.layer.PloneSite in 4.070 seconds.
  Ran 39 tests with 0 failures and 0 errors in 4.083 seconds.
Tearing down left over layers:
  Tear down Products.PloneTestCase.layer.PloneSite in 0.366 seconds.
  Tear down Products.PloneTestCase.layer.ZCML in 0.006 seconds.
  Tear down Testing.ZopeTestCase.layer.ZopeLite in 0.000 seconds.
Running Products.PloneTestCase.layer.PloneSite tests:
  Set up Testing.ZopeTestCase.layer.ZopeLite in 1.366 seconds.
  Set up Products.PloneTestCase.layer.ZCML in 2.393 seconds.
  Set up Products.PloneTestCase.layer.PloneSite in 4.055 seconds.
/home/stefan/autotest/temp/python26-zope212-cmf22-plone40/eggs/Products.PlonePAS-4.0a1-py2.6.egg/Products/PlonePAS/tools/membership.py:554: DeprecationWarning: credentialsChanged should be called with 'REQUEST' as second argument. The BBB code will be removed in CMF 2.3.
  self.credentialsChanged(password, REQUEST=REQUEST)
  Ran 61 tests with 0 failures and 0 errors in 1.110 seconds.
Tearing down left over layers:
  Tear down Products.PloneTestCase.layer.PloneSite in 0.366 seconds.
  Tear down Products.PloneTestCase.layer.ZCML in 0.004 seconds.
  Tear down Testing.ZopeTestCase.layer.ZopeLite in 0.000 seconds.
Running Products.PloneTestCase.layer.PloneSite tests:
  Set up Testing.ZopeTestCase.layer.ZopeLite in 1.349 seconds.
  Set up Products.PloneTestCase.layer.ZCML in 2.368 seconds.
  Set up Products.PloneTestCase.layer.PloneSite in 4.177 seconds.
  Ran 239 tests with 0 failures and 0 errors in 17.852 seconds.
Running zope.testing.testrunner.layer.UnitTests tests:
  Tear down Products.PloneTestCase.layer.PloneSite in 0.370 seconds.
  Tear down Products.PloneTestCase.layer.ZCML in 0.005 seconds.
  Tear down Testing.ZopeTestCase.layer.ZopeLite in 0.000 seconds.
  Set up zope.testing.testrunner.layer.UnitTests in 0.000 seconds.
  Ran 59 tests with 0 failures and 0 errors in 0.013 seconds.
Tearing down left over layers:
  Tear down zope.testing.testrunner.layer.UnitTests in 0.000 seconds.
Total: 298 tests, 0 failures, 0 errors in 26.556 seconds.
Running Products.PloneTestCase.layer.PloneSite tests:
  Set up Testing.ZopeTestCase.layer.ZopeLite in 1.343 seconds.
  Set up Products.PloneTestCase.layer.ZCML in 2.357 seconds.
  Set up Products.PloneTestCase.layer.PloneSite in 4.095 seconds.
  Ran 76 tests with 0 failures and 0 errors in 2.988 seconds.
Tearing down left over layers:
  Tear down Products.PloneTestCase.layer.PloneSite in 0.365 seconds.
  Tear down Products.PloneTestCase.layer.ZCML in 0.006 seconds.
  Tear down Testing.ZopeTestCase.layer.ZopeLite in 0.000 seconds.
Running zope.testing.testrunner.layer.UnitTests tests:
  Set up zope.testing.testrunner.layer.UnitTests in 0.000 seconds.
  Ran 76 tests with 0 failures and 0 errors in 1.532 seconds.
Tearing down left over layers:
  Tear down zope.testing.testrunner.layer.UnitTests in 0.000 seconds.
Running Products.contentmigration.tests.layer.TestLayer tests:
  Set up Testing.ZopeTestCase.layer.ZopeLite in 1.325 seconds.
  Set up Products.PloneTestCase.layer.ZCML in 2.374 seconds.
  Set up Products.PloneTestCase.layer.PloneSite in 4.038 seconds.
  Set up Products.contentmigration.tests.layer.TestLayer in 0.002 seconds.
  Ran 18 tests with 0 failures and 0 errors in 4.973 seconds.
Tearing down left over layers:
  Tear down Products.contentmigration.tests.layer.TestLayer in 0.000 seconds.
  Tear down Products.PloneTestCase.layer.PloneSite in 0.362 seconds.
  Tear down Products.PloneTestCase.layer.ZCML in 0.004 seconds.
  Tear down Testing.ZopeTestCase.layer.ZopeLite in 0.000 seconds.
Total: 0 tests, 0 failures, 0 errors in 0.000 seconds.
/home/stefan/autotest/temp/python26-zope212-cmf22-plone40/eggs/Products.i18ntestcase-1.2-py2.6.egg/Products/i18ntestcase/PotTestCase.py:13: DeprecationWarning: The popen2 module is deprecated.  Use the subprocess module.
  from popen2 import popen4
/home/stefan/autotest/temp/python26-zope212-cmf22-plone40/eggs/Products.kupu-1.4.16-py2.6.egg/Products/kupu/plone/tests/TestContent.py:4: DeprecationWarning: Products.ATReferenceBrowserWidget.ATReferenceBrowserWidget has moved to archetypes.referencebrowserwidget.widget. Import of Products.ATReferenceBrowserWidget.ATReferenceBrowserWidget will become unsupported in Plone 5.0
  from Products.ATReferenceBrowserWidget.ATReferenceBrowserWidget import ReferenceBrowserWidget
Running Testing.ZopeTestCase.layer.ZopeLite tests:
  Set up Testing.ZopeTestCase.layer.ZopeLite in 0.855 seconds.
  Ran 3 tests with 0 failures and 0 errors in 0.008 seconds.
Running Products.PloneTestCase.layer.PloneSite tests:
  Set up Products.PloneTestCase.layer.ZCML in 2.403 seconds.
  Set up Products.PloneTestCase.layer.PloneSite/home/stefan/autotest/temp/python26-zope212-cmf22-plone40/eggs/Products.kupu-1.4.16-py2.6.egg/Products/kupu/plone/util.py:25: DeprecationWarning: minimalpath() is deprecated and will be removed in CMF 2.3.
  kupu_plone_skin_dir = minimalpath(os.path.join(kupu_package_dir, relpath))
/home/stefan/autotest/temp/python26-zope212-cmf22-plone40/eggs/Products.kupu-1.4.16-py2.6.egg/Products/kupu/plone/util.py:26: DeprecationWarning: createDirectoryView() called with deprecated reg_key format. Support for old key formats will be removed in CMF 2.3. Please use the new key format <product>:<subdir> instead.
  createDirectoryView(skinstool, kupu_plone_skin_dir, name)
<string>:213: DeprecationWarning: changeSkin should be called with 'REQUEST' as second argument. The BBB code will be removed in CMF 2.3.
 in 4.521 seconds.


Failure in test testSame (Products.kupu.plone.tests.test_html2captioned.TransformTestSubclass)
Traceback (most recent call last):
  File "/usr/local/python2.6/lib/python2.6/unittest.py", line 279, in run
    testMethod()
  File "/home/stefan/autotest/temp/python26-zope212-cmf22-plone40/eggs/Products.kupu-1.4.16-py2.6.egg/Products/kupu/plone/tests/test_html2captioned.py", line 78, in testSame
    self.do_convert(filename=self.input)
  File "/home/stefan/autotest/temp/python26-zope212-cmf22-plone40/eggs/Products.kupu-1.4.16-py2.6.egg/Products/kupu/plone/tests/test_html2captioned.py", line 71, in do_convert
    got, expected, self.transform.name(), self.input))
  File "/usr/local/python2.6/lib/python2.6/unittest.py", line 350, in failUnlessEqual
    (msg or '%r != %r' % (first, second))
AssertionError: Got:
[<div>Simple text containing an embedded image</div><dl class="image-left captioned"><dt><img src="http://nohost/plone/folder/gamma/image" alt="Kupu Test Image" title="Kupu Test Image" height="331" width="500" /></dt><dd class="image-caption" style="width:500px">Test image caption</dd></dl><dl class="image-left captioned"><dt><img src="http://nohost/plone/folder/gamma/image_thumb" alt="Kupu Test Image" title="Kupu Test Image" height="84" width="128" /></dt><dd class="image-caption" style="width:500px">Test image caption</dd></dl><dl class="image-left captioned"><dt><img src="http://nohost/plone/folder/gamma/image" alt="Kupu Test Image" title="Kupu Test Image" height="331" width="500" /></dt><dd class="image-caption" style="width:500px">Test image caption</dd></dl>]

!=

Expected:
[<div>Simple text containing an embedded image</div><dl class="image-left captioned"><dt><img src="http://nohost/plone/folder/gamma/image" alt="Kupu Test Image" title="Kupu Test Image" height="331" width="500" /></dt><dd class="image-caption" style="width:500px">Test image caption</dd></dl><dl class="image-left captioned"><dt><a rel="lightbox" href="/plone/folder/gamma"><img src="http://nohost/plone/folder/gamma/image_thumb" alt="Kupu Test Image" title="Kupu Test Image" height="84" width="128" /></a></dt><dd class="image-caption" style="width:128px">Test image caption</dd></dl><dl class="image-left captioned"><dt><img src="http://nohost/plone/folder/gamma/image" alt="Kupu Test Image" title="Kupu Test Image" height="331" width="500" /></dt><dd class="image-caption" style="width:500px">Test image caption</dd></dl>]

IN html_to_captioned(/home/stefan/autotest/temp/python26-zope212-cmf22-plone40/eggs/Products.kupu-1.4.16-py2.6.egg/Products/kupu/plone/tests/input/simple.in)



Failure in test testSameNoFilename (Products.kupu.plone.tests.test_html2captioned.TransformTestSubclass)
Traceback (most recent call last):
  File "/usr/local/python2.6/lib/python2.6/unittest.py", line 279, in run
    testMethod()
  File "/home/stefan/autotest/temp/python26-zope212-cmf22-plone40/eggs/Products.kupu-1.4.16-py2.6.egg/Products/kupu/plone/tests/test_html2captioned.py", line 82, in testSameNoFilename
    self.do_convert()
  File "/home/stefan/autotest/temp/python26-zope212-cmf22-plone40/eggs/Products.kupu-1.4.16-py2.6.egg/Products/kupu/plone/tests/test_html2captioned.py", line 71, in do_convert
    got, expected, self.transform.name(), self.input))
  File "/usr/local/python2.6/lib/python2.6/unittest.py", line 350, in failUnlessEqual
    (msg or '%r != %r' % (first, second))
AssertionError: Got:
[<div>Simple text containing an embedded image</div><dl class="image-left captioned"><dt><img src="http://nohost/plone/folder/gamma/image" alt="Kupu Test Image" title="Kupu Test Image" height="331" width="500" /></dt><dd class="image-caption" style="width:500px">Test image caption</dd></dl><dl class="image-left captioned"><dt><img src="http://nohost/plone/folder/gamma/image_thumb" alt="Kupu Test Image" title="Kupu Test Image" height="84" width="128" /></dt><dd class="image-caption" style="width:500px">Test image caption</dd></dl><dl class="image-left captioned"><dt><img src="http://nohost/plone/folder/gamma/image" alt="Kupu Test Image" title="Kupu Test Image" height="331" width="500" /></dt><dd class="image-caption" style="width:500px">Test image caption</dd></dl>]

!=

Expected:
[<div>Simple text containing an embedded image</div><dl class="image-left captioned"><dt><img src="http://nohost/plone/folder/gamma/image" alt="Kupu Test Image" title="Kupu Test Image" height="331" width="500" /></dt><dd class="image-caption" style="width:500px">Test image caption</dd></dl><dl class="image-left captioned"><dt><a rel="lightbox" href="/plone/folder/gamma"><img src="http://nohost/plone/folder/gamma/image_thumb" alt="Kupu Test Image" title="Kupu Test Image" height="84" width="128" /></a></dt><dd class="image-caption" style="width:128px">Test image caption</dd></dl><dl class="image-left captioned"><dt><img src="http://nohost/plone/folder/gamma/image" alt="Kupu Test Image" title="Kupu Test Image" height="331" width="500" /></dt><dd class="image-caption" style="width:500px">Test image caption</dd></dl>]

IN html_to_captioned(/home/stefan/autotest/temp/python26-zope212-cmf22-plone40/eggs/Products.kupu-1.4.16-py2.6.egg/Products/kupu/plone/tests/input/simple.in)



Failure in test testSame (Products.kupu.plone.tests.test_html2captioned.TransformTestSubclass)
Traceback (most recent call last):
  File "/usr/local/python2.6/lib/python2.6/unittest.py", line 279, in run
    testMethod()
  File "/home/stefan/autotest/temp/python26-zope212-cmf22-plone40/eggs/Products.kupu-1.4.16-py2.6.egg/Products/kupu/plone/tests/test_html2captioned.py", line 78, in testSame
    self.do_convert(filename=self.input)
  File "/home/stefan/autotest/temp/python26-zope212-cmf22-plone40/eggs/Products.kupu-1.4.16-py2.6.egg/Products/kupu/plone/tests/test_html2captioned.py", line 71, in do_convert
    got, expected, self.transform.name(), self.input))
  File "/usr/local/python2.6/lib/python2.6/unittest.py", line 350, in failUnlessEqual
    (msg or '%r != %r' % (first, second))
AssertionError: Got:
[<div>Simple text containing an embedded image</div><dl class="image-left captioned"><dt><img src="http://nohost/plone/folder/umlauts/image" alt="Kupu Test Image åäö" title="Kupu Test Image åäö" height="331" width="500" /></dt><dd class="image-caption" style="width:500px">Test image caption åäö</dd></dl><dl class="image-left captioned"><dt><img src="http://nohost/plone/folder/umlauts/image_thumb" alt="Kupu Test Image åäö" title="Kupu Test Image åäö" height="84" width="128" /></dt><dd class="image-caption" style="width:500px">Test image caption åäö</dd></dl><dl class="image-left captioned"><dt><img src="http://nohost/plone/folder/umlauts/image" alt="Kupu Test Image åäö" title="Kupu Test Image åäö" height="331" width="500" /></dt><dd class="image-caption" style="width:500px">Test image caption åäö</dd></dl>]

!=

Expected:
[<div>Simple text containing an embedded image</div><dl class="image-left captioned"><dt><img src="http://nohost/plone/folder/umlauts/image" alt="Kupu Test Image åäö" title="Kupu Test Image åäö" height="331" width="500" /></dt><dd class="image-caption" style="width:500px">Test image caption åäö</dd></dl><dl class="image-left captioned"><dt><a rel="lightbox" href="/plone/folder/umlauts"><img src="http://nohost/plone/folder/umlauts/image_thumb" alt="Kupu Test Image åäö" title="Kupu Test Image åäö" height="84" width="128" /></a></dt><dd class="image-caption" style="width:128px">Test image caption åäö</dd></dl><dl class="image-left captioned"><dt><img src="http://nohost/plone/folder/umlauts/image" alt="Kupu Test Image åäö" title="Kupu Test Image åäö" height="331" width="500" /></dt><dd class="image-caption" style="width:500px">Test image caption åäö</dd></dl>]

IN html_to_captioned(/home/stefan/autotest/temp/python26-zope212-cmf22-plone40/eggs/Products.kupu-1.4.16-py2.6.egg/Products/kupu/plone/tests/input/umlauts.in)



Failure in test testSameNoFilename (Products.kupu.plone.tests.test_html2captioned.TransformTestSubclass)
Traceback (most recent call last):
  File "/usr/local/python2.6/lib/python2.6/unittest.py", line 279, in run
    testMethod()
  File "/home/stefan/autotest/temp/python26-zope212-cmf22-plone40/eggs/Products.kupu-1.4.16-py2.6.egg/Products/kupu/plone/tests/test_html2captioned.py", line 82, in testSameNoFilename
    self.do_convert()
  File "/home/stefan/autotest/temp/python26-zope212-cmf22-plone40/eggs/Products.kupu-1.4.16-py2.6.egg/Products/kupu/plone/tests/test_html2captioned.py", line 71, in do_convert
    got, expected, self.transform.name(), self.input))
  File "/usr/local/python2.6/lib/python2.6/unittest.py", line 350, in failUnlessEqual
    (msg or '%r != %r' % (first, second))
AssertionError: Got:
[<div>Simple text containing an embedded image</div><dl class="image-left captioned"><dt><img src="http://nohost/plone/folder/umlauts/image" alt="Kupu Test Image åäö" title="Kupu Test Image åäö" height="331" width="500" /></dt><dd class="image-caption" style="width:500px">Test image caption åäö</dd></dl><dl class="image-left captioned"><dt><img src="http://nohost/plone/folder/umlauts/image_thumb" alt="Kupu Test Image åäö" title="Kupu Test Image åäö" height="84" width="128" /></dt><dd class="image-caption" style="width:500px">Test image caption åäö</dd></dl><dl class="image-left captioned"><dt><img src="http://nohost/plone/folder/umlauts/image" alt="Kupu Test Image åäö" title="Kupu Test Image åäö" height="331" width="500" /></dt><dd class="image-caption" style="width:500px">Test image caption åäö</dd></dl>]

!=

Expected:
[<div>Simple text containing an embedded image</div><dl class="image-left captioned"><dt><img src="http://nohost/plone/folder/umlauts/image" alt="Kupu Test Image åäö" title="Kupu Test Image åäö" height="331" width="500" /></dt><dd class="image-caption" style="width:500px">Test image caption åäö</dd></dl><dl class="image-left captioned"><dt><a rel="lightbox" href="/plone/folder/umlauts"><img src="http://nohost/plone/folder/umlauts/image_thumb" alt="Kupu Test Image åäö" title="Kupu Test Image åäö" height="84" width="128" /></a></dt><dd class="image-caption" style="width:128px">Test image caption åäö</dd></dl><dl class="image-left captioned"><dt><img src="http://nohost/plone/folder/umlauts/image" alt="Kupu Test Image åäö" title="Kupu Test Image åäö" height="331" width="500" /></dt><dd class="image-caption" style="width:500px">Test image caption åäö</dd></dl>]

IN html_to_captioned(/home/stefan/autotest/temp/python26-zope212-cmf22-plone40/eggs/Products.kupu-1.4.16-py2.6.egg/Products/kupu/plone/tests/input/umlauts.in)



Error in test test_delete (Products.kupu.plone.tests.test_librarymanager.TestILibraryManager)
Traceback (most recent call last):
  File "/usr/local/python2.6/lib/python2.6/unittest.py", line 279, in run
    testMethod()
  File "/home/stefan/autotest/temp/python26-zope212-cmf22-plone40/eggs/Products.kupu-1.4.16-py2.6.egg/Products/kupu/plone/tests/test_librarymanager.py", line 102, in test_delete
    self.assertEqual(libs.getLibraries(self.context), expected)
  File "/home/stefan/autotest/temp/python26-zope212-cmf22-plone40/eggs/Products.kupu-1.4.16-py2.6.egg/Products/kupu/plone/librarytool.py", line 85, in getLibraries
    lib[key] = self.translate(lib[key], domain='kupu')
AttributeError: translate



Error in test test_expressions (Products.kupu.plone.tests.test_librarymanager.TestILibraryManager)
Traceback (most recent call last):
  File "/usr/local/python2.6/lib/python2.6/unittest.py", line 279, in run
    testMethod()
  File "/home/stefan/autotest/temp/python26-zope212-cmf22-plone40/eggs/Products.kupu-1.4.16-py2.6.egg/Products/kupu/plone/tests/test_librarymanager.py", line 90, in test_expressions
    v = libs.getLibraries(context)
  File "/home/stefan/autotest/temp/python26-zope212-cmf22-plone40/eggs/Products.kupu-1.4.16-py2.6.egg/Products/kupu/plone/librarytool.py", line 85, in getLibraries
    lib[key] = self.translate(lib[key], domain='kupu')
AttributeError: translate



Error in test test_get_library (Products.kupu.plone.tests.test_librarymanager.TestILibraryManager)
Traceback (most recent call last):
  File "/usr/local/python2.6/lib/python2.6/unittest.py", line 279, in run
    testMethod()
  File "/home/stefan/autotest/temp/python26-zope212-cmf22-plone40/eggs/Products.kupu-1.4.16-py2.6.egg/Products/kupu/plone/tests/test_librarymanager.py", line 67, in test_get_library
    self.assertEqual(libs.getLibraries(self.context), expected)
  File "/home/stefan/autotest/temp/python26-zope212-cmf22-plone40/eggs/Products.kupu-1.4.16-py2.6.egg/Products/kupu/plone/librarytool.py", line 85, in getLibraries
    lib[key] = self.translate(lib[key], domain='kupu')
AttributeError: translate



Error in test test_move (Products.kupu.plone.tests.test_librarymanager.TestILibraryManager)
Traceback (most recent call last):
  File "/usr/local/python2.6/lib/python2.6/unittest.py", line 279, in run
    testMethod()
  File "/home/stefan/autotest/temp/python26-zope212-cmf22-plone40/eggs/Products.kupu-1.4.16-py2.6.egg/Products/kupu/plone/tests/test_librarymanager.py", line 143, in test_move
    self.assertEqual(libs.getLibraries(self.context), expected)
  File "/home/stefan/autotest/temp/python26-zope212-cmf22-plone40/eggs/Products.kupu-1.4.16-py2.6.egg/Products/kupu/plone/librarytool.py", line 85, in getLibraries
    lib[key] = self.translate(lib[key], domain='kupu')
AttributeError: translate



Error in test test_update (Products.kupu.plone.tests.test_librarymanager.TestILibraryManager)
Traceback (most recent call last):
  File "/usr/local/python2.6/lib/python2.6/unittest.py", line 279, in run
    testMethod()
  File "/home/stefan/autotest/temp/python26-zope212-cmf22-plone40/eggs/Products.kupu-1.4.16-py2.6.egg/Products/kupu/plone/tests/test_librarymanager.py", line 130, in test_update
    self.assertEqual(libs.getLibraries(context), expected)
  File "/home/stefan/autotest/temp/python26-zope212-cmf22-plone40/eggs/Products.kupu-1.4.16-py2.6.egg/Products/kupu/plone/librarytool.py", line 85, in getLibraries
    lib[key] = self.translate(lib[key], domain='kupu')
AttributeError: translate

  Ran 373 tests with 4 failures and 5 errors in 14.837 seconds.
Running zope.testing.testrunner.layer.UnitTests tests:
  Tear down Products.PloneTestCase.layer.PloneSite in 0.388 seconds.
  Tear down Products.PloneTestCase.layer.ZCML in 0.004 seconds.
  Tear down Testing.ZopeTestCase.layer.ZopeLite in 0.000 seconds.
  Set up zope.testing.testrunner.layer.UnitTests in 0.000 seconds.
  Ran 8 tests with 0 failures and 0 errors in 0.001 seconds.
Tearing down left over layers:
  Tear down zope.testing.testrunner.layer.UnitTests in 0.000 seconds.
Total: 384 tests, 4 failures, 5 errors in 23.546 seconds.
Running archetypes.referencebrowserwidget.tests.base.layer tests:
  Set up Testing.ZopeTestCase.layer.ZopeLite in 0.000 seconds.
  Set up Products.PloneTestCase.layer.ZCML in 1.837 seconds.
  Set up Products.PloneTestCase.layer.PloneSite in 4.658 seconds.
  Set up archetypes.referencebrowserwidget.tests.base.layer in 0.000 seconds.
  Ran 43 tests with 0 failures and 0 errors in 7.787 seconds.
Running zope.testing.testrunner.layer.UnitTests tests:
  Tear down archetypes.referencebrowserwidget.tests.base.layer in 0.000 seconds.
  Tear down Products.PloneTestCase.layer.PloneSite in 0.368 seconds.
  Tear down Products.PloneTestCase.layer.ZCML in 0.007 seconds.
  Tear down Testing.ZopeTestCase.layer.ZopeLite in 0.000 seconds.
  Set up zope.testing.testrunner.layer.UnitTests in 0.000 seconds.
  Ran 4 tests with 0 failures and 0 errors in 0.001 seconds.
Tearing down left over layers:
  Tear down zope.testing.testrunner.layer.UnitTests in 0.000 seconds.
Total: 47 tests, 0 failures, 0 errors in 15.146 seconds.
Running archetypes.schemaextender.tests.testIntegration.layer tests:
  Set up Testing.ZopeTestCase.layer.ZopeLite in 1.260 seconds.
  Set up Products.PloneTestCase.layer.ZCML in 2.357 seconds.
  Set up Products.PloneTestCase.layer.PloneSite in 4.078 seconds.
  Set up archetypes.schemaextender.tests.testIntegration.layer in 0.000 seconds.
  Ran 17 tests with 0 failures and 0 errors in 3.068 seconds.
Running zope.testing.testrunner.layer.UnitTests tests:
  Tear down archetypes.schemaextender.tests.testIntegration.layer in 0.000 seconds.
  Tear down Products.PloneTestCase.layer.PloneSite in 0.366 seconds.
  Tear down Products.PloneTestCase.layer.ZCML in 0.007 seconds.
  Tear down Testing.ZopeTestCase.layer.ZopeLite in 0.000 seconds.
  Set up zope.testing.testrunner.layer.UnitTests in 0.000 seconds.
  Ran 19 tests with 0 failures and 0 errors in 0.007 seconds.
Tearing down left over layers:
  Tear down zope.testing.testrunner.layer.UnitTests in 0.000 seconds.
Total: 36 tests, 0 failures, 0 errors in 11.570 seconds.
Running zope.testing.testrunner.layer.UnitTests tests:
  Set up zope.testing.testrunner.layer.UnitTests in 0.000 seconds.
  Ran 4 tests with 0 failures and 0 errors in 0.039 seconds.
Tearing down left over layers:
  Tear down zope.testing.testrunner.layer.UnitTests in 0.000 seconds.
Running Testing.ZopeTestCase.layer.ZopeLite tests:
  Set up Testing.ZopeTestCase.layer.ZopeLite in 0.035 seconds.
  Ran 40 tests with 0 failures and 0 errors in 0.757 seconds.
Tearing down left over layers:
  Tear down Testing.ZopeTestCase.layer.ZopeLite in 0.000 seconds.
/home/stefan/autotest/temp/python26-zope212-cmf22-plone40/eggs/kss.core-1.6.0a1-py2.6.egg/kss/core/tests/test_kssview_core.py:165: UserWarning: The test_class you are using doesn't subclass from ZopeTestCase.Functional. Please fix that.
  tearDown=KSSViewTestCase.beforeTearDown.im_func))
Running Testing.ZopeTestCase.layer.ZopeLite tests:
  Set up Testing.ZopeTestCase.layer.ZopeLite in 0.046 seconds.
  Ran 1 tests with 0 failures and 0 errors in 0.257 seconds.
Running kss.core.tests.base.KSSLayer tests:
  Tear down Testing.ZopeTestCase.layer.ZopeLite in 0.000 seconds.
  Set up kss.core.tests.base.KSSCoreLayer in 0.030 seconds.
  Set up kss.core.tests.base.KSSLayer in 0.056 seconds.
  Ran 29 tests with 0 failures and 0 errors in 0.153 seconds.
Running kss.core.tests.test_ttwapi.layer tests:
  Set up kss.core.tests.test_ttwapi.layer in 0.001 seconds.
  Ran 3 tests with 0 failures and 0 errors in 0.026 seconds.
Running zope.testing.testrunner.layer.UnitTests tests:
  Tear down kss.core.tests.test_ttwapi.layer in 0.000 seconds.
  Tear down kss.core.tests.base.KSSLayer in 0.000 seconds.
  Tear down kss.core.tests.base.KSSCoreLayer in 0.000 seconds.
  Set up zope.testing.testrunner.layer.UnitTests in 0.000 seconds.
/home/stefan/autotest/temp/python26-zope212-cmf22-plone40/eggs/kss.core-1.6.0a1-py2.6.egg/kss/core/siteview.txt:1: DeprecationWarning: ISite is deprecated. Moved to zope.location.interfaces. Importing from here will stop working in Zope 3.6
  =========
  Ran 14 tests with 0 failures and 0 errors in 0.009 seconds.
Tearing down left over layers:
  Tear down zope.testing.testrunner.layer.UnitTests in 0.000 seconds.
Total: 47 tests, 0 failures, 0 errors in 0.884 seconds.
***********************************************
WARNING: LinguaPlone not found. Skipping tests.
***********************************************
***********************************************
WARNING: LinguaPlone not found. Skipping tests.
***********************************************
Running plone.app.blob.tests.layer.BlobLayer tests:
  Set up Testing.ZopeTestCase.layer.ZopeLite in 0.878 seconds.
  Set up Products.PloneTestCase.layer.ZCML in 2.365 seconds.
  Set up Products.PloneTestCase.layer.PloneSite in 4.075 seconds.
  Set up plone.app.blob.tests.layer.BlobLayer in 0.103 seconds.
/home/stefan/autotest/temp/python26-zope212-cmf22-plone40/eggs/Products.PortalTransforms-2.0a1-py2.6.egg/Products/PortalTransforms/libtransforms/commandtransform.py:97: DeprecationWarning: os.popen4 is deprecated.  Use the subprocess module.
  cin, couterr = os.popen4(command, 'b')
  Ran 28 tests with 0 failures and 0 errors in 2 minutes 4.302 seconds.
Running plone.app.blob.tests.layer.BlobReplacementLayer tests:
  Set up plone.app.blob.tests.layer.BlobReplacementLayer in 0.191 seconds.
  Ran 39 tests with 0 failures and 0 errors in 50.655 seconds.
Running zope.testing.testrunner.layer.UnitTests tests:
  Tear down plone.app.blob.tests.layer.BlobReplacementLayer in 0.000 seconds.
  Tear down plone.app.blob.tests.layer.BlobLayer in 0.000 seconds.
  Tear down Products.PloneTestCase.layer.PloneSite in 0.358 seconds.
  Tear down Products.PloneTestCase.layer.ZCML in 0.009 seconds.
  Tear down Testing.ZopeTestCase.layer.ZopeLite in 0.000 seconds.
  Set up zope.testing.testrunner.layer.UnitTests in 0.000 seconds.
  Ran 2 tests with 0 failures and 0 errors in 0.001 seconds.
Tearing down left over layers:
  Tear down zope.testing.testrunner.layer.UnitTests in 0.000 seconds.
Total: 69 tests, 0 failures, 0 errors in 3 minutes 3.655 seconds.
Running Testing.ZopeTestCase.layer.ZopeLite tests:
  Set up Testing.ZopeTestCase.layer.ZopeLite in 0.888 seconds.
  Ran 2 tests with 0 failures and 0 errors in 0.008 seconds.
Running plone.app.folder.tests.layer.IntegrationLayer tests:
  Set up Products.PloneTestCase.layer.ZCML in 2.363 seconds.
  Set up Products.PloneTestCase.layer.PloneSite in 3.908 seconds.
  Set up plone.app.folder.tests.layer.IntegrationLayer in 0.463 seconds.
  Ran 9 tests with 0 failures and 0 errors in 2.073 seconds.
Running plone.app.folder.tests.layer.PartialOrderingIntegrationLayer tests:
  Set up plone.app.folder.tests.layer.PartialOrderingIntegrationLayer in 0.000 seconds.
  Ran 3 tests with 0 failures and 0 errors in 0.311 seconds.
Tearing down left over layers:
  Tear down plone.app.folder.tests.layer.PartialOrderingIntegrationLayer in 0.000 seconds.
  Tear down plone.app.folder.tests.layer.IntegrationLayer in 0.000 seconds.
  Tear down Products.PloneTestCase.layer.PloneSite in 0.361 seconds.
  Tear down Products.PloneTestCase.layer.ZCML in 0.004 seconds.
  Tear down Testing.ZopeTestCase.layer.ZopeLite in 0.000 seconds.
Total: 14 tests, 0 failures, 0 errors in 10.945 seconds.
Running plone.app.imaging.tests.layer.ImagingLayer tests:
  Set up Testing.ZopeTestCase.layer.ZopeLite in 0.896 seconds.
  Set up Products.PloneTestCase.layer.ZCML in 2.403 seconds.
  Set up Products.PloneTestCase.layer.PloneSite in 4.103 seconds.
  Set up plone.app.imaging.tests.layer.ImagingLayer in 0.101 seconds.
  Ran 34 tests with 0 failures and 0 errors in 3.916 seconds.
Running zope.testing.testrunner.layer.UnitTests tests:
  Tear down plone.app.imaging.tests.layer.ImagingLayer in 0.000 seconds.
  Tear down Products.PloneTestCase.layer.PloneSite in 0.378 seconds.
  Tear down Products.PloneTestCase.layer.ZCML in 0.005 seconds.
  Tear down Testing.ZopeTestCase.layer.ZopeLite in 0.000 seconds.
  Set up zope.testing.testrunner.layer.UnitTests in 0.000 seconds.
  Ran 7 tests with 0 failures and 0 errors in 0.001 seconds.
Tearing down left over layers:
  Tear down zope.testing.testrunner.layer.UnitTests in 0.000 seconds.
Total: 41 tests, 0 failures, 0 errors in 12.239 seconds.
Running Products.PloneTestCase.layer.PloneSite tests:
  Set up Testing.ZopeTestCase.layer.ZopeLite in 1.359 seconds.
  Set up Products.PloneTestCase.layer.ZCML in 2.393 seconds.
  Set up Products.PloneTestCase.layer.PloneSite in 4.060 seconds.
  Ran 7 tests with 0 failures and 0 errors in 0.071 seconds.
Tearing down left over layers:
  Tear down Products.PloneTestCase.layer.PloneSite in 0.364 seconds.
  Tear down Products.PloneTestCase.layer.ZCML in 0.004 seconds.
  Tear down Testing.ZopeTestCase.layer.ZopeLite in 0.000 seconds.
Total: 0 tests, 0 failures, 0 errors in 0.000 seconds.
Running Products.PloneTestCase.layer.PloneSite tests:
  Set up Testing.ZopeTestCase.layer.ZopeLite in 1.371 seconds.
  Set up Products.PloneTestCase.layer.ZCML in 2.311 seconds.
  Set up Products.PloneTestCase.layer.PloneSite in 4.065 seconds.
  Ran 3 tests with 0 failures and 0 errors in 1.136 seconds.
Tearing down left over layers:
  Tear down Products.PloneTestCase.layer.PloneSite in 0.354 seconds.
  Tear down Products.PloneTestCase.layer.ZCML in 0.004 seconds.
  Tear down Testing.ZopeTestCase.layer.ZopeLite in 0.000 seconds.
Running Products.PloneTestCase.layer.PloneSite tests:
  Set up Testing.ZopeTestCase.layer.ZopeLite in 1.641 seconds.
  Set up Products.PloneTestCase.layer.ZCML in 2.382 seconds.
  Set up Products.PloneTestCase.layer.PloneSite in 4.072 seconds.
  Ran 5 tests with 0 failures and 0 errors in 1.317 seconds.
Tearing down left over layers:
  Tear down Products.PloneTestCase.layer.PloneSite in 0.365 seconds.
  Tear down Products.PloneTestCase.layer.ZCML in 0.005 seconds.
  Tear down Testing.ZopeTestCase.layer.ZopeLite in 0.000 seconds.
Running plone.folder.tests.layer.PartialOrderingLayer tests:
  Set up plone.folder.tests.layer.PartialOrderingLayer in 0.000 seconds.
  Ran 11 tests with 0 failures and 0 errors in 0.007 seconds.
Running plone.folder.tests.layer.PloneFolderLayer tests:
  Tear down plone.folder.tests.layer.PartialOrderingLayer in 0.000 seconds.
  Set up plone.folder.tests.layer.PloneFolderLayer in 0.000 seconds.
  Ran 45 tests with 0 failures and 0 errors in 0.031 seconds.
Tearing down left over layers:
  Tear down plone.folder.tests.layer.PloneFolderLayer in 0.000 seconds.
Total: 56 tests, 0 failures, 0 errors in 0.170 seconds.
Running Products.PloneTestCase.layer.PloneSite tests:
  Set up Testing.ZopeTestCase.layer.ZopeLite in 1.369 seconds.
  Set up Products.PloneTestCase.layer.ZCML in 2.356 seconds.
  Set up Products.PloneTestCase.layer.PloneSite in 4.262 seconds.
  Ran 41 tests with 0 failures and 0 errors in 0.368 seconds.
Tearing down left over layers:
  Tear down Products.PloneTestCase.layer.PloneSite in 0.358 seconds.
  Tear down Products.PloneTestCase.layer.ZCML in 0.004 seconds.
  Tear down Testing.ZopeTestCase.layer.ZopeLite in 0.000 seconds.
Total: 0 tests, 0 failures, 0 errors in 0.000 seconds.
Total: 0 tests, 0 failures, 0 errors in 0.000 seconds.
Running Products.PloneTestCase.layer.ZCML tests:
  Set up Testing.ZopeTestCase.layer.ZopeLite in 0.898 seconds.
  Set up Products.PloneTestCase.layer.ZCML in 2.356 seconds.
/home/stefan/autotest/temp/python26-zope212-cmf22-plone40/eggs/wicked-1.1.8alpha1-py2.6.egg/wicked/cache.py:34: DeprecationWarning: object.__init__() takes no parameters
  super(CacheStore, self).__init__(self)
  Ran 16 tests with 0 failures and 0 errors in 0.095 seconds.
Running wicked.at.tests.wickedtestcase.WickedSite tests:
  Set up Products.PloneTestCase.layer.PloneSite in 4.898 seconds.
  Set up wicked.at.tests.wickedtestcase.WickedSite in 0.003 seconds.
/home/stefan/autotest/temp/python26-zope212-cmf22-plone40/eggs/Zope2-2.12.1-py2.6-linux-x86_64.egg/OFS/subscribers.py:73: DeprecationWarning: wicked.atcontent.ironicwiki.IronicWiki.manage_afterAdd is discouraged. You should use event subscribers instead.
  DeprecationWarning)
/home/stefan/autotest/temp/python26-zope212-cmf22-plone40/eggs/Zope2-2.12.1-py2.6-linux-x86_64.egg/OFS/subscribers.py:73: DeprecationWarning: wicked.atcontent.ironicwiki.IronicWiki.manage_beforeDelete is discouraged. You should use event subscribers instead.
  DeprecationWarning)
/home/stefan/autotest/temp/python26-zope212-cmf22-plone40/eggs/Zope2-2.12.1-py2.6-linux-x86_64.egg/OFS/subscribers.py:73: DeprecationWarning: wicked.atcontent.ironicwiki.IronicWiki.manage_afterClone is discouraged. You should use event subscribers instead.
  DeprecationWarning)
  Ran 23 tests with 0 failures and 0 errors in 4.796 seconds.
Running wicked.at.tests.test_scope.Scoped tests:
  Set up wicked.at.tests.test_scope.Scoped in 0.000 seconds.
  Ran 3 tests with 0 failures and 0 errors in 0.535 seconds.
Running wicked.plone.tests.SelectiveATCT tests:
  Tear down wicked.at.tests.test_scope.Scoped in 0.000 seconds.
  Tear down wicked.at.tests.wickedtestcase.WickedSite in 0.002 seconds.
  Set up wicked.plone.tests.SelectiveATCT in 0.003 seconds.
  Ran 22 tests with 0 failures and 0 errors in 5.021 seconds.
Running wicked.plone.tests.ZCMLLayer tests:
  Tear down wicked.plone.tests.SelectiveATCT in 0.004 seconds.
  Set up wicked.plone.tests.ZCMLLayer in 0.018 seconds.
  Ran 8 tests with 0 failures and 0 errors in 0.740 seconds.
Running zope.testing.testrunner.layer.UnitTests tests:
  Tear down wicked.plone.tests.ZCMLLayer in 0.393 seconds.
  Tear down Products.PloneTestCase.layer.PloneSite in 0.001 seconds.
  Tear down Products.PloneTestCase.layer.ZCML in 0.004 seconds.
  Tear down Testing.ZopeTestCase.layer.ZopeLite in 0.000 seconds.
  Set up zope.testing.testrunner.layer.UnitTests in 0.000 seconds.
  Ran 34 tests with 0 failures and 0 errors in 0.016 seconds.
Tearing down left over layers:
  Tear down zope.testing.testrunner.layer.UnitTests in 0.000 seconds.
Total: 106 tests, 0 failures, 0 errors in 21.004 seconds.
#### Running tests for group ATCT ####
#### Finished tests for group ATCT ####

#### Running tests for group Archetypes ####
#### Finished tests for group Archetypes ####

#### Running tests for group CMF ####
#### Finished tests for group CMF ####

#### Running tests for group CMFEditions ####
#### Finished tests for group CMFEditions ####

#### Running tests for group Plone ####
#### Finished tests for group Plone ####

#### Running tests for group PlonePAS ####
#### Finished tests for group PlonePAS ####

#### Running tests for group plone ####
#### Finished tests for group plone ####

#### Running tests for group portlets ####
#### Finished tests for group portlets ####

#### Running tests for Products.CMFPlacefulWorkflow ####
#### Finished tests for Products.CMFPlacefulWorkflow ####

#### Running tests for Products.CMFTestCase ####
#### Finished tests for Products.CMFTestCase ####

#### Running tests for Products.ExtendedPathIndex ####
#### Finished tests for Products.ExtendedPathIndex ####

#### Running tests for Products.PasswordResetTool ####
#### Finished tests for Products.PasswordResetTool ####

#### Running tests for Products.PloneTestCase ####
#### Finished tests for Products.PloneTestCase ####

#### Running tests for Products.ResourceRegistries ####
#### Finished tests for Products.ResourceRegistries ####

#### Running tests for Products.TinyMCE ####
#### Finished tests for Products.TinyMCE ####

#### Running tests for Products.ZopeVersionControl ####
#### Finished tests for Products.ZopeVersionControl ####

#### Running tests for Products.contentmigration ####
#### Finished tests for Products.contentmigration ####

#### Running tests for Products.i18ntestcase ####
#### Finished tests for Products.i18ntestcase ####

#### Running tests for Products.kupu ####
#### Finished tests for Products.kupu ####

#### Running tests for archetypes.referencebrowserwidget ####
#### Finished tests for archetypes.referencebrowserwidget ####

#### Running tests for archetypes.schemaextender ####
#### Finished tests for archetypes.schemaextender ####

#### Running tests for collective.monkeypatcher ####
#### Finished tests for collective.monkeypatcher ####

#### Running tests for five.customerize ####
#### Finished tests for five.customerize ####

#### Running tests for kss.core ####
#### Finished tests for kss.core ####

#### Running tests for plone.app.blob ####
#### Finished tests for plone.app.blob ####

#### Running tests for plone.app.folder ####
#### Finished tests for plone.app.folder ####

#### Running tests for plone.app.imaging ####
#### Finished tests for plone.app.imaging ####

#### Running tests for plone.app.jquerytools ####
#### Finished tests for plone.app.jquerytools ####

#### Running tests for plone.app.locales ####
#### Finished tests for plone.app.locales ####

#### Running tests for plone.app.openid ####
#### Finished tests for plone.app.openid ####

#### Running tests for plone.app.users ####
#### Finished tests for plone.app.users ####

#### Running tests for plone.folder ####
#### Finished tests for plone.folder ####

#### Running tests for plone.stringinterp ####
#### Finished tests for plone.stringinterp ####

#### Running tests for plonetheme.classic ####
#### Finished tests for plonetheme.classic ####

#### Running tests for plonetheme.sunburst ####
#### Finished tests for plonetheme.sunburst ####

#### Running tests for wicked ####
#### Finished tests for wicked ####

Packages with test failures:

Failing tests in group plone
Failing tests in Products.kupu

Total time elapsed: 1133.092 seconds

Grand total: 86 packages, 2 failures


FAILED (86 packages, 2 failures)




More information about the Testbot mailing list