[Testbot] FAILED (86 packages, 3 failures) : Plone-4.0 Zope-2.12 Python-2.6.4

Plone Tests plone-tests at epy.co.at
Thu Nov 19 03:12:17 UTC 2009


Plone Tests : FAILED (86 packages, 3 failures)
Plone-4.0 Zope-2.12 Python-2.6.4

Running ./bin/alltests -q --no-color --no-progress
Running Products.CMFTestCase.layer.CMFSite tests:
  Set up Testing.ZopeTestCase.layer.ZopeLite in 1.126 seconds.
  Set up Products.CMFTestCase.layer.ZCML in 2.926 seconds.
  Set up Products.CMFTestCase.layer.CMFSite in 2.122 seconds.
  Ran 31 tests with 0 failures and 0 errors in 0.551 seconds.
Running Products.PloneTestCase.layer.PloneSite tests:
  Tear down Products.CMFTestCase.layer.CMFSite in 0.068 seconds.
  Tear down Products.CMFTestCase.layer.ZCML in 0.004 seconds.
  Set up Products.PloneTestCase.layer.ZCML in 1.962 seconds.
  Set up Products.PloneTestCase.layer.PloneSite in 4.189 seconds.
  Ran 711 tests with 0 failures and 0 errors in 1 minutes 8.943 seconds.
Tearing down left over layers:
  Tear down Products.PloneTestCase.layer.PloneSite in 0.368 seconds.
  Tear down Products.PloneTestCase.layer.ZCML in 0.010 seconds.
  Tear down Testing.ZopeTestCase.layer.ZopeLite in 0.000 seconds.
Total: 742 tests, 0 failures, 0 errors in 1 minutes 22.816 seconds.
Running Testing.ZopeTestCase.layer.ZopeLite tests:
  Set up Testing.ZopeTestCase.layer.ZopeLite in 0.786 seconds.
  Ran 36 tests with 0 failures and 0 errors in 0.081 seconds.
Running Products.Archetypes.tests.layer.ZCML tests:
  Set up Products.CMFCore.testing.FunctionalZCMLLayer in 0.191 seconds.
  Set up Products.Archetypes.tests.layer.ZCML in 0.175 seconds.
  Ran 59 tests with 0 failures and 0 errors in 1.163 seconds.
Running Products.Archetypes.tests.layer.ArchetypesSite tests:
  Set up Products.Archetypes.tests.layer.ArchetypesSite in 2.067 seconds.
/home/stefan/autotest/temp/python26-zope212-cmf22-plone40/eggs/Zope2-2.12.1-py2.6-linux-x86_64.egg/OFS/subscribers.py:73: DeprecationWarning: Products.Archetypes.tests.test_classgen.Dummy.manage_afterAdd is discouraged. You should use event subscribers instead.
  DeprecationWarning)
/home/stefan/autotest/temp/python26-zope212-cmf22-plone40/eggs/Zope2-2.12.1-py2.6-linux-x86_64.egg/OFS/subscribers.py:73: DeprecationWarning: Products.Archetypes.tests.test_annotation.AnnDummy.manage_afterAdd is discouraged. You should use event subscribers instead.
  DeprecationWarning)
/home/stefan/autotest/temp/python26-zope212-cmf22-plone40/eggs/Zope2-2.12.1-py2.6-linux-x86_64.egg/OFS/subscribers.py:73: DeprecationWarning: Products.Archetypes.tests.test_event.Dummy.manage_afterAdd is discouraged. You should use event subscribers instead.
  DeprecationWarning)
  Ran 511 tests with 0 failures and 0 errors in 39.122 seconds.
Running Products.PloneTestCase.layer.PloneSite tests:
  Tear down Products.Archetypes.tests.layer.ArchetypesSite in 0.066 seconds.
  Tear down Products.Archetypes.tests.layer.ZCML in 0.004 seconds.
  Tear down Products.CMFCore.testing.FunctionalZCMLLayer in 0.000 seconds.
  Set up Products.PloneTestCase.layer.ZCML in 2.310 seconds.
  Set up Products.PloneTestCase.layer.PloneSite in 3.914 seconds.
  Ran 9 tests with 0 failures and 0 errors in 1.065 seconds.
Running plone.app.kss.tests.kss_and_plone_layer.KSSAndPloneLayer tests:
  Set up plone.app.kss.tests.kss_and_plone_layer.KSSAndPloneLayer in 0.006 seconds.
  Ran 19 tests with 0 failures and 0 errors in 1.555 seconds.
Running zope.testing.testrunner.layer.UnitTests tests:
  Tear down plone.app.kss.tests.kss_and_plone_layer.KSSAndPloneLayer in 0.000 seconds.
  Tear down Products.PloneTestCase.layer.PloneSite in 0.354 seconds.
  Tear down Products.PloneTestCase.layer.ZCML in 0.005 seconds.
  Tear down Testing.ZopeTestCase.layer.ZopeLite in 0.000 seconds.
  Set up zope.testing.testrunner.layer.UnitTests in 0.000 seconds.
/home/stefan/autotest/temp/python26-zope212-cmf22-plone40/eggs/Products.Archetypes-1.6a2-py2.6.egg/Products/Archetypes/ClassGen.py:152: UserWarning: The method 'makeFoo' was already protected by a different permission than the one declared on the field. Assuming that the explicit permission declared is the correct one and has preference over the permission declared on the field.
  self.handle_mode(klass, generator, type, field, mode)
  Ran 28 tests with 0 failures and 0 errors in 0.149 seconds.
Tearing down left over layers:
  Tear down zope.testing.testrunner.layer.UnitTests in 0.000 seconds.
Total: 662 tests, 0 failures, 0 errors in 54.381 seconds.
Running Testing.ZopeTestCase.layer.ZopeLite tests:
  Set up Testing.ZopeTestCase.layer.ZopeLite in 0.055 seconds.
  Ran 170 tests with 0 failures and 0 errors in 0.716 seconds.
Running Products.CMFCore.testing.ExportImportZCMLLayer tests:
  Set up Products.CMFCore.testing.ExportImportZCMLLayer in 0.000 seconds.
  Ran 10 tests with 0 failures and 0 errors in 0.644 seconds.
Running Products.GenericSetup.testing.ExportImportZCMLLayer tests:
  Tear down Products.CMFCore.testing.ExportImportZCMLLayer in 0.000 seconds.
  Set up Products.GenericSetup.testing.ExportImportZCMLLayer in 0.047 seconds.
  Ran 186 tests with 0 failures and 0 errors in 0.688 seconds.
Running zope.testing.testrunner.layer.UnitTests tests:
  Tear down Products.GenericSetup.testing.ExportImportZCMLLayer in 0.000 seconds.
  Tear down Testing.ZopeTestCase.layer.ZopeLite in 0.000 seconds.
  Set up zope.testing.testrunner.layer.UnitTests in 0.000 seconds.
  Ran 166 tests with 0 failures and 0 errors in 0.153 seconds.
Tearing down left over layers:
  Tear down zope.testing.testrunner.layer.UnitTests in 0.000 seconds.
Total: 532 tests, 0 failures, 0 errors in 2.672 seconds.
Running Testing.ZopeTestCase.layer.ZopeLite tests:
  Set up Testing.ZopeTestCase.layer.ZopeLite in 0.897 seconds.
  Ran 27 tests with 0 failures and 0 errors in 0.056 seconds.
Running Products.PloneTestCase.layer.PloneSite tests:
  Set up Products.PloneTestCase.layer.ZCML in 2.434 seconds.
  Set up Products.PloneTestCase.layer.PloneSite in 5.099 seconds.
/home/stefan/autotest/temp/python26-zope212-cmf22-plone40/eggs/Zope2-2.12.1-py2.6-linux-x86_64.egg/OFS/subscribers.py:73: DeprecationWarning: Products.FAQ.FAQ.FAQ.manage_afterAdd is discouraged. You should use event subscribers instead.
  DeprecationWarning)
/home/stefan/autotest/temp/python26-zope212-cmf22-plone40/eggs/Zope2-2.12.1-py2.6-linux-x86_64.egg/OFS/subscribers.py:73: DeprecationWarning: Products.FAQ.FAQQuestion.FAQQuestion.manage_afterAdd is discouraged. You should use event subscribers instead.
  DeprecationWarning)
  Ran 145 tests with 0 failures and 0 errors in 52.182 seconds.
Running Products.CMFDiffTool.tests.BaseTestCase.CMFDiffToolLayer tests:
  Set up Products.CMFDiffTool.tests.BaseTestCase.CMFDiffToolLayer in 0.013 seconds.
  Ran 2 tests with 0 failures and 0 errors in 0.180 seconds.
Running Products.CMFTestCase.layer.CMFSite tests:
  Tear down Products.CMFDiffTool.tests.BaseTestCase.CMFDiffToolLayer in 0.380 seconds.
  Tear down Products.PloneTestCase.layer.PloneSite in 0.006 seconds.
  Tear down Products.PloneTestCase.layer.ZCML in 0.004 seconds.
  Set up Products.CMFTestCase.layer.ZCML in 1.743 seconds.
  Set up Products.CMFTestCase.layer.CMFSite in 1.545 seconds.
  Ran 20 tests with 0 failures and 0 errors in 0.397 seconds.
Running zope.testing.testrunner.layer.UnitTests tests:
  Tear down Products.CMFTestCase.layer.CMFSite in 0.069 seconds.
  Tear down Products.CMFTestCase.layer.ZCML in 0.003 seconds.
  Tear down Testing.ZopeTestCase.layer.ZopeLite in 0.000 seconds.
  Set up zope.testing.testrunner.layer.UnitTests in 0.000 seconds.
  Ran 10 tests with 0 failures and 0 errors in 0.005 seconds.
Tearing down left over layers:
  Tear down zope.testing.testrunner.layer.UnitTests in 0.000 seconds.
Total: 204 tests, 0 failures, 0 errors in 1 minutes 5.999 seconds.
Running Testing.ZopeTestCase.layer.ZopeLite tests:
  Set up Testing.ZopeTestCase.layer.ZopeLite in 0.621 seconds.
  Ran 126 tests with 0 failures and 0 errors in 0.755 seconds.
Running Products.CMFTestCase.layer.CMFSite tests:
  Set up Products.CMFTestCase.layer.ZCML in 2.282 seconds.
  Set up Products.CMFTestCase.layer.CMFSite in 0.233 seconds.
  Ran 53 tests with 0 failures and 0 errors in 2.686 seconds.
Running Products.PloneTestCase.layer.ZCML tests:
  Tear down Products.CMFTestCase.layer.CMFSite in 0.041 seconds.
  Tear down Products.CMFTestCase.layer.ZCML in 0.004 seconds.
  Set up Products.PloneTestCase.layer.ZCML in 1.738 seconds.
  Ran 12 tests with 0 failures and 0 errors in 0.016 seconds.
Running Products.PloneTestCase.layer.PloneSite tests:
  Set up Products.PloneTestCase.layer.PloneSite in 4.253 seconds.


Failure in test test_menu_presence (plone.app.kss.tests.test_kss_attributes.TestContentMenu)
Failed doctest test for plone.app.kss.tests.test_kss_attributes.TestContentMenu.test_menu_presence
  File "/home/stefan/autotest/temp/python26-zope212-cmf22-plone40/src/plone.app.kss/plone/app/kss/tests/test_kss_attributes.py", line 183, in test_menu_presence

----------------------------------------------------------------------
File "/home/stefan/autotest/temp/python26-zope212-cmf22-plone40/src/plone.app.kss/plone/app/kss/tests/test_kss_attributes.py", line 230, in plone.app.kss.tests.test_kss_attributes.TestContentMenu.test_menu_presence
Failed example:
    content_td is not None
Differences (ndiff with -expected +actual):
    - True
    + False
----------------------------------------------------------------------
File "/home/stefan/autotest/temp/python26-zope212-cmf22-plone40/src/plone.app.kss/plone/app/kss/tests/test_kss_attributes.py", line 232, in plone.app.kss.tests.test_kss_attributes.TestContentMenu.test_menu_presence
Failed example:
    content_actions = content_td.find('div', {'class': 'contentActions'})
Exception raised:
    Traceback (most recent call last):
      File "/home/stefan/autotest/temp/python26-zope212-cmf22-plone40/eggs/zope.testing-3.7.7-py2.6.egg/zope/testing/doctest.py", line 1361, in __run
        compileflags, 1) in test.globs
      File "<doctest plone.app.kss.tests.test_kss_attributes.TestContentMenu.test_menu_presence[line 49, example 17]>", line 1, in <module>
        content_actions = content_td.find('div', {'class': 'contentActions'})
    AttributeError: 'NoneType' object has no attribute 'find'
----------------------------------------------------------------------
File "/home/stefan/autotest/temp/python26-zope212-cmf22-plone40/src/plone.app.kss/plone/app/kss/tests/test_kss_attributes.py", line 233, in plone.app.kss.tests.test_kss_attributes.TestContentMenu.test_menu_presence
Failed example:
    content_actions is not None
Exception raised:
    Traceback (most recent call last):
      File "/home/stefan/autotest/temp/python26-zope212-cmf22-plone40/eggs/zope.testing-3.7.7-py2.6.egg/zope/testing/doctest.py", line 1361, in __run
        compileflags, 1) in test.globs
      File "<doctest plone.app.kss.tests.test_kss_attributes.TestContentMenu.test_menu_presence[line 50, example 18]>", line 1, in <module>
        content_actions is not None
    NameError: name 'content_actions' is not defined
----------------------------------------------------------------------
File "/home/stefan/autotest/temp/python26-zope212-cmf22-plone40/src/plone.app.kss/plone/app/kss/tests/test_kss_attributes.py", line 238, in plone.app.kss.tests.test_kss_attributes.TestContentMenu.test_menu_presence
Failed example:
    content_actions_ul = content_actions.find('ul', {'id': 'contentActionMenus'})
Exception raised:
    Traceback (most recent call last):
      File "/home/stefan/autotest/temp/python26-zope212-cmf22-plone40/eggs/zope.testing-3.7.7-py2.6.egg/zope/testing/doctest.py", line 1361, in __run
        compileflags, 1) in test.globs
      File "<doctest plone.app.kss.tests.test_kss_attributes.TestContentMenu.test_menu_presence[line 55, example 19]>", line 1, in <module>
        content_actions_ul = content_actions.find('ul', {'id': 'contentActionMenus'})
    NameError: name 'content_actions' is not defined
----------------------------------------------------------------------
File "/home/stefan/autotest/temp/python26-zope212-cmf22-plone40/src/plone.app.kss/plone/app/kss/tests/test_kss_attributes.py", line 239, in plone.app.kss.tests.test_kss_attributes.TestContentMenu.test_menu_presence
Failed example:
    content_actions_ul is not None
Exception raised:
    Traceback (most recent call last):
      File "/home/stefan/autotest/temp/python26-zope212-cmf22-plone40/eggs/zope.testing-3.7.7-py2.6.egg/zope/testing/doctest.py", line 1361, in __run
        compileflags, 1) in test.globs
      File "<doctest plone.app.kss.tests.test_kss_attributes.TestContentMenu.test_menu_presence[line 56, example 20]>", line 1, in <module>
        content_actions_ul is not None
    NameError: name 'content_actions_ul' is not defined

  Ran 1811 tests with 1 failures and 0 errors in 4 minutes 10.664 seconds.
Running plone.app.contentrules.tests.test_configuration.TestContentrulesGSLayer tests:
  Set up plone.app.contentrules.tests.test_configuration.TestContentrulesGSLayer in 0.002 seconds.
  Ran 6 tests with 0 failures and 0 errors in 3.773 seconds.
Running plone.app.customerize.tests.layer.PloneCustomerize tests:
  Tear down plone.app.contentrules.tests.test_configuration.TestContentrulesGSLayer in 0.000 seconds.
  Set up plone.app.customerize.tests.layer.PloneCustomerize in 0.000 seconds.
  Ran 27 tests with 0 failures and 0 errors in 1 minutes 3.231 seconds.
Running plone.app.kss.tests.kss_and_plone_layer.KSSAndPloneLayer tests:
  Tear down plone.app.customerize.tests.layer.PloneCustomerize in 0.000 seconds.
  Set up plone.app.kss.tests.kss_and_plone_layer.KSSAndPloneLayer in 0.004 seconds.


Error in test testChangeViewTemplate (plone.app.kss.tests.test_menus.ContentActionMenusTestCase)
Traceback (most recent call last):
  File "/usr/local/python2.6/lib/python2.6/unittest.py", line 279, in run
    testMethod()
  File "/home/stefan/autotest/temp/python26-zope212-cmf22-plone40/src/plone.app.kss/plone/app/kss/tests/test_menus.py", line 57, in testChangeViewTemplate
    result = view.changeViewTemplate(url)
  File "<wrapper>", line 5, in wrapper
  File "/home/stefan/autotest/temp/python26-zope212-cmf22-plone40/src/kss.core/kss/core/actionwrapper.py", line 238, in apply
    result = self.f(obj, *arg, **kw)
  File "/home/stefan/autotest/temp/python26-zope212-cmf22-plone40/src/plone.app.kss/plone/app/kss/content_replacer.py", line 239, in changeViewTemplate
    self.getCommandSet('plone').refreshContentMenu()
  File "/home/stefan/autotest/temp/python26-zope212-cmf22-plone40/src/plone.app.kss/plone/app/kss/commands/plonecommands.py", line 92, in refreshContentMenu
    self.getCommandSet('zope').refreshProvider(selector, 'plone.contentmenu')
  File "/home/stefan/autotest/temp/python26-zope212-cmf22-plone40/src/plone.app.kss/plone/app/kss/commands/zopecommands.py", line 17, in refreshProvider
    renderer = provider.__of__(self.context)
AttributeError: 'ContentMenuProvider' object has no attribute '__of__'



Error in test testChangeWorkflowState (plone.app.kss.tests.test_menus.ContentActionMenusTestCase)
Traceback (most recent call last):
  File "/usr/local/python2.6/lib/python2.6/unittest.py", line 279, in run
    testMethod()
  File "/home/stefan/autotest/temp/python26-zope212-cmf22-plone40/src/plone.app.kss/plone/app/kss/tests/test_menus.py", line 118, in testChangeWorkflowState
    result = view.changeWorkflowState(url)
  File "<wrapper>", line 5, in wrapper
  File "/home/stefan/autotest/temp/python26-zope212-cmf22-plone40/src/kss.core/kss/core/actionwrapper.py", line 238, in apply
    result = self.f(obj, *arg, **kw)
  File "/home/stefan/autotest/temp/python26-zope212-cmf22-plone40/src/plone.app.kss/plone/app/kss/content_replacer.py", line 267, in changeWorkflowState
    plonecommands.refreshContentMenu()
  File "/home/stefan/autotest/temp/python26-zope212-cmf22-plone40/src/plone.app.kss/plone/app/kss/commands/plonecommands.py", line 92, in refreshContentMenu
    self.getCommandSet('zope').refreshProvider(selector, 'plone.contentmenu')
  File "/home/stefan/autotest/temp/python26-zope212-cmf22-plone40/src/plone.app.kss/plone/app/kss/commands/zopecommands.py", line 17, in refreshProvider
    renderer = provider.__of__(self.context)
AttributeError: 'ContentMenuProvider' object has no attribute '__of__'



Error in test testCopyObject (plone.app.kss.tests.test_menus.ContentActionMenusTestCase)
Traceback (most recent call last):
  File "/usr/local/python2.6/lib/python2.6/unittest.py", line 279, in run
    testMethod()
  File "/home/stefan/autotest/temp/python26-zope212-cmf22-plone40/src/plone.app.kss/plone/app/kss/tests/test_menus.py", line 107, in testCopyObject
    result = view.copyObject()
  File "<wrapper>", line 5, in wrapper
  File "/home/stefan/autotest/temp/python26-zope212-cmf22-plone40/src/kss.core/kss/core/actionwrapper.py", line 238, in apply
    result = self.f(obj, *arg, **kw)
  File "/home/stefan/autotest/temp/python26-zope212-cmf22-plone40/src/plone.app.kss/plone/app/kss/content_replacer.py", line 190, in copyObject
    self.getCommandSet('plone').refreshContentMenu()
  File "/home/stefan/autotest/temp/python26-zope212-cmf22-plone40/src/plone.app.kss/plone/app/kss/commands/plonecommands.py", line 92, in refreshContentMenu
    self.getCommandSet('zope').refreshProvider(selector, 'plone.contentmenu')
  File "/home/stefan/autotest/temp/python26-zope212-cmf22-plone40/src/plone.app.kss/plone/app/kss/commands/zopecommands.py", line 17, in refreshProvider
    renderer = provider.__of__(self.context)
AttributeError: 'ContentMenuProvider' object has no attribute '__of__'



Error in test testCutObject (plone.app.kss.tests.test_menus.ContentActionMenusTestCase)
Traceback (most recent call last):
  File "/usr/local/python2.6/lib/python2.6/unittest.py", line 279, in run
    testMethod()
  File "/home/stefan/autotest/temp/python26-zope212-cmf22-plone40/src/plone.app.kss/plone/app/kss/tests/test_menus.py", line 83, in testCutObject
    result = view.cutObject()
  File "<wrapper>", line 5, in wrapper
  File "/home/stefan/autotest/temp/python26-zope212-cmf22-plone40/src/kss.core/kss/core/actionwrapper.py", line 238, in apply
    result = self.f(obj, *arg, **kw)
  File "/home/stefan/autotest/temp/python26-zope212-cmf22-plone40/src/plone.app.kss/plone/app/kss/content_replacer.py", line 182, in cutObject
    self.getCommandSet('plone').refreshContentMenu()
  File "/home/stefan/autotest/temp/python26-zope212-cmf22-plone40/src/plone.app.kss/plone/app/kss/commands/plonecommands.py", line 92, in refreshContentMenu
    self.getCommandSet('zope').refreshProvider(selector, 'plone.contentmenu')
  File "/home/stefan/autotest/temp/python26-zope212-cmf22-plone40/src/plone.app.kss/plone/app/kss/commands/zopecommands.py", line 17, in refreshProvider
    renderer = provider.__of__(self.context)
AttributeError: 'ContentMenuProvider' object has no attribute '__of__'



Error in test testKssCopyObject (plone.app.kss.tests.test_menus.ContentActionMenusTestCase)
Traceback (most recent call last):
  File "/usr/local/python2.6/lib/python2.6/unittest.py", line 279, in run
    testMethod()
  File "/home/stefan/autotest/temp/python26-zope212-cmf22-plone40/src/plone.app.kss/plone/app/kss/tests/test_menus.py", line 93, in testKssCopyObject
    result = view.copyObject()
  File "<wrapper>", line 5, in wrapper
  File "/home/stefan/autotest/temp/python26-zope212-cmf22-plone40/src/kss.core/kss/core/actionwrapper.py", line 238, in apply
    result = self.f(obj, *arg, **kw)
  File "/home/stefan/autotest/temp/python26-zope212-cmf22-plone40/src/plone.app.kss/plone/app/kss/content_replacer.py", line 190, in copyObject
    self.getCommandSet('plone').refreshContentMenu()
  File "/home/stefan/autotest/temp/python26-zope212-cmf22-plone40/src/plone.app.kss/plone/app/kss/commands/plonecommands.py", line 92, in refreshContentMenu
    self.getCommandSet('zope').refreshProvider(selector, 'plone.contentmenu')
  File "/home/stefan/autotest/temp/python26-zope212-cmf22-plone40/src/plone.app.kss/plone/app/kss/commands/zopecommands.py", line 17, in refreshProvider
    renderer = provider.__of__(self.context)
AttributeError: 'ContentMenuProvider' object has no attribute '__of__'



Error in test testKssCutObject (plone.app.kss.tests.test_menus.ContentActionMenusTestCase)
Traceback (most recent call last):
  File "/usr/local/python2.6/lib/python2.6/unittest.py", line 279, in run
    testMethod()
  File "/home/stefan/autotest/temp/python26-zope212-cmf22-plone40/src/plone.app.kss/plone/app/kss/tests/test_menus.py", line 68, in testKssCutObject
    result = view.cutObject()
  File "<wrapper>", line 5, in wrapper
  File "/home/stefan/autotest/temp/python26-zope212-cmf22-plone40/src/kss.core/kss/core/actionwrapper.py", line 238, in apply
    result = self.f(obj, *arg, **kw)
  File "/home/stefan/autotest/temp/python26-zope212-cmf22-plone40/src/plone.app.kss/plone/app/kss/content_replacer.py", line 182, in cutObject
    self.getCommandSet('plone').refreshContentMenu()
  File "/home/stefan/autotest/temp/python26-zope212-cmf22-plone40/src/plone.app.kss/plone/app/kss/commands/plonecommands.py", line 92, in refreshContentMenu
    self.getCommandSet('zope').refreshProvider(selector, 'plone.contentmenu')
  File "/home/stefan/autotest/temp/python26-zope212-cmf22-plone40/src/plone.app.kss/plone/app/kss/commands/zopecommands.py", line 17, in refreshProvider
    renderer = provider.__of__(self.context)
AttributeError: 'ContentMenuProvider' object has no attribute '__of__'



Error in test testReplaceContentRegion (plone.app.kss.tests.test_menus.ContentActionMenusTestCase)
Traceback (most recent call last):
  File "/usr/local/python2.6/lib/python2.6/unittest.py", line 279, in run
    testMethod()
  File "/home/stefan/autotest/temp/python26-zope212-cmf22-plone40/src/plone.app.kss/plone/app/kss/tests/test_menus.py", line 43, in testReplaceContentRegion
    result = view.replaceContentRegion(self.fpage.absolute_url(), tabid='contentview-edit')
  File "<wrapper>", line 5, in wrapper
  File "/home/stefan/autotest/temp/python26-zope212-cmf22-plone40/src/kss.core/kss/core/actionwrapper.py", line 238, in apply
    result = self.f(obj, *arg, **kw)
  File "/home/stefan/autotest/temp/python26-zope212-cmf22-plone40/src/plone.app.kss/plone/app/kss/content_replacer.py", line 171, in replaceContentRegion
    self.getCommandSet('plone').refreshContentMenu()
  File "/home/stefan/autotest/temp/python26-zope212-cmf22-plone40/src/plone.app.kss/plone/app/kss/commands/plonecommands.py", line 92, in refreshContentMenu
    self.getCommandSet('zope').refreshProvider(selector, 'plone.contentmenu')
  File "/home/stefan/autotest/temp/python26-zope212-cmf22-plone40/src/plone.app.kss/plone/app/kss/commands/zopecommands.py", line 17, in refreshProvider
    renderer = provider.__of__(self.context)
AttributeError: 'ContentMenuProvider' object has no attribute '__of__'

  Ran 13 tests with 0 failures and 7 errors in 0.879 seconds.
Running plone.app.linkintegrity.tests.layer.PloneLinkintegrity tests:
  Tear down plone.app.kss.tests.kss_and_plone_layer.KSSAndPloneLayer in 0.000 seconds.
  Set up plone.app.linkintegrity.tests.layer.PloneLinkintegrity in 0.451 seconds.
  Ran 117 tests with 0 failures and 0 errors in 27.049 seconds.
Running plone.app.viewletmanager.tests.test_exportimport.Layer tests:
  Tear down plone.app.linkintegrity.tests.layer.PloneLinkintegrity in 0.051 seconds.
  Tear down Products.PloneTestCase.layer.PloneSite in 0.410 seconds.
  Tear down Products.PloneTestCase.layer.ZCML in 0.015 seconds.
  Tear down Testing.ZopeTestCase.layer.ZopeLite in 0.000 seconds.
  Set up plone.app.viewletmanager.tests.test_exportimport.Layer in 0.000 seconds.
  Ran 16 tests with 0 failures and 0 errors in 0.051 seconds.
Running zope.testing.testrunner.layer.UnitTests tests:
  Tear down plone.app.viewletmanager.tests.test_exportimport.Layer in 0.000 seconds.
  Set up zope.testing.testrunner.layer.UnitTests in 0.000 seconds.
  Ran 143 tests with 0 failures and 0 errors in 0.859 seconds.
Tearing down left over layers:
  Tear down zope.testing.testrunner.layer.UnitTests in 0.000 seconds.
Total: 2324 tests, 1 failures, 7 errors in 6 minutes 3.844 seconds.
Running Testing.ZopeTestCase.layer.ZopeLite tests:
  Set up Testing.ZopeTestCase.layer.ZopeLite in 1.384 seconds.
  Ran 165 tests with 0 failures and 0 errors in 0.626 seconds.
Running Products.PloneTestCase.layer.ZCML tests:
  Set up Products.PloneTestCase.layer.ZCML in 2.317 seconds.
  Ran 34 tests with 0 failures and 0 errors in 0.213 seconds.
Running Products.PlonePAS.tests.layer.PlonePASLayer tests:
  Set up Products.PloneTestCase.layer.PloneSite in 3.887 seconds.
  Set up Products.PlonePAS.tests.layer.PlonePASLayer in 0.000 seconds.
  Ran 152 tests with 0 failures and 0 errors in 1.821 seconds.
Running zope.testing.testrunner.layer.UnitTests tests:
  Tear down Products.PlonePAS.tests.layer.PlonePASLayer in 0.000 seconds.
  Tear down Products.PloneTestCase.layer.PloneSite in 0.349 seconds.
  Tear down Products.PloneTestCase.layer.ZCML in 0.004 seconds.
  Tear down Testing.ZopeTestCase.layer.ZopeLite in 0.000 seconds.
  Set up zope.testing.testrunner.layer.UnitTests in 0.000 seconds.
  Ran 371 tests with 0 failures and 0 errors in 1.196 seconds.
Tearing down left over layers:
  Tear down zope.testing.testrunner.layer.UnitTests in 0.000 seconds.
Total: 722 tests, 0 failures, 0 errors in 12.568 seconds.
Running Products.PloneTestCase.layer.PloneSite tests:
  Set up Testing.ZopeTestCase.layer.ZopeLite in 1.339 seconds.
  Set up Products.PloneTestCase.layer.ZCML in 2.357 seconds.
  Set up Products.PloneTestCase.layer.PloneSite in 4.150 seconds.
/home/stefan/autotest/temp/python26-zope212-cmf22-plone40/eggs/borg.localrole-3.0a1-py2.6.egg/borg/localrole/bbb/bbb.txt:1: DeprecationWarning: IWorkspace is deprecated. Please use borg.localrole.interfaces.ILocalRoleProvider instead
  =========
/home/stefan/autotest/temp/python26-zope212-cmf22-plone40/eggs/borg.localrole-3.0a1-py2.6.egg/borg/localrole/bbb/bbb.txt:1: DeprecationWarning: IGroupAwareWorkspace is deprecated. Please use borg.localrole.interfaces.ILocalRoleProvider instead
  =========
  Ran 36 tests with 0 failures and 0 errors in 0.132 seconds.
Running plone.browserlayer.tests.test_doctest.PloneBrowserLayerLayer tests:
  Set up plone.browserlayer.tests.test_doctest.PloneBrowserLayerLayer in 0.003 seconds.
  Ran 9 tests with 0 failures and 0 errors in 0.973 seconds.
Running plone.theme.tests.test_doctest.PloneThemeLayer tests:
  Tear down plone.browserlayer.tests.test_doctest.PloneBrowserLayerLayer in 0.000 seconds.
  Set up plone.theme.tests.test_doctest.PloneThemeLayer in 0.003 seconds.
  Ran 5 tests with 0 failures and 0 errors in 0.053 seconds.
Running zope.testing.testrunner.layer.UnitTests tests:
  Tear down plone.theme.tests.test_doctest.PloneThemeLayer in 0.000 seconds.
  Tear down Products.PloneTestCase.layer.PloneSite in 0.362 seconds.
  Tear down Products.PloneTestCase.layer.ZCML in 0.004 seconds.
  Tear down Testing.ZopeTestCase.layer.ZopeLite in 0.000 seconds.
  Set up zope.testing.testrunner.layer.UnitTests in 0.000 seconds.
/usr/local/python2.6/lib/python2.6/mhlib.py:83: DeprecationWarning: the multifile module has been deprecated since Python 2.5
  import multifile


Failure in test /home/stefan/autotest/temp/python26-zope212-cmf22-plone40/eggs/z3c.autoinclude-0.3.1-py2.6.egg/z3c/autoinclude/tests/../dependency.txt
Traceback (most recent call last):
  File "/usr/local/python2.6/lib/python2.6/unittest.py", line 279, in run
    testMethod()
  File "/usr/local/python2.6/lib/python2.6/doctest.py", line 2145, in runTest
    raise self.failureException(self.format_failure(new.getvalue()))
AssertionError: Failed doctest test for dependency.txt
  File "/home/stefan/autotest/temp/python26-zope212-cmf22-plone40/eggs/z3c.autoinclude-0.3.1-py2.6.egg/z3c/autoinclude/tests/../dependency.txt", line 0

----------------------------------------------------------------------
File "/home/stefan/autotest/temp/python26-zope212-cmf22-plone40/eggs/z3c.autoinclude-0.3.1-py2.6.egg/z3c/autoinclude/tests/../dependency.txt", line 102, in dependency.txt
Failed example:
    sibling_include_finder.dottedNames()
Expected:
    ['F.G', 'F.H']
Got:
    ['F.H', 'F.G']
----------------------------------------------------------------------
File "/home/stefan/autotest/temp/python26-zope212-cmf22-plone40/eggs/z3c.autoinclude-0.3.1-py2.6.egg/z3c/autoinclude/tests/../dependency.txt", line 108, in dependency.txt
Failed example:
    pprint(b_include_finder.includableInfo(['configure.zcml',
                                            'meta.zcml']))
Expected:
    {'configure.zcml': ['F.H'], 'meta.zcml': ['testdirective', 'F.G', 'F.H']}
Got:
    {'configure.zcml': ['F.H'], 'meta.zcml': ['testdirective', 'F.H', 'F.G']}
----------------------------------------------------------------------
File "/home/stefan/autotest/temp/python26-zope212-cmf22-plone40/eggs/z3c.autoinclude-0.3.1-py2.6.egg/z3c/autoinclude/tests/../dependency.txt", line 142, in dependency.txt
Failed example:
    pprint(package_includes('BCPackage'))
Expected:
    {'configure.zcml': ['F.H'],
     'meta.zcml': ['testdirective', 'F.G', 'F.H'],
     'overrides.zcml': []}
Got:
    {'configure.zcml': ['F.H'],
     'meta.zcml': ['testdirective', 'F.H', 'F.G'],
     'overrides.zcml': []}


  Ran 262 tests with 1 failures and 0 errors in 14.726 seconds.
Tearing down left over layers:
  Tear down zope.testing.testrunner.layer.UnitTests in 0.000 seconds.
Total: 312 tests, 1 failures, 0 errors in 25.020 seconds.
Running Products.PloneTestCase.layer.PloneSite tests:
  Set up Testing.ZopeTestCase.layer.ZopeLite in 0.867 seconds.
  Set up Products.PloneTestCase.layer.ZCML in 2.306 seconds.
  Set up Products.PloneTestCase.layer.PloneSite in 4.190 seconds.
/usr/local/python2.6/lib/python2.6/unittest.py:279: DeprecationWarning: The use of 'hide' has been deprecated and will be removed in plone.portlet.static 2.0. Instead, use the new generic built-in show/hide setting of plone.portlets.
  testMethod()
  Ran 169 tests with 0 failures and 0 errors in 14.550 seconds.
Running plone.app.portlets.tests.test_configuration.TestPortletZCMLLayer tests:
  Set up plone.app.portlets.tests.test_configuration.TestPortletZCMLLayer in 0.006 seconds.
  Ran 5 tests with 0 failures and 0 errors in 0.038 seconds.
Running plone.app.portlets.tests.test_configuration.TestPortletGSLayer tests:
  Set up plone.app.portlets.tests.test_configuration.TestPortletGSLayer in 1.569 seconds.
  Ran 12 tests with 0 failures and 0 errors in 4.143 seconds.
Running zope.testing.testrunner.layer.UnitTests tests:
  Tear down plone.app.portlets.tests.test_configuration.TestPortletGSLayer in 0.000 seconds.
  Tear down plone.app.portlets.tests.test_configuration.TestPortletZCMLLayer in 0.000 seconds.
  Tear down Products.PloneTestCase.layer.PloneSite in 0.358 seconds.
  Tear down Products.PloneTestCase.layer.ZCML in 0.004 seconds.
  Tear down Testing.ZopeTestCase.layer.ZopeLite in 0.000 seconds.
  Set up zope.testing.testrunner.layer.UnitTests in 0.000 seconds.
  Ran 54 tests with 0 failures and 0 errors in 0.147 seconds.
Tearing down left over layers:
  Tear down zope.testing.testrunner.layer.UnitTests in 0.000 seconds.
Total: 240 tests, 0 failures, 0 errors in 29.025 seconds.
Running Products.PloneTestCase.layer.PloneSite tests:
  Set up Testing.ZopeTestCase.layer.ZopeLite in 0.000 seconds.
  Set up Products.PloneTestCase.layer.ZCML in 1.828 seconds.
  Set up Products.PloneTestCase.layer.PloneSite in 5.397 seconds.
  Ran 23 tests with 0 failures and 0 errors in 3.515 seconds.
Running Products.CMFPlacefulWorkflow.tests.test_exportimport.ExportImportLayer tests:
  Set up Products.CMFPlacefulWorkflow.tests.test_exportimport.ExportImportLayer in 0.001 seconds.
  Ran 12 tests with 0 failures and 0 errors in 0.918 seconds.
Tearing down left over layers:
  Tear down Products.CMFPlacefulWorkflow.tests.test_exportimport.ExportImportLayer in 0.000 seconds.
  Tear down Products.PloneTestCase.layer.PloneSite in 0.363 seconds.
  Tear down Products.PloneTestCase.layer.ZCML in 0.004 seconds.
  Tear down Testing.ZopeTestCase.layer.ZopeLite in 0.000 seconds.
Total: 35 tests, 0 failures, 0 errors in 12.464 seconds.
Running Products.CMFTestCase.layer.CMFSite tests:
  Set up Testing.ZopeTestCase.layer.ZopeLite in 0.202 seconds.
  Set up Products.CMFTestCase.layer.ZCML in 0.366 seconds.
  Set up Products.CMFTestCase.layer.CMFSite in 0.207 seconds.
  Ran 58 tests with 0 failures and 0 errors in 0.227 seconds.
Tearing down left over layers:
  Tear down Products.CMFTestCase.layer.CMFSite in 0.027 seconds.
  Tear down Products.CMFTestCase.layer.ZCML in 0.001 seconds.
  Tear down Testing.ZopeTestCase.layer.ZopeLite in 0.000 seconds.
Running zope.testing.testrunner.layer.UnitTests tests:
  Set up zope.testing.testrunner.layer.UnitTests in 0.000 seconds.
  Ran 35 tests with 0 failures and 0 errors in 0.028 seconds.
Tearing down left over layers:
  Tear down zope.testing.testrunner.layer.UnitTests in 0.000 seconds.
Running Products.PloneTestCase.layer.PloneSite tests:
  Set up Testing.ZopeTestCase.layer.ZopeLite in 1.364 seconds.
  Set up Products.PloneTestCase.layer.ZCML in 2.421 seconds.
  Set up Products.PloneTestCase.layer.PloneSite in 4.125 seconds.
  Ran 39 tests with 0 failures and 0 errors in 4.133 seconds.
Tearing down left over layers:
  Tear down Products.PloneTestCase.layer.PloneSite in 0.367 seconds.
  Tear down Products.PloneTestCase.layer.ZCML in 0.006 seconds.
  Tear down Testing.ZopeTestCase.layer.ZopeLite in 0.000 seconds.
Running Products.PloneTestCase.layer.PloneSite tests:
  Set up Testing.ZopeTestCase.layer.ZopeLite in 1.379 seconds.
  Set up Products.PloneTestCase.layer.ZCML in 2.396 seconds.
  Set up Products.PloneTestCase.layer.PloneSite in 4.086 seconds.
/home/stefan/autotest/temp/python26-zope212-cmf22-plone40/eggs/Products.PlonePAS-4.0a1-py2.6.egg/Products/PlonePAS/tools/membership.py:554: DeprecationWarning: credentialsChanged should be called with 'REQUEST' as second argument. The BBB code will be removed in CMF 2.3.
  self.credentialsChanged(password, REQUEST=REQUEST)
  Ran 61 tests with 0 failures and 0 errors in 1.115 seconds.
Tearing down left over layers:
  Tear down Products.PloneTestCase.layer.PloneSite in 0.369 seconds.
  Tear down Products.PloneTestCase.layer.ZCML in 0.004 seconds.
  Tear down Testing.ZopeTestCase.layer.ZopeLite in 0.000 seconds.
Running Products.PloneTestCase.layer.PloneSite tests:
  Set up Testing.ZopeTestCase.layer.ZopeLite in 1.382 seconds.
  Set up Products.PloneTestCase.layer.ZCML in 2.375 seconds.
  Set up Products.PloneTestCase.layer.PloneSite in 4.173 seconds.
  Ran 239 tests with 0 failures and 0 errors in 17.823 seconds.
Running zope.testing.testrunner.layer.UnitTests tests:
  Tear down Products.PloneTestCase.layer.PloneSite in 0.368 seconds.
  Tear down Products.PloneTestCase.layer.ZCML in 0.005 seconds.
  Tear down Testing.ZopeTestCase.layer.ZopeLite in 0.000 seconds.
  Set up zope.testing.testrunner.layer.UnitTests in 0.000 seconds.
  Ran 59 tests with 0 failures and 0 errors in 0.013 seconds.
Tearing down left over layers:
  Tear down zope.testing.testrunner.layer.UnitTests in 0.000 seconds.
Total: 298 tests, 0 failures, 0 errors in 26.565 seconds.
Running Products.PloneTestCase.layer.PloneSite tests:
  Set up Testing.ZopeTestCase.layer.ZopeLite in 1.348 seconds.
  Set up Products.PloneTestCase.layer.ZCML in 2.388 seconds.
  Set up Products.PloneTestCase.layer.PloneSite in 4.083 seconds.
  Ran 76 tests with 0 failures and 0 errors in 2.953 seconds.
Tearing down left over layers:
  Tear down Products.PloneTestCase.layer.PloneSite in 0.365 seconds.
  Tear down Products.PloneTestCase.layer.ZCML in 0.006 seconds.
  Tear down Testing.ZopeTestCase.layer.ZopeLite in 0.000 seconds.
Running zope.testing.testrunner.layer.UnitTests tests:
  Set up zope.testing.testrunner.layer.UnitTests in 0.000 seconds.
  Ran 76 tests with 0 failures and 0 errors in 1.528 seconds.
Tearing down left over layers:
  Tear down zope.testing.testrunner.layer.UnitTests in 0.000 seconds.
Running Products.contentmigration.tests.layer.TestLayer tests:
  Set up Testing.ZopeTestCase.layer.ZopeLite in 1.337 seconds.
  Set up Products.PloneTestCase.layer.ZCML in 2.365 seconds.
  Set up Products.PloneTestCase.layer.PloneSite in 4.090 seconds.
  Set up Products.contentmigration.tests.layer.TestLayer in 0.002 seconds.
  Ran 18 tests with 0 failures and 0 errors in 5.018 seconds.
Tearing down left over layers:
  Tear down Products.contentmigration.tests.layer.TestLayer in 0.000 seconds.
  Tear down Products.PloneTestCase.layer.PloneSite in 0.362 seconds.
  Tear down Products.PloneTestCase.layer.ZCML in 0.004 seconds.
  Tear down Testing.ZopeTestCase.layer.ZopeLite in 0.000 seconds.
Total: 0 tests, 0 failures, 0 errors in 0.000 seconds.
/home/stefan/autotest/temp/python26-zope212-cmf22-plone40/eggs/Products.i18ntestcase-1.2-py2.6.egg/Products/i18ntestcase/PotTestCase.py:13: DeprecationWarning: The popen2 module is deprecated.  Use the subprocess module.
  from popen2 import popen4
/home/stefan/autotest/temp/python26-zope212-cmf22-plone40/src/Products.kupu/Products/kupu/plone/tests/TestContent.py:4: DeprecationWarning: Products.ATReferenceBrowserWidget.ATReferenceBrowserWidget has moved to archetypes.referencebrowserwidget.widget. Import of Products.ATReferenceBrowserWidget.ATReferenceBrowserWidget will become unsupported in Plone 5.0
  from Products.ATReferenceBrowserWidget.ATReferenceBrowserWidget import ReferenceBrowserWidget
Running Testing.ZopeTestCase.layer.ZopeLite tests:
  Set up Testing.ZopeTestCase.layer.ZopeLite in 0.842 seconds.
  Ran 3 tests with 0 failures and 0 errors in 0.008 seconds.
Running Products.PloneTestCase.layer.PloneSite tests:
  Set up Products.PloneTestCase.layer.ZCML in 2.406 seconds.
  Set up Products.PloneTestCase.layer.PloneSite/home/stefan/autotest/temp/python26-zope212-cmf22-plone40/src/Products.kupu/Products/kupu/plone/util.py:25: DeprecationWarning: minimalpath() is deprecated and will be removed in CMF 2.3.
  kupu_plone_skin_dir = minimalpath(os.path.join(kupu_package_dir, relpath))
/home/stefan/autotest/temp/python26-zope212-cmf22-plone40/src/Products.kupu/Products/kupu/plone/util.py:26: DeprecationWarning: createDirectoryView() called with deprecated reg_key format. Support for old key formats will be removed in CMF 2.3. Please use the new key format <product>:<subdir> instead.
  createDirectoryView(skinstool, kupu_plone_skin_dir, name)
<string>:213: DeprecationWarning: changeSkin should be called with 'REQUEST' as second argument. The BBB code will be removed in CMF 2.3.
 in 4.501 seconds.


Failure in test testSame (Products.kupu.plone.tests.test_html2captioned.TransformTestSubclass)
Traceback (most recent call last):
  File "/usr/local/python2.6/lib/python2.6/unittest.py", line 279, in run
    testMethod()
  File "/home/stefan/autotest/temp/python26-zope212-cmf22-plone40/src/Products.kupu/Products/kupu/plone/tests/test_html2captioned.py", line 78, in testSame
    self.do_convert(filename=self.input)
  File "/home/stefan/autotest/temp/python26-zope212-cmf22-plone40/src/Products.kupu/Products/kupu/plone/tests/test_html2captioned.py", line 71, in do_convert
    got, expected, self.transform.name(), self.input))
  File "/usr/local/python2.6/lib/python2.6/unittest.py", line 350, in failUnlessEqual
    (msg or '%r != %r' % (first, second))
AssertionError: Got:
[<div>Simple text containing an embedded image</div><dl class="image-left captioned"><dt><img src="http://nohost/plone/folder/gamma/image" alt="Kupu Test Image" title="Kupu Test Image" height="331" width="500" /></dt><dd class="image-caption" style="width:500px">Test image caption</dd></dl><dl class="image-left captioned"><dt><img src="http://nohost/plone/folder/gamma/image_thumb" alt="Kupu Test Image" title="Kupu Test Image" height="84" width="128" /></dt><dd class="image-caption" style="width:500px">Test image caption</dd></dl><dl class="image-left captioned"><dt><img src="http://nohost/plone/folder/gamma/image" alt="Kupu Test Image" title="Kupu Test Image" height="331" width="500" /></dt><dd class="image-caption" style="width:500px">Test image caption</dd></dl>]

!=

Expected:
[<div>Simple text containing an embedded image</div><dl class="image-left captioned"><dt><img src="http://nohost/plone/folder/gamma/image" alt="Kupu Test Image" title="Kupu Test Image" height="331" width="500" /></dt><dd class="image-caption" style="width:500px">Test image caption</dd></dl><dl class="image-left captioned"><dt><a rel="lightbox" href="/plone/folder/gamma"><img src="http://nohost/plone/folder/gamma/image_thumb" alt="Kupu Test Image" title="Kupu Test Image" height="84" width="128" /></a></dt><dd class="image-caption" style="width:128px">Test image caption</dd></dl><dl class="image-left captioned"><dt><img src="http://nohost/plone/folder/gamma/image" alt="Kupu Test Image" title="Kupu Test Image" height="331" width="500" /></dt><dd class="image-caption" style="width:500px">Test image caption</dd></dl>]

IN html_to_captioned(/home/stefan/autotest/temp/python26-zope212-cmf22-plone40/src/Products.kupu/Products/kupu/plone/tests/input/simple.in)



Failure in test testSameNoFilename (Products.kupu.plone.tests.test_html2captioned.TransformTestSubclass)
Traceback (most recent call last):
  File "/usr/local/python2.6/lib/python2.6/unittest.py", line 279, in run
    testMethod()
  File "/home/stefan/autotest/temp/python26-zope212-cmf22-plone40/src/Products.kupu/Products/kupu/plone/tests/test_html2captioned.py", line 82, in testSameNoFilename
    self.do_convert()
  File "/home/stefan/autotest/temp/python26-zope212-cmf22-plone40/src/Products.kupu/Products/kupu/plone/tests/test_html2captioned.py", line 71, in do_convert
    got, expected, self.transform.name(), self.input))
  File "/usr/local/python2.6/lib/python2.6/unittest.py", line 350, in failUnlessEqual
    (msg or '%r != %r' % (first, second))
AssertionError: Got:
[<div>Simple text containing an embedded image</div><dl class="image-left captioned"><dt><img src="http://nohost/plone/folder/gamma/image" alt="Kupu Test Image" title="Kupu Test Image" height="331" width="500" /></dt><dd class="image-caption" style="width:500px">Test image caption</dd></dl><dl class="image-left captioned"><dt><img src="http://nohost/plone/folder/gamma/image_thumb" alt="Kupu Test Image" title="Kupu Test Image" height="84" width="128" /></dt><dd class="image-caption" style="width:500px">Test image caption</dd></dl><dl class="image-left captioned"><dt><img src="http://nohost/plone/folder/gamma/image" alt="Kupu Test Image" title="Kupu Test Image" height="331" width="500" /></dt><dd class="image-caption" style="width:500px">Test image caption</dd></dl>]

!=

Expected:
[<div>Simple text containing an embedded image</div><dl class="image-left captioned"><dt><img src="http://nohost/plone/folder/gamma/image" alt="Kupu Test Image" title="Kupu Test Image" height="331" width="500" /></dt><dd class="image-caption" style="width:500px">Test image caption</dd></dl><dl class="image-left captioned"><dt><a rel="lightbox" href="/plone/folder/gamma"><img src="http://nohost/plone/folder/gamma/image_thumb" alt="Kupu Test Image" title="Kupu Test Image" height="84" width="128" /></a></dt><dd class="image-caption" style="width:128px">Test image caption</dd></dl><dl class="image-left captioned"><dt><img src="http://nohost/plone/folder/gamma/image" alt="Kupu Test Image" title="Kupu Test Image" height="331" width="500" /></dt><dd class="image-caption" style="width:500px">Test image caption</dd></dl>]

IN html_to_captioned(/home/stefan/autotest/temp/python26-zope212-cmf22-plone40/src/Products.kupu/Products/kupu/plone/tests/input/simple.in)



Failure in test testSame (Products.kupu.plone.tests.test_html2captioned.TransformTestSubclass)
Traceback (most recent call last):
  File "/usr/local/python2.6/lib/python2.6/unittest.py", line 279, in run
    testMethod()
  File "/home/stefan/autotest/temp/python26-zope212-cmf22-plone40/src/Products.kupu/Products/kupu/plone/tests/test_html2captioned.py", line 78, in testSame
    self.do_convert(filename=self.input)
  File "/home/stefan/autotest/temp/python26-zope212-cmf22-plone40/src/Products.kupu/Products/kupu/plone/tests/test_html2captioned.py", line 71, in do_convert
    got, expected, self.transform.name(), self.input))
  File "/usr/local/python2.6/lib/python2.6/unittest.py", line 350, in failUnlessEqual
    (msg or '%r != %r' % (first, second))
AssertionError: Got:
[<div>Simple text containing an embedded image</div><dl class="image-left captioned"><dt><img src="http://nohost/plone/folder/umlauts/image" alt="Kupu Test Image åäö" title="Kupu Test Image åäö" height="331" width="500" /></dt><dd class="image-caption" style="width:500px">Test image caption åäö</dd></dl><dl class="image-left captioned"><dt><img src="http://nohost/plone/folder/umlauts/image_thumb" alt="Kupu Test Image åäö" title="Kupu Test Image åäö" height="84" width="128" /></dt><dd class="image-caption" style="width:500px">Test image caption åäö</dd></dl><dl class="image-left captioned"><dt><img src="http://nohost/plone/folder/umlauts/image" alt="Kupu Test Image åäö" title="Kupu Test Image åäö" height="331" width="500" /></dt><dd class="image-caption" style="width:500px">Test image caption åäö</dd></dl>]

!=

Expected:
[<div>Simple text containing an embedded image</div><dl class="image-left captioned"><dt><img src="http://nohost/plone/folder/umlauts/image" alt="Kupu Test Image åäö" title="Kupu Test Image åäö" height="331" width="500" /></dt><dd class="image-caption" style="width:500px">Test image caption åäö</dd></dl><dl class="image-left captioned"><dt><a rel="lightbox" href="/plone/folder/umlauts"><img src="http://nohost/plone/folder/umlauts/image_thumb" alt="Kupu Test Image åäö" title="Kupu Test Image åäö" height="84" width="128" /></a></dt><dd class="image-caption" style="width:128px">Test image caption åäö</dd></dl><dl class="image-left captioned"><dt><img src="http://nohost/plone/folder/umlauts/image" alt="Kupu Test Image åäö" title="Kupu Test Image åäö" height="331" width="500" /></dt><dd class="image-caption" style="width:500px">Test image caption åäö</dd></dl>]

IN html_to_captioned(/home/stefan/autotest/temp/python26-zope212-cmf22-plone40/src/Products.kupu/Products/kupu/plone/tests/input/umlauts.in)



Failure in test testSameNoFilename (Products.kupu.plone.tests.test_html2captioned.TransformTestSubclass)
Traceback (most recent call last):
  File "/usr/local/python2.6/lib/python2.6/unittest.py", line 279, in run
    testMethod()
  File "/home/stefan/autotest/temp/python26-zope212-cmf22-plone40/src/Products.kupu/Products/kupu/plone/tests/test_html2captioned.py", line 82, in testSameNoFilename
    self.do_convert()
  File "/home/stefan/autotest/temp/python26-zope212-cmf22-plone40/src/Products.kupu/Products/kupu/plone/tests/test_html2captioned.py", line 71, in do_convert
    got, expected, self.transform.name(), self.input))
  File "/usr/local/python2.6/lib/python2.6/unittest.py", line 350, in failUnlessEqual
    (msg or '%r != %r' % (first, second))
AssertionError: Got:
[<div>Simple text containing an embedded image</div><dl class="image-left captioned"><dt><img src="http://nohost/plone/folder/umlauts/image" alt="Kupu Test Image åäö" title="Kupu Test Image åäö" height="331" width="500" /></dt><dd class="image-caption" style="width:500px">Test image caption åäö</dd></dl><dl class="image-left captioned"><dt><img src="http://nohost/plone/folder/umlauts/image_thumb" alt="Kupu Test Image åäö" title="Kupu Test Image åäö" height="84" width="128" /></dt><dd class="image-caption" style="width:500px">Test image caption åäö</dd></dl><dl class="image-left captioned"><dt><img src="http://nohost/plone/folder/umlauts/image" alt="Kupu Test Image åäö" title="Kupu Test Image åäö" height="331" width="500" /></dt><dd class="image-caption" style="width:500px">Test image caption åäö</dd></dl>]

!=

Expected:
[<div>Simple text containing an embedded image</div><dl class="image-left captioned"><dt><img src="http://nohost/plone/folder/umlauts/image" alt="Kupu Test Image åäö" title="Kupu Test Image åäö" height="331" width="500" /></dt><dd class="image-caption" style="width:500px">Test image caption åäö</dd></dl><dl class="image-left captioned"><dt><a rel="lightbox" href="/plone/folder/umlauts"><img src="http://nohost/plone/folder/umlauts/image_thumb" alt="Kupu Test Image åäö" title="Kupu Test Image åäö" height="84" width="128" /></a></dt><dd class="image-caption" style="width:128px">Test image caption åäö</dd></dl><dl class="image-left captioned"><dt><img src="http://nohost/plone/folder/umlauts/image" alt="Kupu Test Image åäö" title="Kupu Test Image åäö" height="331" width="500" /></dt><dd class="image-caption" style="width:500px">Test image caption åäö</dd></dl>]

IN html_to_captioned(/home/stefan/autotest/temp/python26-zope212-cmf22-plone40/src/Products.kupu/Products/kupu/plone/tests/input/umlauts.in)



Error in test test_delete (Products.kupu.plone.tests.test_librarymanager.TestILibraryManager)
Traceback (most recent call last):
  File "/usr/local/python2.6/lib/python2.6/unittest.py", line 279, in run
    testMethod()
  File "/home/stefan/autotest/temp/python26-zope212-cmf22-plone40/src/Products.kupu/Products/kupu/plone/tests/test_librarymanager.py", line 102, in test_delete
    self.assertEqual(libs.getLibraries(self.context), expected)
  File "/home/stefan/autotest/temp/python26-zope212-cmf22-plone40/src/Products.kupu/Products/kupu/plone/librarytool.py", line 85, in getLibraries
    lib[key] = self.translate(lib[key], domain='kupu')
AttributeError: translate



Error in test test_expressions (Products.kupu.plone.tests.test_librarymanager.TestILibraryManager)
Traceback (most recent call last):
  File "/usr/local/python2.6/lib/python2.6/unittest.py", line 279, in run
    testMethod()
  File "/home/stefan/autotest/temp/python26-zope212-cmf22-plone40/src/Products.kupu/Products/kupu/plone/tests/test_librarymanager.py", line 90, in test_expressions
    v = libs.getLibraries(context)
  File "/home/stefan/autotest/temp/python26-zope212-cmf22-plone40/src/Products.kupu/Products/kupu/plone/librarytool.py", line 85, in getLibraries
    lib[key] = self.translate(lib[key], domain='kupu')
AttributeError: translate



Error in test test_get_library (Products.kupu.plone.tests.test_librarymanager.TestILibraryManager)
Traceback (most recent call last):
  File "/usr/local/python2.6/lib/python2.6/unittest.py", line 279, in run
    testMethod()
  File "/home/stefan/autotest/temp/python26-zope212-cmf22-plone40/src/Products.kupu/Products/kupu/plone/tests/test_librarymanager.py", line 67, in test_get_library
    self.assertEqual(libs.getLibraries(self.context), expected)
  File "/home/stefan/autotest/temp/python26-zope212-cmf22-plone40/src/Products.kupu/Products/kupu/plone/librarytool.py", line 85, in getLibraries
    lib[key] = self.translate(lib[key], domain='kupu')
AttributeError: translate



Error in test test_move (Products.kupu.plone.tests.test_librarymanager.TestILibraryManager)
Traceback (most recent call last):
  File "/usr/local/python2.6/lib/python2.6/unittest.py", line 279, in run
    testMethod()
  File "/home/stefan/autotest/temp/python26-zope212-cmf22-plone40/src/Products.kupu/Products/kupu/plone/tests/test_librarymanager.py", line 143, in test_move
    self.assertEqual(libs.getLibraries(self.context), expected)
  File "/home/stefan/autotest/temp/python26-zope212-cmf22-plone40/src/Products.kupu/Products/kupu/plone/librarytool.py", line 85, in getLibraries
    lib[key] = self.translate(lib[key], domain='kupu')
AttributeError: translate



Error in test test_update (Products.kupu.plone.tests.test_librarymanager.TestILibraryManager)
Traceback (most recent call last):
  File "/usr/local/python2.6/lib/python2.6/unittest.py", line 279, in run
    testMethod()
  File "/home/stefan/autotest/temp/python26-zope212-cmf22-plone40/src/Products.kupu/Products/kupu/plone/tests/test_librarymanager.py", line 130, in test_update
    self.assertEqual(libs.getLibraries(context), expected)
  File "/home/stefan/autotest/temp/python26-zope212-cmf22-plone40/src/Products.kupu/Products/kupu/plone/librarytool.py", line 85, in getLibraries
    lib[key] = self.translate(lib[key], domain='kupu')
AttributeError: translate

  Ran 373 tests with 4 failures and 5 errors in 14.705 seconds.
Running zope.testing.testrunner.layer.UnitTests tests:
  Tear down Products.PloneTestCase.layer.PloneSite in 0.385 seconds.
  Tear down Products.PloneTestCase.layer.ZCML in 0.004 seconds.
  Tear down Testing.ZopeTestCase.layer.ZopeLite in 0.000 seconds.
  Set up zope.testing.testrunner.layer.UnitTests in 0.000 seconds.
  Ran 8 tests with 0 failures and 0 errors in 0.001 seconds.
Tearing down left over layers:
  Tear down zope.testing.testrunner.layer.UnitTests in 0.000 seconds.
Total: 384 tests, 4 failures, 5 errors in 23.381 seconds.
Running archetypes.referencebrowserwidget.tests.base.layer tests:
  Set up Testing.ZopeTestCase.layer.ZopeLite in 0.000 seconds.
  Set up Products.PloneTestCase.layer.ZCML in 1.830 seconds.
  Set up Products.PloneTestCase.layer.PloneSite in 4.694 seconds.
  Set up archetypes.referencebrowserwidget.tests.base.layer in 0.000 seconds.
  Ran 43 tests with 0 failures and 0 errors in 7.811 seconds.
Running zope.testing.testrunner.layer.UnitTests tests:
  Tear down archetypes.referencebrowserwidget.tests.base.layer in 0.000 seconds.
  Tear down Products.PloneTestCase.layer.PloneSite in 0.366 seconds.
  Tear down Products.PloneTestCase.layer.ZCML in 0.007 seconds.
  Tear down Testing.ZopeTestCase.layer.ZopeLite in 0.000 seconds.
  Set up zope.testing.testrunner.layer.UnitTests in 0.000 seconds.
  Ran 4 tests with 0 failures and 0 errors in 0.001 seconds.
Tearing down left over layers:
  Tear down zope.testing.testrunner.layer.UnitTests in 0.000 seconds.
Total: 47 tests, 0 failures, 0 errors in 15.197 seconds.
Running archetypes.schemaextender.tests.testIntegration.layer tests:
  Set up Testing.ZopeTestCase.layer.ZopeLite in 1.265 seconds.
  Set up Products.PloneTestCase.layer.ZCML in 2.369 seconds.
  Set up Products.PloneTestCase.layer.PloneSite in 4.053 seconds.
  Set up archetypes.schemaextender.tests.testIntegration.layer in 0.000 seconds.
  Ran 17 tests with 0 failures and 0 errors in 3.070 seconds.
Running zope.testing.testrunner.layer.UnitTests tests:
  Tear down archetypes.schemaextender.tests.testIntegration.layer in 0.000 seconds.
  Tear down Products.PloneTestCase.layer.PloneSite in 0.364 seconds.
  Tear down Products.PloneTestCase.layer.ZCML in 0.007 seconds.
  Tear down Testing.ZopeTestCase.layer.ZopeLite in 0.000 seconds.
  Set up zope.testing.testrunner.layer.UnitTests in 0.000 seconds.
  Ran 19 tests with 0 failures and 0 errors in 0.007 seconds.
Tearing down left over layers:
  Tear down zope.testing.testrunner.layer.UnitTests in 0.000 seconds.
Total: 36 tests, 0 failures, 0 errors in 11.561 seconds.
Running zope.testing.testrunner.layer.UnitTests tests:
  Set up zope.testing.testrunner.layer.UnitTests in 0.000 seconds.
  Ran 4 tests with 0 failures and 0 errors in 0.039 seconds.
Tearing down left over layers:
  Tear down zope.testing.testrunner.layer.UnitTests in 0.000 seconds.
Running Testing.ZopeTestCase.layer.ZopeLite tests:
  Set up Testing.ZopeTestCase.layer.ZopeLite in 0.036 seconds.
  Ran 40 tests with 0 failures and 0 errors in 0.756 seconds.
Tearing down left over layers:
  Tear down Testing.ZopeTestCase.layer.ZopeLite in 0.000 seconds.
/home/stefan/autotest/temp/python26-zope212-cmf22-plone40/src/kss.core/kss/core/tests/test_kssview_core.py:165: UserWarning: The test_class you are using doesn't subclass from ZopeTestCase.Functional. Please fix that.
  tearDown=KSSViewTestCase.beforeTearDown.im_func))
Running Testing.ZopeTestCase.layer.ZopeLite tests:
  Set up Testing.ZopeTestCase.layer.ZopeLite in 0.046 seconds.
  Ran 1 tests with 0 failures and 0 errors in 0.259 seconds.
Running kss.core.tests.base.KSSLayer tests:
  Tear down Testing.ZopeTestCase.layer.ZopeLite in 0.000 seconds.
  Set up kss.core.tests.base.KSSCoreLayer in 0.030 seconds.
  Set up kss.core.tests.base.KSSLayer in 0.056 seconds.
  Ran 29 tests with 0 failures and 0 errors in 0.154 seconds.
Running kss.core.tests.test_ttwapi.layer tests:
  Set up kss.core.tests.test_ttwapi.layer in 0.001 seconds.
  Ran 3 tests with 0 failures and 0 errors in 0.026 seconds.
Running zope.testing.testrunner.layer.UnitTests tests:
  Tear down kss.core.tests.test_ttwapi.layer in 0.000 seconds.
  Tear down kss.core.tests.base.KSSLayer in 0.000 seconds.
  Tear down kss.core.tests.base.KSSCoreLayer in 0.000 seconds.
  Set up zope.testing.testrunner.layer.UnitTests in 0.000 seconds.
/home/stefan/autotest/temp/python26-zope212-cmf22-plone40/src/kss.core/kss/core/siteview.txt:1: DeprecationWarning: ISite is deprecated. Moved to zope.location.interfaces. Importing from here will stop working in Zope 3.6
  =========
  Ran 14 tests with 0 failures and 0 errors in 0.009 seconds.
Tearing down left over layers:
  Tear down zope.testing.testrunner.layer.UnitTests in 0.000 seconds.
Total: 47 tests, 0 failures, 0 errors in 0.887 seconds.
***********************************************
WARNING: LinguaPlone not found. Skipping tests.
***********************************************
***********************************************
WARNING: LinguaPlone not found. Skipping tests.
***********************************************
Running plone.app.blob.tests.layer.BlobLayer tests:
  Set up Testing.ZopeTestCase.layer.ZopeLite in 0.887 seconds.
  Set up Products.PloneTestCase.layer.ZCML in 2.372 seconds.
  Set up Products.PloneTestCase.layer.PloneSite in 4.107 seconds.
  Set up plone.app.blob.tests.layer.BlobLayer in 0.111 seconds.
/home/stefan/autotest/temp/python26-zope212-cmf22-plone40/eggs/Products.PortalTransforms-2.0a1-py2.6.egg/Products/PortalTransforms/libtransforms/commandtransform.py:97: DeprecationWarning: os.popen4 is deprecated.  Use the subprocess module.
  cin, couterr = os.popen4(command, 'b')
  Ran 28 tests with 0 failures and 0 errors in 2 minutes 4.698 seconds.
Running plone.app.blob.tests.layer.BlobReplacementLayer tests:
  Set up plone.app.blob.tests.layer.BlobReplacementLayer in 0.194 seconds.
  Ran 39 tests with 0 failures and 0 errors in 51.030 seconds.
Running zope.testing.testrunner.layer.UnitTests tests:
  Tear down plone.app.blob.tests.layer.BlobReplacementLayer in 0.000 seconds.
  Tear down plone.app.blob.tests.layer.BlobLayer in 0.000 seconds.
  Tear down Products.PloneTestCase.layer.PloneSite in 0.355 seconds.
  Tear down Products.PloneTestCase.layer.ZCML in 0.009 seconds.
  Tear down Testing.ZopeTestCase.layer.ZopeLite in 0.000 seconds.
  Set up zope.testing.testrunner.layer.UnitTests in 0.000 seconds.
  Ran 2 tests with 0 failures and 0 errors in 0.001 seconds.
Tearing down left over layers:
  Tear down zope.testing.testrunner.layer.UnitTests in 0.000 seconds.
Total: 69 tests, 0 failures, 0 errors in 3 minutes 4.480 seconds.
Running Testing.ZopeTestCase.layer.ZopeLite tests:
  Set up Testing.ZopeTestCase.layer.ZopeLite in 0.913 seconds.
  Ran 2 tests with 0 failures and 0 errors in 0.008 seconds.
Running plone.app.folder.tests.layer.IntegrationLayer tests:
  Set up Products.PloneTestCase.layer.ZCML in 2.380 seconds.
  Set up Products.PloneTestCase.layer.PloneSite in 3.950 seconds.
  Set up plone.app.folder.tests.layer.IntegrationLayer in 0.476 seconds.
  Ran 9 tests with 0 failures and 0 errors in 2.090 seconds.
Running plone.app.folder.tests.layer.PartialOrderingIntegrationLayer tests:
  Set up plone.app.folder.tests.layer.PartialOrderingIntegrationLayer in 0.000 seconds.
  Ran 3 tests with 0 failures and 0 errors in 0.312 seconds.
Tearing down left over layers:
  Tear down plone.app.folder.tests.layer.PartialOrderingIntegrationLayer in 0.000 seconds.
  Tear down plone.app.folder.tests.layer.IntegrationLayer in 0.000 seconds.
  Tear down Products.PloneTestCase.layer.PloneSite in 0.364 seconds.
  Tear down Products.PloneTestCase.layer.ZCML in 0.004 seconds.
  Tear down Testing.ZopeTestCase.layer.ZopeLite in 0.000 seconds.
Total: 14 tests, 0 failures, 0 errors in 11.066 seconds.
Running plone.app.imaging.tests.layer.ImagingLayer tests:
  Set up Testing.ZopeTestCase.layer.ZopeLite in 0.894 seconds.
  Set up Products.PloneTestCase.layer.ZCML in 2.397 seconds.
  Set up Products.PloneTestCase.layer.PloneSite in 4.120 seconds.
  Set up plone.app.imaging.tests.layer.ImagingLayer in 0.101 seconds.
  Ran 34 tests with 0 failures and 0 errors in 3.874 seconds.
Running zope.testing.testrunner.layer.UnitTests tests:
  Tear down plone.app.imaging.tests.layer.ImagingLayer in 0.000 seconds.
  Tear down Products.PloneTestCase.layer.PloneSite in 0.375 seconds.
  Tear down Products.PloneTestCase.layer.ZCML in 0.005 seconds.
  Tear down Testing.ZopeTestCase.layer.ZopeLite in 0.000 seconds.
  Set up zope.testing.testrunner.layer.UnitTests in 0.000 seconds.
  Ran 7 tests with 0 failures and 0 errors in 0.001 seconds.
Tearing down left over layers:
  Tear down zope.testing.testrunner.layer.UnitTests in 0.000 seconds.
Total: 41 tests, 0 failures, 0 errors in 12.203 seconds.
Running Products.PloneTestCase.layer.PloneSite tests:
  Set up Testing.ZopeTestCase.layer.ZopeLite in 1.368 seconds.
  Set up Products.PloneTestCase.layer.ZCML in 2.387 seconds.
  Set up Products.PloneTestCase.layer.PloneSite in 4.086 seconds.
  Ran 7 tests with 0 failures and 0 errors in 0.072 seconds.
Tearing down left over layers:
  Tear down Products.PloneTestCase.layer.PloneSite in 0.363 seconds.
  Tear down Products.PloneTestCase.layer.ZCML in 0.004 seconds.
  Tear down Testing.ZopeTestCase.layer.ZopeLite in 0.000 seconds.
Total: 0 tests, 0 failures, 0 errors in 0.000 seconds.
Running Products.PloneTestCase.layer.PloneSite tests:
  Set up Testing.ZopeTestCase.layer.ZopeLite in 1.393 seconds.
  Set up Products.PloneTestCase.layer.ZCML in 2.306 seconds.
  Set up Products.PloneTestCase.layer.PloneSite in 4.080 seconds.
  Ran 3 tests with 0 failures and 0 errors in 1.153 seconds.
Tearing down left over layers:
  Tear down Products.PloneTestCase.layer.PloneSite in 0.348 seconds.
  Tear down Products.PloneTestCase.layer.ZCML in 0.004 seconds.
  Tear down Testing.ZopeTestCase.layer.ZopeLite in 0.000 seconds.
Running Products.PloneTestCase.layer.PloneSite tests:
  Set up Testing.ZopeTestCase.layer.ZopeLite in 1.374 seconds.
  Set up Products.PloneTestCase.layer.ZCML in 2.385 seconds.
  Set up Products.PloneTestCase.layer.PloneSite in 4.085 seconds.
  Ran 5 tests with 0 failures and 0 errors in 1.313 seconds.
Tearing down left over layers:
  Tear down Products.PloneTestCase.layer.PloneSite in 0.363 seconds.
  Tear down Products.PloneTestCase.layer.ZCML in 0.005 seconds.
  Tear down Testing.ZopeTestCase.layer.ZopeLite in 0.000 seconds.
Running plone.folder.tests.layer.PartialOrderingLayer tests:
  Set up plone.folder.tests.layer.PartialOrderingLayer in 0.000 seconds.
  Ran 11 tests with 0 failures and 0 errors in 0.007 seconds.
Running plone.folder.tests.layer.PloneFolderLayer tests:
  Tear down plone.folder.tests.layer.PartialOrderingLayer in 0.000 seconds.
  Set up plone.folder.tests.layer.PloneFolderLayer in 0.000 seconds.
  Ran 45 tests with 0 failures and 0 errors in 0.031 seconds.
Tearing down left over layers:
  Tear down plone.folder.tests.layer.PloneFolderLayer in 0.000 seconds.
Total: 56 tests, 0 failures, 0 errors in 0.170 seconds.
Running Products.PloneTestCase.layer.PloneSite tests:
  Set up Testing.ZopeTestCase.layer.ZopeLite in 1.465 seconds.
  Set up Products.PloneTestCase.layer.ZCML in 2.367 seconds.
  Set up Products.PloneTestCase.layer.PloneSite in 4.321 seconds.
  Ran 41 tests with 0 failures and 0 errors in 0.371 seconds.
Tearing down left over layers:
  Tear down Products.PloneTestCase.layer.PloneSite in 0.362 seconds.
  Tear down Products.PloneTestCase.layer.ZCML in 0.004 seconds.
  Tear down Testing.ZopeTestCase.layer.ZopeLite in 0.000 seconds.
Total: 0 tests, 0 failures, 0 errors in 0.000 seconds.
Total: 0 tests, 0 failures, 0 errors in 0.000 seconds.
Running Products.PloneTestCase.layer.ZCML tests:
  Set up Testing.ZopeTestCase.layer.ZopeLite in 0.894 seconds.
  Set up Products.PloneTestCase.layer.ZCML in 2.361 seconds.
/home/stefan/autotest/temp/python26-zope212-cmf22-plone40/eggs/wicked-1.1.8alpha1-py2.6.egg/wicked/cache.py:34: DeprecationWarning: object.__init__() takes no parameters
  super(CacheStore, self).__init__(self)
  Ran 16 tests with 0 failures and 0 errors in 0.057 seconds.
Running wicked.at.tests.wickedtestcase.WickedSite tests:
  Set up Products.PloneTestCase.layer.PloneSite in 4.905 seconds.
  Set up wicked.at.tests.wickedtestcase.WickedSite in 0.003 seconds.
/home/stefan/autotest/temp/python26-zope212-cmf22-plone40/eggs/Zope2-2.12.1-py2.6-linux-x86_64.egg/OFS/subscribers.py:73: DeprecationWarning: wicked.atcontent.ironicwiki.IronicWiki.manage_afterAdd is discouraged. You should use event subscribers instead.
  DeprecationWarning)
/home/stefan/autotest/temp/python26-zope212-cmf22-plone40/eggs/Zope2-2.12.1-py2.6-linux-x86_64.egg/OFS/subscribers.py:73: DeprecationWarning: wicked.atcontent.ironicwiki.IronicWiki.manage_beforeDelete is discouraged. You should use event subscribers instead.
  DeprecationWarning)
/home/stefan/autotest/temp/python26-zope212-cmf22-plone40/eggs/Zope2-2.12.1-py2.6-linux-x86_64.egg/OFS/subscribers.py:73: DeprecationWarning: wicked.atcontent.ironicwiki.IronicWiki.manage_afterClone is discouraged. You should use event subscribers instead.
  DeprecationWarning)
  Ran 23 tests with 0 failures and 0 errors in 4.747 seconds.
Running wicked.at.tests.test_scope.Scoped tests:
  Set up wicked.at.tests.test_scope.Scoped in 0.000 seconds.
  Ran 3 tests with 0 failures and 0 errors in 0.528 seconds.
Running wicked.plone.tests.SelectiveATCT tests:
  Tear down wicked.at.tests.test_scope.Scoped in 0.000 seconds.
  Tear down wicked.at.tests.wickedtestcase.WickedSite in 0.002 seconds.
  Set up wicked.plone.tests.SelectiveATCT in 0.003 seconds.
  Ran 22 tests with 0 failures and 0 errors in 4.966 seconds.
Running wicked.plone.tests.ZCMLLayer tests:
  Tear down wicked.plone.tests.SelectiveATCT in 0.004 seconds.
  Set up wicked.plone.tests.ZCMLLayer in 0.019 seconds.
  Ran 8 tests with 0 failures and 0 errors in 0.728 seconds.
Running zope.testing.testrunner.layer.UnitTests tests:
  Tear down wicked.plone.tests.ZCMLLayer in 0.388 seconds.
  Tear down Products.PloneTestCase.layer.PloneSite in 0.001 seconds.
  Tear down Products.PloneTestCase.layer.ZCML in 0.004 seconds.
  Tear down Testing.ZopeTestCase.layer.ZopeLite in 0.000 seconds.
  Set up zope.testing.testrunner.layer.UnitTests in 0.000 seconds.
  Ran 34 tests with 0 failures and 0 errors in 0.016 seconds.
Tearing down left over layers:
  Tear down zope.testing.testrunner.layer.UnitTests in 0.000 seconds.
Total: 106 tests, 0 failures, 0 errors in 20.851 seconds.
#### Running tests for group ATCT ####
#### Finished tests for group ATCT ####

#### Running tests for group Archetypes ####
#### Finished tests for group Archetypes ####

#### Running tests for group CMF ####
#### Finished tests for group CMF ####

#### Running tests for group CMFEditions ####
#### Finished tests for group CMFEditions ####

#### Running tests for group Plone ####
#### Finished tests for group Plone ####

#### Running tests for group PlonePAS ####
#### Finished tests for group PlonePAS ####

#### Running tests for group plone ####
#### Finished tests for group plone ####

#### Running tests for group portlets ####
#### Finished tests for group portlets ####

#### Running tests for Products.CMFPlacefulWorkflow ####
#### Finished tests for Products.CMFPlacefulWorkflow ####

#### Running tests for Products.CMFTestCase ####
#### Finished tests for Products.CMFTestCase ####

#### Running tests for Products.ExtendedPathIndex ####
#### Finished tests for Products.ExtendedPathIndex ####

#### Running tests for Products.PasswordResetTool ####
#### Finished tests for Products.PasswordResetTool ####

#### Running tests for Products.PloneTestCase ####
#### Finished tests for Products.PloneTestCase ####

#### Running tests for Products.ResourceRegistries ####
#### Finished tests for Products.ResourceRegistries ####

#### Running tests for Products.TinyMCE ####
#### Finished tests for Products.TinyMCE ####

#### Running tests for Products.ZopeVersionControl ####
#### Finished tests for Products.ZopeVersionControl ####

#### Running tests for Products.contentmigration ####
#### Finished tests for Products.contentmigration ####

#### Running tests for Products.i18ntestcase ####
#### Finished tests for Products.i18ntestcase ####

#### Running tests for Products.kupu ####
#### Finished tests for Products.kupu ####

#### Running tests for archetypes.referencebrowserwidget ####
#### Finished tests for archetypes.referencebrowserwidget ####

#### Running tests for archetypes.schemaextender ####
#### Finished tests for archetypes.schemaextender ####

#### Running tests for collective.monkeypatcher ####
#### Finished tests for collective.monkeypatcher ####

#### Running tests for five.customerize ####
#### Finished tests for five.customerize ####

#### Running tests for kss.core ####
#### Finished tests for kss.core ####

#### Running tests for plone.app.blob ####
#### Finished tests for plone.app.blob ####

#### Running tests for plone.app.folder ####
#### Finished tests for plone.app.folder ####

#### Running tests for plone.app.imaging ####
#### Finished tests for plone.app.imaging ####

#### Running tests for plone.app.jquerytools ####
#### Finished tests for plone.app.jquerytools ####

#### Running tests for plone.app.locales ####
#### Finished tests for plone.app.locales ####

#### Running tests for plone.app.openid ####
#### Finished tests for plone.app.openid ####

#### Running tests for plone.app.users ####
#### Finished tests for plone.app.users ####

#### Running tests for plone.folder ####
#### Finished tests for plone.folder ####

#### Running tests for plone.stringinterp ####
#### Finished tests for plone.stringinterp ####

#### Running tests for plonetheme.classic ####
#### Finished tests for plonetheme.classic ####

#### Running tests for plonetheme.sunburst ####
#### Finished tests for plonetheme.sunburst ####

#### Running tests for wicked ####
#### Finished tests for wicked ####

Packages with test failures:

Failing tests in group Plone
Failing tests in group plone
Failing tests in Products.kupu

Total time elapsed: 1142.563 seconds

Grand total: 86 packages, 3 failures


FAILED (86 packages, 3 failures)




More information about the Testbot mailing list