[Testbot] FAILED (86 packages, 9 failures) : Plone-4.0 Zope-2.12 Python-2.6.4

Plone Tests plone-tests at epy.co.at
Wed Nov 18 03:14:01 UTC 2009


Plone Tests : FAILED (86 packages, 9 failures)
Plone-4.0 Zope-2.12 Python-2.6.4

Running ./bin/alltests -q --no-color --no-progress
Running Products.CMFTestCase.layer.CMFSite tests:
  Set up Testing.ZopeTestCase.layer.ZopeLite in 1.052 seconds.
  Set up Products.CMFTestCase.layer.ZCML in 2.949 seconds.
  Set up Products.CMFTestCase.layer.CMFSite in 2.008 seconds.
  Ran 31 tests with 0 failures and 0 errors in 0.556 seconds.
Running Products.PloneTestCase.layer.PloneSite tests:
  Tear down Products.CMFTestCase.layer.CMFSite in 0.068 seconds.
  Tear down Products.CMFTestCase.layer.ZCML in 0.004 seconds.
  Set up Products.PloneTestCase.layer.ZCML in 1.710 seconds.
  Set up Products.PloneTestCase.layer.PloneSite in 3.916 seconds.
  Ran 711 tests with 0 failures and 0 errors in 1 minutes 8.798 seconds.
Tearing down left over layers:
  Tear down Products.PloneTestCase.layer.PloneSite in 0.364 seconds.
  Tear down Products.PloneTestCase.layer.ZCML in 0.010 seconds.
  Tear down Testing.ZopeTestCase.layer.ZopeLite in 0.000 seconds.
Total: 742 tests, 0 failures, 0 errors in 1 minutes 21.939 seconds.
Running Testing.ZopeTestCase.layer.ZopeLite tests:
  Set up Testing.ZopeTestCase.layer.ZopeLite in 0.781 seconds.
  Ran 36 tests with 0 failures and 0 errors in 0.080 seconds.
Running Products.Archetypes.tests.layer.ZCML tests:
  Set up Products.CMFCore.testing.FunctionalZCMLLayer in 0.190 seconds.
  Set up Products.Archetypes.tests.layer.ZCML in 0.179 seconds.
  Ran 59 tests with 0 failures and 0 errors in 1.131 seconds.
Running Products.Archetypes.tests.layer.ArchetypesSite tests:
  Set up Products.Archetypes.tests.layer.ArchetypesSite in 1.981 seconds.
/home/stefan/autotest/temp/python26-zope212-cmf22-plone40/eggs/Zope2-2.12.1-py2.6-linux-x86_64.egg/OFS/subscribers.py:73: DeprecationWarning: Products.Archetypes.tests.test_classgen.Dummy.manage_afterAdd is discouraged. You should use event subscribers instead.
  DeprecationWarning)
/home/stefan/autotest/temp/python26-zope212-cmf22-plone40/eggs/Zope2-2.12.1-py2.6-linux-x86_64.egg/OFS/subscribers.py:73: DeprecationWarning: Products.Archetypes.tests.test_annotation.AnnDummy.manage_afterAdd is discouraged. You should use event subscribers instead.
  DeprecationWarning)
/home/stefan/autotest/temp/python26-zope212-cmf22-plone40/eggs/Zope2-2.12.1-py2.6-linux-x86_64.egg/OFS/subscribers.py:73: DeprecationWarning: Products.Archetypes.tests.test_event.Dummy.manage_afterAdd is discouraged. You should use event subscribers instead.
  DeprecationWarning)
  Ran 511 tests with 0 failures and 0 errors in 38.794 seconds.
Running Products.PloneTestCase.layer.PloneSite tests:
  Tear down Products.Archetypes.tests.layer.ArchetypesSite in 0.066 seconds.
  Tear down Products.Archetypes.tests.layer.ZCML in 0.004 seconds.
  Tear down Products.CMFCore.testing.FunctionalZCMLLayer in 0.000 seconds.
  Set up Products.PloneTestCase.layer.ZCML in 2.340 seconds.
  Set up Products.PloneTestCase.layer.PloneSite in 3.928 seconds.
  Ran 9 tests with 0 failures and 0 errors in 1.065 seconds.
Running plone.app.kss.tests.kss_and_plone_layer.KSSAndPloneLayer tests:
  Set up plone.app.kss.tests.kss_and_plone_layer.KSSAndPloneLayer in 0.006 seconds.
  Ran 19 tests with 0 failures and 0 errors in 1.550 seconds.
Running zope.testing.testrunner.layer.UnitTests tests:
  Tear down plone.app.kss.tests.kss_and_plone_layer.KSSAndPloneLayer in 0.000 seconds.
  Tear down Products.PloneTestCase.layer.PloneSite in 0.353 seconds.
  Tear down Products.PloneTestCase.layer.ZCML in 0.005 seconds.
  Tear down Testing.ZopeTestCase.layer.ZopeLite in 0.000 seconds.
  Set up zope.testing.testrunner.layer.UnitTests in 0.000 seconds.
/home/stefan/autotest/temp/python26-zope212-cmf22-plone40/eggs/Products.Archetypes-1.6a2-py2.6.egg/Products/Archetypes/ClassGen.py:152: UserWarning: The method 'makeFoo' was already protected by a different permission than the one declared on the field. Assuming that the explicit permission declared is the correct one and has preference over the permission declared on the field.
  self.handle_mode(klass, generator, type, field, mode)
  Ran 28 tests with 0 failures and 0 errors in 0.126 seconds.
Tearing down left over layers:
  Tear down zope.testing.testrunner.layer.UnitTests in 0.000 seconds.
Total: 662 tests, 0 failures, 0 errors in 53.937 seconds.
Running Testing.ZopeTestCase.layer.ZopeLite tests:
  Set up Testing.ZopeTestCase.layer.ZopeLite in 0.054 seconds.
  Ran 170 tests with 0 failures and 0 errors in 0.709 seconds.
Running Products.CMFCore.testing.ExportImportZCMLLayer tests:
  Set up Products.CMFCore.testing.ExportImportZCMLLayer in 0.000 seconds.
  Ran 10 tests with 0 failures and 0 errors in 0.639 seconds.
Running Products.GenericSetup.testing.ExportImportZCMLLayer tests:
  Tear down Products.CMFCore.testing.ExportImportZCMLLayer in 0.000 seconds.
  Set up Products.GenericSetup.testing.ExportImportZCMLLayer in 0.047 seconds.
  Ran 186 tests with 0 failures and 0 errors in 0.694 seconds.
Running zope.testing.testrunner.layer.UnitTests tests:
  Tear down Products.GenericSetup.testing.ExportImportZCMLLayer in 0.000 seconds.
  Tear down Testing.ZopeTestCase.layer.ZopeLite in 0.000 seconds.
  Set up zope.testing.testrunner.layer.UnitTests in 0.000 seconds.
  Ran 166 tests with 0 failures and 0 errors in 0.150 seconds.
Tearing down left over layers:
  Tear down zope.testing.testrunner.layer.UnitTests in 0.000 seconds.
Total: 532 tests, 0 failures, 0 errors in 2.664 seconds.
Running Testing.ZopeTestCase.layer.ZopeLite tests:
  Set up Testing.ZopeTestCase.layer.ZopeLite in 0.900 seconds.
  Ran 27 tests with 0 failures and 0 errors in 0.057 seconds.
Running Products.PloneTestCase.layer.PloneSite tests:
  Set up Products.PloneTestCase.layer.ZCML in 2.432 seconds.
  Set up Products.PloneTestCase.layer.PloneSite in 5.097 seconds.
/home/stefan/autotest/temp/python26-zope212-cmf22-plone40/eggs/Zope2-2.12.1-py2.6-linux-x86_64.egg/OFS/subscribers.py:73: DeprecationWarning: Products.FAQ.FAQ.FAQ.manage_afterAdd is discouraged. You should use event subscribers instead.
  DeprecationWarning)
/home/stefan/autotest/temp/python26-zope212-cmf22-plone40/eggs/Zope2-2.12.1-py2.6-linux-x86_64.egg/OFS/subscribers.py:73: DeprecationWarning: Products.FAQ.FAQQuestion.FAQQuestion.manage_afterAdd is discouraged. You should use event subscribers instead.
  DeprecationWarning)
  Ran 145 tests with 0 failures and 0 errors in 52.459 seconds.
Running Products.CMFDiffTool.tests.BaseTestCase.CMFDiffToolLayer tests:
  Set up Products.CMFDiffTool.tests.BaseTestCase.CMFDiffToolLayer in 0.013 seconds.
  Ran 2 tests with 0 failures and 0 errors in 0.179 seconds.
Running Products.CMFTestCase.layer.CMFSite tests:
  Tear down Products.CMFDiffTool.tests.BaseTestCase.CMFDiffToolLayer in 0.384 seconds.
  Tear down Products.PloneTestCase.layer.PloneSite in 0.006 seconds.
  Tear down Products.PloneTestCase.layer.ZCML in 0.004 seconds.
  Set up Products.CMFTestCase.layer.ZCML in 1.784 seconds.
  Set up Products.CMFTestCase.layer.CMFSite in 1.514 seconds.
  Ran 20 tests with 0 failures and 0 errors in 0.394 seconds.
Running zope.testing.testrunner.layer.UnitTests tests:
  Tear down Products.CMFTestCase.layer.CMFSite in 0.069 seconds.
  Tear down Products.CMFTestCase.layer.ZCML in 0.003 seconds.
  Tear down Testing.ZopeTestCase.layer.ZopeLite in 0.000 seconds.
  Set up zope.testing.testrunner.layer.UnitTests in 0.000 seconds.
  Ran 10 tests with 0 failures and 0 errors in 0.005 seconds.
Tearing down left over layers:
  Tear down zope.testing.testrunner.layer.UnitTests in 0.000 seconds.
Total: 204 tests, 0 failures, 0 errors in 1 minutes 6.280 seconds.
Running Testing.ZopeTestCase.layer.ZopeLite tests:
  Set up Testing.ZopeTestCase.layer.ZopeLite in 0.612 seconds.
  Ran 126 tests with 0 failures and 0 errors in 0.753 seconds.
Running Products.CMFTestCase.layer.CMFSite tests:
  Set up Products.CMFTestCase.layer.ZCML in 2.348 seconds.
  Set up Products.CMFTestCase.layer.CMFSite in 0.229 seconds.
  Ran 53 tests with 0 failures and 0 errors in 2.583 seconds.
Running Products.PloneTestCase.layer.ZCML tests:
  Tear down Products.CMFTestCase.layer.CMFSite in 0.041 seconds.
  Tear down Products.CMFTestCase.layer.ZCML in 0.003 seconds.
  Set up Products.PloneTestCase.layer.ZCML in 1.698 seconds.
  Ran 12 tests with 0 failures and 0 errors in 0.018 seconds.
Running Products.PloneTestCase.layer.PloneSite tests:
  Set up Products.PloneTestCase.layer.PloneSite in 4.160 seconds.


Failure in test test_menu_presence (plone.app.kss.tests.test_kss_attributes.TestContentMenu)
Failed doctest test for plone.app.kss.tests.test_kss_attributes.TestContentMenu.test_menu_presence
  File "/home/stefan/autotest/temp/python26-zope212-cmf22-plone40/src/plone.app.kss/plone/app/kss/tests/test_kss_attributes.py", line 183, in test_menu_presence

----------------------------------------------------------------------
File "/home/stefan/autotest/temp/python26-zope212-cmf22-plone40/src/plone.app.kss/plone/app/kss/tests/test_kss_attributes.py", line 230, in plone.app.kss.tests.test_kss_attributes.TestContentMenu.test_menu_presence
Failed example:
    content_td is not None
Differences (ndiff with -expected +actual):
    - True
    + False
----------------------------------------------------------------------
File "/home/stefan/autotest/temp/python26-zope212-cmf22-plone40/src/plone.app.kss/plone/app/kss/tests/test_kss_attributes.py", line 232, in plone.app.kss.tests.test_kss_attributes.TestContentMenu.test_menu_presence
Failed example:
    content_actions = content_td.find('div', {'class': 'contentActions'})
Exception raised:
    Traceback (most recent call last):
      File "/home/stefan/autotest/temp/python26-zope212-cmf22-plone40/eggs/zope.testing-3.7.7-py2.6.egg/zope/testing/doctest.py", line 1361, in __run
        compileflags, 1) in test.globs
      File "<doctest plone.app.kss.tests.test_kss_attributes.TestContentMenu.test_menu_presence[line 49, example 17]>", line 1, in <module>
        content_actions = content_td.find('div', {'class': 'contentActions'})
    AttributeError: 'NoneType' object has no attribute 'find'
----------------------------------------------------------------------
File "/home/stefan/autotest/temp/python26-zope212-cmf22-plone40/src/plone.app.kss/plone/app/kss/tests/test_kss_attributes.py", line 233, in plone.app.kss.tests.test_kss_attributes.TestContentMenu.test_menu_presence
Failed example:
    content_actions is not None
Exception raised:
    Traceback (most recent call last):
      File "/home/stefan/autotest/temp/python26-zope212-cmf22-plone40/eggs/zope.testing-3.7.7-py2.6.egg/zope/testing/doctest.py", line 1361, in __run
        compileflags, 1) in test.globs
      File "<doctest plone.app.kss.tests.test_kss_attributes.TestContentMenu.test_menu_presence[line 50, example 18]>", line 1, in <module>
        content_actions is not None
    NameError: name 'content_actions' is not defined
----------------------------------------------------------------------
File "/home/stefan/autotest/temp/python26-zope212-cmf22-plone40/src/plone.app.kss/plone/app/kss/tests/test_kss_attributes.py", line 238, in plone.app.kss.tests.test_kss_attributes.TestContentMenu.test_menu_presence
Failed example:
    content_actions_ul = content_actions.find('ul', {'id': 'contentActionMenus'})
Exception raised:
    Traceback (most recent call last):
      File "/home/stefan/autotest/temp/python26-zope212-cmf22-plone40/eggs/zope.testing-3.7.7-py2.6.egg/zope/testing/doctest.py", line 1361, in __run
        compileflags, 1) in test.globs
      File "<doctest plone.app.kss.tests.test_kss_attributes.TestContentMenu.test_menu_presence[line 55, example 19]>", line 1, in <module>
        content_actions_ul = content_actions.find('ul', {'id': 'contentActionMenus'})
    NameError: name 'content_actions' is not defined
----------------------------------------------------------------------
File "/home/stefan/autotest/temp/python26-zope212-cmf22-plone40/src/plone.app.kss/plone/app/kss/tests/test_kss_attributes.py", line 239, in plone.app.kss.tests.test_kss_attributes.TestContentMenu.test_menu_presence
Failed example:
    content_actions_ul is not None
Exception raised:
    Traceback (most recent call last):
      File "/home/stefan/autotest/temp/python26-zope212-cmf22-plone40/eggs/zope.testing-3.7.7-py2.6.egg/zope/testing/doctest.py", line 1361, in __run
        compileflags, 1) in test.globs
      File "<doctest plone.app.kss.tests.test_kss_attributes.TestContentMenu.test_menu_presence[line 56, example 20]>", line 1, in <module>
        content_actions_ul is not None
    NameError: name 'content_actions_ul' is not defined

  Ran 1810 tests with 1 failures and 0 errors in 4 minutes 8.885 seconds.
Running plone.app.contentrules.tests.test_configuration.TestContentrulesGSLayer tests:
  Set up plone.app.contentrules.tests.test_configuration.TestContentrulesGSLayer in 0.002 seconds.
  Ran 6 tests with 0 failures and 0 errors in 3.692 seconds.
Running plone.app.customerize.tests.layer.PloneCustomerize tests:
  Tear down plone.app.contentrules.tests.test_configuration.TestContentrulesGSLayer in 0.000 seconds.
  Set up plone.app.customerize.tests.layer.PloneCustomerize in 0.000 seconds.
  Ran 27 tests with 0 failures and 0 errors in 1 minutes 0.359 seconds.
Running plone.app.kss.tests.kss_and_plone_layer.KSSAndPloneLayer tests:
  Tear down plone.app.customerize.tests.layer.PloneCustomerize in 0.000 seconds.
  Set up plone.app.kss.tests.kss_and_plone_layer.KSSAndPloneLayer in 0.004 seconds.


Error in test testChangeViewTemplate (plone.app.kss.tests.test_menus.ContentActionMenusTestCase)
Traceback (most recent call last):
  File "/usr/local/python2.6/lib/python2.6/unittest.py", line 279, in run
    testMethod()
  File "/home/stefan/autotest/temp/python26-zope212-cmf22-plone40/src/plone.app.kss/plone/app/kss/tests/test_menus.py", line 57, in testChangeViewTemplate
    result = view.changeViewTemplate(url)
  File "<wrapper>", line 5, in wrapper
  File "/home/stefan/autotest/temp/python26-zope212-cmf22-plone40/src/kss.core/kss/core/actionwrapper.py", line 238, in apply
    result = self.f(obj, *arg, **kw)
  File "/home/stefan/autotest/temp/python26-zope212-cmf22-plone40/src/plone.app.kss/plone/app/kss/content_replacer.py", line 239, in changeViewTemplate
    self.getCommandSet('plone').refreshContentMenu()
  File "/home/stefan/autotest/temp/python26-zope212-cmf22-plone40/src/plone.app.kss/plone/app/kss/commands/plonecommands.py", line 92, in refreshContentMenu
    self.getCommandSet('zope').refreshProvider(selector, 'plone.contentmenu')
  File "/home/stefan/autotest/temp/python26-zope212-cmf22-plone40/src/plone.app.kss/plone/app/kss/commands/zopecommands.py", line 17, in refreshProvider
    renderer = provider.__of__(self.context)
AttributeError: 'ContentMenuProvider' object has no attribute '__of__'



Error in test testChangeWorkflowState (plone.app.kss.tests.test_menus.ContentActionMenusTestCase)
Traceback (most recent call last):
  File "/usr/local/python2.6/lib/python2.6/unittest.py", line 279, in run
    testMethod()
  File "/home/stefan/autotest/temp/python26-zope212-cmf22-plone40/src/plone.app.kss/plone/app/kss/tests/test_menus.py", line 118, in testChangeWorkflowState
    result = view.changeWorkflowState(url)
  File "<wrapper>", line 5, in wrapper
  File "/home/stefan/autotest/temp/python26-zope212-cmf22-plone40/src/kss.core/kss/core/actionwrapper.py", line 238, in apply
    result = self.f(obj, *arg, **kw)
  File "/home/stefan/autotest/temp/python26-zope212-cmf22-plone40/src/plone.app.kss/plone/app/kss/content_replacer.py", line 267, in changeWorkflowState
    plonecommands.refreshContentMenu()
  File "/home/stefan/autotest/temp/python26-zope212-cmf22-plone40/src/plone.app.kss/plone/app/kss/commands/plonecommands.py", line 92, in refreshContentMenu
    self.getCommandSet('zope').refreshProvider(selector, 'plone.contentmenu')
  File "/home/stefan/autotest/temp/python26-zope212-cmf22-plone40/src/plone.app.kss/plone/app/kss/commands/zopecommands.py", line 17, in refreshProvider
    renderer = provider.__of__(self.context)
AttributeError: 'ContentMenuProvider' object has no attribute '__of__'



Error in test testCopyObject (plone.app.kss.tests.test_menus.ContentActionMenusTestCase)
Traceback (most recent call last):
  File "/usr/local/python2.6/lib/python2.6/unittest.py", line 279, in run
    testMethod()
  File "/home/stefan/autotest/temp/python26-zope212-cmf22-plone40/src/plone.app.kss/plone/app/kss/tests/test_menus.py", line 107, in testCopyObject
    result = view.copyObject()
  File "<wrapper>", line 5, in wrapper
  File "/home/stefan/autotest/temp/python26-zope212-cmf22-plone40/src/kss.core/kss/core/actionwrapper.py", line 238, in apply
    result = self.f(obj, *arg, **kw)
  File "/home/stefan/autotest/temp/python26-zope212-cmf22-plone40/src/plone.app.kss/plone/app/kss/content_replacer.py", line 190, in copyObject
    self.getCommandSet('plone').refreshContentMenu()
  File "/home/stefan/autotest/temp/python26-zope212-cmf22-plone40/src/plone.app.kss/plone/app/kss/commands/plonecommands.py", line 92, in refreshContentMenu
    self.getCommandSet('zope').refreshProvider(selector, 'plone.contentmenu')
  File "/home/stefan/autotest/temp/python26-zope212-cmf22-plone40/src/plone.app.kss/plone/app/kss/commands/zopecommands.py", line 17, in refreshProvider
    renderer = provider.__of__(self.context)
AttributeError: 'ContentMenuProvider' object has no attribute '__of__'



Error in test testCutObject (plone.app.kss.tests.test_menus.ContentActionMenusTestCase)
Traceback (most recent call last):
  File "/usr/local/python2.6/lib/python2.6/unittest.py", line 279, in run
    testMethod()
  File "/home/stefan/autotest/temp/python26-zope212-cmf22-plone40/src/plone.app.kss/plone/app/kss/tests/test_menus.py", line 83, in testCutObject
    result = view.cutObject()
  File "<wrapper>", line 5, in wrapper
  File "/home/stefan/autotest/temp/python26-zope212-cmf22-plone40/src/kss.core/kss/core/actionwrapper.py", line 238, in apply
    result = self.f(obj, *arg, **kw)
  File "/home/stefan/autotest/temp/python26-zope212-cmf22-plone40/src/plone.app.kss/plone/app/kss/content_replacer.py", line 182, in cutObject
    self.getCommandSet('plone').refreshContentMenu()
  File "/home/stefan/autotest/temp/python26-zope212-cmf22-plone40/src/plone.app.kss/plone/app/kss/commands/plonecommands.py", line 92, in refreshContentMenu
    self.getCommandSet('zope').refreshProvider(selector, 'plone.contentmenu')
  File "/home/stefan/autotest/temp/python26-zope212-cmf22-plone40/src/plone.app.kss/plone/app/kss/commands/zopecommands.py", line 17, in refreshProvider
    renderer = provider.__of__(self.context)
AttributeError: 'ContentMenuProvider' object has no attribute '__of__'



Error in test testKssCopyObject (plone.app.kss.tests.test_menus.ContentActionMenusTestCase)
Traceback (most recent call last):
  File "/usr/local/python2.6/lib/python2.6/unittest.py", line 279, in run
    testMethod()
  File "/home/stefan/autotest/temp/python26-zope212-cmf22-plone40/src/plone.app.kss/plone/app/kss/tests/test_menus.py", line 93, in testKssCopyObject
    result = view.copyObject()
  File "<wrapper>", line 5, in wrapper
  File "/home/stefan/autotest/temp/python26-zope212-cmf22-plone40/src/kss.core/kss/core/actionwrapper.py", line 238, in apply
    result = self.f(obj, *arg, **kw)
  File "/home/stefan/autotest/temp/python26-zope212-cmf22-plone40/src/plone.app.kss/plone/app/kss/content_replacer.py", line 190, in copyObject
    self.getCommandSet('plone').refreshContentMenu()
  File "/home/stefan/autotest/temp/python26-zope212-cmf22-plone40/src/plone.app.kss/plone/app/kss/commands/plonecommands.py", line 92, in refreshContentMenu
    self.getCommandSet('zope').refreshProvider(selector, 'plone.contentmenu')
  File "/home/stefan/autotest/temp/python26-zope212-cmf22-plone40/src/plone.app.kss/plone/app/kss/commands/zopecommands.py", line 17, in refreshProvider
    renderer = provider.__of__(self.context)
AttributeError: 'ContentMenuProvider' object has no attribute '__of__'



Error in test testKssCutObject (plone.app.kss.tests.test_menus.ContentActionMenusTestCase)
Traceback (most recent call last):
  File "/usr/local/python2.6/lib/python2.6/unittest.py", line 279, in run
    testMethod()
  File "/home/stefan/autotest/temp/python26-zope212-cmf22-plone40/src/plone.app.kss/plone/app/kss/tests/test_menus.py", line 68, in testKssCutObject
    result = view.cutObject()
  File "<wrapper>", line 5, in wrapper
  File "/home/stefan/autotest/temp/python26-zope212-cmf22-plone40/src/kss.core/kss/core/actionwrapper.py", line 238, in apply
    result = self.f(obj, *arg, **kw)
  File "/home/stefan/autotest/temp/python26-zope212-cmf22-plone40/src/plone.app.kss/plone/app/kss/content_replacer.py", line 182, in cutObject
    self.getCommandSet('plone').refreshContentMenu()
  File "/home/stefan/autotest/temp/python26-zope212-cmf22-plone40/src/plone.app.kss/plone/app/kss/commands/plonecommands.py", line 92, in refreshContentMenu
    self.getCommandSet('zope').refreshProvider(selector, 'plone.contentmenu')
  File "/home/stefan/autotest/temp/python26-zope212-cmf22-plone40/src/plone.app.kss/plone/app/kss/commands/zopecommands.py", line 17, in refreshProvider
    renderer = provider.__of__(self.context)
AttributeError: 'ContentMenuProvider' object has no attribute '__of__'



Error in test testReplaceContentRegion (plone.app.kss.tests.test_menus.ContentActionMenusTestCase)
Traceback (most recent call last):
  File "/usr/local/python2.6/lib/python2.6/unittest.py", line 279, in run
    testMethod()
  File "/home/stefan/autotest/temp/python26-zope212-cmf22-plone40/src/plone.app.kss/plone/app/kss/tests/test_menus.py", line 43, in testReplaceContentRegion
    result = view.replaceContentRegion(self.fpage.absolute_url(), tabid='contentview-edit')
  File "<wrapper>", line 5, in wrapper
  File "/home/stefan/autotest/temp/python26-zope212-cmf22-plone40/src/kss.core/kss/core/actionwrapper.py", line 238, in apply
    result = self.f(obj, *arg, **kw)
  File "/home/stefan/autotest/temp/python26-zope212-cmf22-plone40/src/plone.app.kss/plone/app/kss/content_replacer.py", line 171, in replaceContentRegion
    self.getCommandSet('plone').refreshContentMenu()
  File "/home/stefan/autotest/temp/python26-zope212-cmf22-plone40/src/plone.app.kss/plone/app/kss/commands/plonecommands.py", line 92, in refreshContentMenu
    self.getCommandSet('zope').refreshProvider(selector, 'plone.contentmenu')
  File "/home/stefan/autotest/temp/python26-zope212-cmf22-plone40/src/plone.app.kss/plone/app/kss/commands/zopecommands.py", line 17, in refreshProvider
    renderer = provider.__of__(self.context)
AttributeError: 'ContentMenuProvider' object has no attribute '__of__'

  Ran 13 tests with 0 failures and 7 errors in 0.877 seconds.
Running plone.app.linkintegrity.tests.layer.PloneLinkintegrity tests:
  Tear down plone.app.kss.tests.kss_and_plone_layer.KSSAndPloneLayer in 0.000 seconds.
  Set up plone.app.linkintegrity.tests.layer.PloneLinkintegrity in 0.453 seconds.
  Ran 117 tests with 0 failures and 0 errors in 25.069 seconds.
Running plone.app.viewletmanager.tests.test_exportimport.Layer tests:
  Tear down plone.app.linkintegrity.tests.layer.PloneLinkintegrity in 0.052 seconds.
  Tear down Products.PloneTestCase.layer.PloneSite in 0.413 seconds.
  Tear down Products.PloneTestCase.layer.ZCML in 0.015 seconds.
  Tear down Testing.ZopeTestCase.layer.ZopeLite in 0.000 seconds.
  Set up plone.app.viewletmanager.tests.test_exportimport.Layer in 0.000 seconds.
  Ran 16 tests with 0 failures and 0 errors in 0.050 seconds.
Running zope.testing.testrunner.layer.UnitTests tests:
  Tear down plone.app.viewletmanager.tests.test_exportimport.Layer in 0.000 seconds.
  Set up zope.testing.testrunner.layer.UnitTests in 0.000 seconds.
  Ran 143 tests with 0 failures and 0 errors in 0.856 seconds.
Tearing down left over layers:
  Tear down zope.testing.testrunner.layer.UnitTests in 0.000 seconds.
Total: 2323 tests, 1 failures, 7 errors in 5 minutes 56.942 seconds.
Running Testing.ZopeTestCase.layer.ZopeLite tests:
  Set up Testing.ZopeTestCase.layer.ZopeLite in 1.387 seconds.
  Ran 165 tests with 0 failures and 0 errors in 0.628 seconds.
Running Products.PloneTestCase.layer.ZCML tests:
  Set up Products.PloneTestCase.layer.ZCML in 2.306 seconds.
  Ran 34 tests with 0 failures and 0 errors in 0.211 seconds.
Running Products.PlonePAS.tests.layer.PlonePASLayer tests:
  Set up Products.PloneTestCase.layer.PloneSite in 3.870 seconds.
  Set up Products.PlonePAS.tests.layer.PlonePASLayer in 0.000 seconds.
  Ran 152 tests with 0 failures and 0 errors in 1.808 seconds.
Running zope.testing.testrunner.layer.UnitTests tests:
  Tear down Products.PlonePAS.tests.layer.PlonePASLayer in 0.000 seconds.
  Tear down Products.PloneTestCase.layer.PloneSite in 0.347 seconds.
  Tear down Products.PloneTestCase.layer.ZCML in 0.004 seconds.
  Tear down Testing.ZopeTestCase.layer.ZopeLite in 0.000 seconds.
  Set up zope.testing.testrunner.layer.UnitTests in 0.000 seconds.
  Ran 371 tests with 0 failures and 0 errors in 0.539 seconds.
Tearing down left over layers:
  Tear down zope.testing.testrunner.layer.UnitTests in 0.000 seconds.
Total: 722 tests, 0 failures, 0 errors in 11.869 seconds.
Running Products.PloneTestCase.layer.PloneSite tests:
  Set up Testing.ZopeTestCase.layer.ZopeLite in 1.359 seconds.
  Set up Products.PloneTestCase.layer.ZCML in 2.370 seconds.
  Set up Products.PloneTestCase.layer.PloneSite in 4.201 seconds.
/home/stefan/autotest/temp/python26-zope212-cmf22-plone40/eggs/borg.localrole-3.0a1-py2.6.egg/borg/localrole/bbb/bbb.txt:1: DeprecationWarning: IWorkspace is deprecated. Please use borg.localrole.interfaces.ILocalRoleProvider instead
  =========
/home/stefan/autotest/temp/python26-zope212-cmf22-plone40/eggs/borg.localrole-3.0a1-py2.6.egg/borg/localrole/bbb/bbb.txt:1: DeprecationWarning: IGroupAwareWorkspace is deprecated. Please use borg.localrole.interfaces.ILocalRoleProvider instead
  =========
  Ran 36 tests with 0 failures and 0 errors in 0.134 seconds.
Running plone.browserlayer.tests.test_doctest.PloneBrowserLayerLayer tests:
  Set up plone.browserlayer.tests.test_doctest.PloneBrowserLayerLayer in 0.003 seconds.
  Ran 9 tests with 0 failures and 0 errors in 0.980 seconds.
Running plone.theme.tests.test_doctest.PloneThemeLayer tests:
  Tear down plone.browserlayer.tests.test_doctest.PloneBrowserLayerLayer in 0.000 seconds.
  Set up plone.theme.tests.test_doctest.PloneThemeLayer in 0.017 seconds.
  Ran 5 tests with 0 failures and 0 errors in 0.075 seconds.
Running zope.testing.testrunner.layer.UnitTests tests:
  Tear down plone.theme.tests.test_doctest.PloneThemeLayer in 0.000 seconds.
  Tear down Products.PloneTestCase.layer.PloneSite in 0.368 seconds.
  Tear down Products.PloneTestCase.layer.ZCML in 0.004 seconds.
  Tear down Testing.ZopeTestCase.layer.ZopeLite in 0.000 seconds.
  Set up zope.testing.testrunner.layer.UnitTests in 0.000 seconds.
/usr/local/python2.6/lib/python2.6/mhlib.py:83: DeprecationWarning: the multifile module has been deprecated since Python 2.5
  import multifile


Failure in test /home/stefan/autotest/temp/python26-zope212-cmf22-plone40/eggs/z3c.autoinclude-0.3.1-py2.6.egg/z3c/autoinclude/tests/../dependency.txt
Traceback (most recent call last):
  File "/usr/local/python2.6/lib/python2.6/unittest.py", line 279, in run
    testMethod()
  File "/usr/local/python2.6/lib/python2.6/doctest.py", line 2145, in runTest
    raise self.failureException(self.format_failure(new.getvalue()))
AssertionError: Failed doctest test for dependency.txt
  File "/home/stefan/autotest/temp/python26-zope212-cmf22-plone40/eggs/z3c.autoinclude-0.3.1-py2.6.egg/z3c/autoinclude/tests/../dependency.txt", line 0

----------------------------------------------------------------------
File "/home/stefan/autotest/temp/python26-zope212-cmf22-plone40/eggs/z3c.autoinclude-0.3.1-py2.6.egg/z3c/autoinclude/tests/../dependency.txt", line 102, in dependency.txt
Failed example:
    sibling_include_finder.dottedNames()
Expected:
    ['F.G', 'F.H']
Got:
    ['F.H', 'F.G']
----------------------------------------------------------------------
File "/home/stefan/autotest/temp/python26-zope212-cmf22-plone40/eggs/z3c.autoinclude-0.3.1-py2.6.egg/z3c/autoinclude/tests/../dependency.txt", line 108, in dependency.txt
Failed example:
    pprint(b_include_finder.includableInfo(['configure.zcml',
                                            'meta.zcml']))
Expected:
    {'configure.zcml': ['F.H'], 'meta.zcml': ['testdirective', 'F.G', 'F.H']}
Got:
    {'configure.zcml': ['F.H'], 'meta.zcml': ['testdirective', 'F.H', 'F.G']}
----------------------------------------------------------------------
File "/home/stefan/autotest/temp/python26-zope212-cmf22-plone40/eggs/z3c.autoinclude-0.3.1-py2.6.egg/z3c/autoinclude/tests/../dependency.txt", line 142, in dependency.txt
Failed example:
    pprint(package_includes('BCPackage'))
Expected:
    {'configure.zcml': ['F.H'],
     'meta.zcml': ['testdirective', 'F.G', 'F.H'],
     'overrides.zcml': []}
Got:
    {'configure.zcml': ['F.H'],
     'meta.zcml': ['testdirective', 'F.H', 'F.G'],
     'overrides.zcml': []}


  Ran 262 tests with 1 failures and 0 errors in 14.778 seconds.
Tearing down left over layers:
  Tear down zope.testing.testrunner.layer.UnitTests in 0.000 seconds.
Total: 312 tests, 1 failures, 0 errors in 25.206 seconds.
Running Products.PloneTestCase.layer.PloneSite tests:
  Set up Testing.ZopeTestCase.layer.ZopeLite in 0.863 seconds.
  Set up Products.PloneTestCase.layer.ZCML in 2.284 seconds.
  Set up Products.PloneTestCase.layer.PloneSite Traceback (most recent call last):
  File "/home/stefan/autotest/temp/python26-zope212-cmf22-plone40/eggs/zope.testing-3.7.7-py2.6.egg/zope/testing/testrunner/runner.py", line 361, in run_layer
    setup_layer(options, layer, setup_layers)
  File "/home/stefan/autotest/temp/python26-zope212-cmf22-plone40/eggs/zope.testing-3.7.7-py2.6.egg/zope/testing/testrunner/runner.py", line 518, in setup_layer
    layer.setUp()
  File "/home/stefan/autotest/temp/python26-zope212-cmf22-plone40/eggs/Products.PloneTestCase-0.9.9-py2.6.egg/Products/PloneTestCase/layer.py", line 33, in setUp
    func(*args, **kw)
  File "/home/stefan/autotest/temp/python26-zope212-cmf22-plone40/eggs/Products.PloneTestCase-0.9.9-py2.6.egg/Products/PloneTestCase/setup.py", line 164, in setupPloneSite
    base_profile, extension_profiles).run()
  File "/home/stefan/autotest/temp/python26-zope212-cmf22-plone40/eggs/Products.PloneTestCase-0.9.9-py2.6.egg/Products/PloneTestCase/setup.py", line 211, in run
    self._setupProfiles()
  File "/home/stefan/autotest/temp/python26-zope212-cmf22-plone40/eggs/Products.PloneTestCase-0.9.9-py2.6.egg/Products/PloneTestCase/setup.py", line 280, in _setupProfiles
    setup.runAllImportStepsFromProfile(profile_id)
  File "/home/stefan/autotest/temp/python26-zope212-cmf22-plone40/eggs/Products.GenericSetup-1.5.0b1-py2.6.egg/Products/GenericSetup/tool.py", line 331, in runAllImportStepsFromProfile
    ignore_dependencies=ignore_dependencies)
   - __traceback_info__: profile-plone.app.portlets:default
  File "/home/stefan/autotest/temp/python26-zope212-cmf22-plone40/eggs/Products.GenericSetup-1.5.0b1-py2.6.egg/Products/GenericSetup/tool.py", line 1058, in _runImportStepsFromContext
    chain = self.getProfileDependencyChain( profile_id )
  File "/home/stefan/autotest/temp/python26-zope212-cmf22-plone40/eggs/Products.GenericSetup-1.5.0b1-py2.6.egg/Products/GenericSetup/tool.py", line 1039, in getProfileDependencyChain
    dependencies = self.getDependenciesForProfile( profile_id )
  File "/home/stefan/autotest/temp/python26-zope212-cmf22-plone40/eggs/Products.GenericSetup-1.5.0b1-py2.6.egg/Products/GenericSetup/tool.py", line 825, in getDependenciesForProfile
    raise KeyError, profile_id
KeyError: 'profile-plone.app.portlets:default'

Running plone.app.portlets.tests.test_configuration.TestPortletZCMLLayer tests:
  Set up Products.PloneTestCase.layer.PloneSite Traceback (most recent call last):
  File "/home/stefan/autotest/temp/python26-zope212-cmf22-plone40/eggs/zope.testing-3.7.7-py2.6.egg/zope/testing/testrunner/runner.py", line 361, in run_layer
    setup_layer(options, layer, setup_layers)
  File "/home/stefan/autotest/temp/python26-zope212-cmf22-plone40/eggs/zope.testing-3.7.7-py2.6.egg/zope/testing/testrunner/runner.py", line 513, in setup_layer
    setup_layer(options, base, setup_layers)
  File "/home/stefan/autotest/temp/python26-zope212-cmf22-plone40/eggs/zope.testing-3.7.7-py2.6.egg/zope/testing/testrunner/runner.py", line 518, in setup_layer
    layer.setUp()
  File "/home/stefan/autotest/temp/python26-zope212-cmf22-plone40/eggs/Products.PloneTestCase-0.9.9-py2.6.egg/Products/PloneTestCase/layer.py", line 33, in setUp
    func(*args, **kw)
  File "/home/stefan/autotest/temp/python26-zope212-cmf22-plone40/eggs/Products.PloneTestCase-0.9.9-py2.6.egg/Products/PloneTestCase/setup.py", line 164, in setupPloneSite
    base_profile, extension_profiles).run()
  File "/home/stefan/autotest/temp/python26-zope212-cmf22-plone40/eggs/Products.PloneTestCase-0.9.9-py2.6.egg/Products/PloneTestCase/setup.py", line 211, in run
    self._setupProfiles()
  File "/home/stefan/autotest/temp/python26-zope212-cmf22-plone40/eggs/Products.PloneTestCase-0.9.9-py2.6.egg/Products/PloneTestCase/setup.py", line 280, in _setupProfiles
    setup.runAllImportStepsFromProfile(profile_id)
  File "/home/stefan/autotest/temp/python26-zope212-cmf22-plone40/eggs/Products.GenericSetup-1.5.0b1-py2.6.egg/Products/GenericSetup/tool.py", line 331, in runAllImportStepsFromProfile
    ignore_dependencies=ignore_dependencies)
   - __traceback_info__: profile-plone.app.portlets:default
  File "/home/stefan/autotest/temp/python26-zope212-cmf22-plone40/eggs/Products.GenericSetup-1.5.0b1-py2.6.egg/Products/GenericSetup/tool.py", line 1058, in _runImportStepsFromContext
    chain = self.getProfileDependencyChain( profile_id )
  File "/home/stefan/autotest/temp/python26-zope212-cmf22-plone40/eggs/Products.GenericSetup-1.5.0b1-py2.6.egg/Products/GenericSetup/tool.py", line 1039, in getProfileDependencyChain
    dependencies = self.getDependenciesForProfile( profile_id )
  File "/home/stefan/autotest/temp/python26-zope212-cmf22-plone40/eggs/Products.GenericSetup-1.5.0b1-py2.6.egg/Products/GenericSetup/tool.py", line 825, in getDependenciesForProfile
    raise KeyError, profile_id
KeyError: 'profile-plone.app.portlets:default'

Running plone.app.portlets.tests.test_configuration.TestPortletGSLayer tests:
  Set up Products.PloneTestCase.layer.PloneSite Traceback (most recent call last):
  File "/home/stefan/autotest/temp/python26-zope212-cmf22-plone40/eggs/zope.testing-3.7.7-py2.6.egg/zope/testing/testrunner/runner.py", line 361, in run_layer
    setup_layer(options, layer, setup_layers)
  File "/home/stefan/autotest/temp/python26-zope212-cmf22-plone40/eggs/zope.testing-3.7.7-py2.6.egg/zope/testing/testrunner/runner.py", line 513, in setup_layer
    setup_layer(options, base, setup_layers)
  File "/home/stefan/autotest/temp/python26-zope212-cmf22-plone40/eggs/zope.testing-3.7.7-py2.6.egg/zope/testing/testrunner/runner.py", line 513, in setup_layer
    setup_layer(options, base, setup_layers)
  File "/home/stefan/autotest/temp/python26-zope212-cmf22-plone40/eggs/zope.testing-3.7.7-py2.6.egg/zope/testing/testrunner/runner.py", line 518, in setup_layer
    layer.setUp()
  File "/home/stefan/autotest/temp/python26-zope212-cmf22-plone40/eggs/Products.PloneTestCase-0.9.9-py2.6.egg/Products/PloneTestCase/layer.py", line 33, in setUp
    func(*args, **kw)
  File "/home/stefan/autotest/temp/python26-zope212-cmf22-plone40/eggs/Products.PloneTestCase-0.9.9-py2.6.egg/Products/PloneTestCase/setup.py", line 164, in setupPloneSite
    base_profile, extension_profiles).run()
  File "/home/stefan/autotest/temp/python26-zope212-cmf22-plone40/eggs/Products.PloneTestCase-0.9.9-py2.6.egg/Products/PloneTestCase/setup.py", line 211, in run
    self._setupProfiles()
  File "/home/stefan/autotest/temp/python26-zope212-cmf22-plone40/eggs/Products.PloneTestCase-0.9.9-py2.6.egg/Products/PloneTestCase/setup.py", line 280, in _setupProfiles
    setup.runAllImportStepsFromProfile(profile_id)
  File "/home/stefan/autotest/temp/python26-zope212-cmf22-plone40/eggs/Products.GenericSetup-1.5.0b1-py2.6.egg/Products/GenericSetup/tool.py", line 331, in runAllImportStepsFromProfile
    ignore_dependencies=ignore_dependencies)
   - __traceback_info__: profile-plone.app.portlets:default
  File "/home/stefan/autotest/temp/python26-zope212-cmf22-plone40/eggs/Products.GenericSetup-1.5.0b1-py2.6.egg/Products/GenericSetup/tool.py", line 1058, in _runImportStepsFromContext
    chain = self.getProfileDependencyChain( profile_id )
  File "/home/stefan/autotest/temp/python26-zope212-cmf22-plone40/eggs/Products.GenericSetup-1.5.0b1-py2.6.egg/Products/GenericSetup/tool.py", line 1039, in getProfileDependencyChain
    dependencies = self.getDependenciesForProfile( profile_id )
  File "/home/stefan/autotest/temp/python26-zope212-cmf22-plone40/eggs/Products.GenericSetup-1.5.0b1-py2.6.egg/Products/GenericSetup/tool.py", line 825, in getDependenciesForProfile
    raise KeyError, profile_id
KeyError: 'profile-plone.app.portlets:default'

Running zope.testing.testrunner.layer.UnitTests tests:
  Tear down Products.PloneTestCase.layer.ZCML in 0.004 seconds.
  Tear down Testing.ZopeTestCase.layer.ZopeLite in 0.000 seconds.
  Set up zope.testing.testrunner.layer.UnitTests in 0.000 seconds.
  Ran 54 tests with 0 failures and 0 errors in 0.150 seconds.
Tearing down left over layers:
  Tear down zope.testing.testrunner.layer.UnitTests in 0.000 seconds.
Total: 54 tests, 0 failures, 3 errors in 7.594 seconds.
Running Products.PloneTestCase.layer.PloneSite tests:
  Set up Testing.ZopeTestCase.layer.ZopeLite in 0.000 seconds.
  Set up Products.PloneTestCase.layer.ZCML in 1.805 seconds.
  Set up Products.PloneTestCase.layer.PloneSite in 5.184 seconds.
  Ran 23 tests with 0 failures and 0 errors in 3.466 seconds.
Running Products.CMFPlacefulWorkflow.tests.test_exportimport.ExportImportLayer tests:
  Set up Products.CMFPlacefulWorkflow.tests.test_exportimport.ExportImportLayer in 0.001 seconds.


Failure in test /home/stefan/autotest/temp/python26-zope212-cmf22-plone40/src/Products.CMFPlacefulWorkflow/Products/CMFPlacefulWorkflow/tests/exportimport.txt
Failed doctest test for exportimport.txt
  File "/home/stefan/autotest/temp/python26-zope212-cmf22-plone40/src/Products.CMFPlacefulWorkflow/Products/CMFPlacefulWorkflow/tests/exportimport.txt", line 0

----------------------------------------------------------------------
File "/home/stefan/autotest/temp/python26-zope212-cmf22-plone40/src/Products.CMFPlacefulWorkflow/Products/CMFPlacefulWorkflow/tests/exportimport.txt", line 23, in exportimport.txt
Failed example:
    ps.createSnapshot('sn_1')
Exception raised:
    Traceback (most recent call last):
      File "/home/stefan/autotest/temp/python26-zope212-cmf22-plone40/eggs/zope.testing-3.7.7-py2.6.egg/zope/testing/doctest.py", line 1361, in __run
        compileflags, 1) in test.globs
      File "<doctest exportimport.txt[line 23, example 4]>", line 1, in <module>
        ps.createSnapshot('sn_1')
      File "/home/stefan/autotest/temp/python26-zope212-cmf22-plone40/eggs/Products.GenericSetup-1.5.0b1-py2.6.egg/Products/GenericSetup/tool.py", line 370, in createSnapshot
        messages[step_id] = handler(context)
      File "/home/stefan/autotest/temp/python26-zope212-cmf22-plone40/eggs/Products.CMFCore-2.2.0_alpha-py2.6.egg/Products/CMFCore/exportimport/workflow.py", line 138, in exportWorkflowTool
        exportObjects(tool, '', context)
      File "/home/stefan/autotest/temp/python26-zope212-cmf22-plone40/eggs/Products.GenericSetup-1.5.0b1-py2.6.egg/Products/GenericSetup/utils.py", line 810, in exportObjects
        exportObjects(sub, path+'/', context)
      File "/home/stefan/autotest/temp/python26-zope212-cmf22-plone40/eggs/Products.GenericSetup-1.5.0b1-py2.6.egg/Products/GenericSetup/utils.py", line 804, in exportObjects
        body = exporter.body
      File "/home/stefan/autotest/temp/python26-zope212-cmf22-plone40/eggs/Products.DCWorkflow-2.2.0_alpha-py2.6.egg/Products/DCWorkflow/exportimport.py", line 52, in _exportBody
        return wfdc.__of__(self.context).generateWorkflowXML()
      File "/home/stefan/autotest/temp/python26-zope212-cmf22-plone40/eggs/Products.DCWorkflow-2.2.0_alpha-py2.6.egg/Products/DCWorkflow/exportimport.py", line 142, in generateWorkflowXML
        return self._workflowConfig(workflow_id=self._obj.getId())
      File "/home/stefan/autotest/temp/python26-zope212-cmf22-plone40/eggs/Zope2-2.12.1-py2.6-linux-x86_64.egg/Shared/DC/Scripts/Bindings.py", line 324, in __call__
        return self._bindAndExec(args, kw, None)
      File "/home/stefan/autotest/temp/python26-zope212-cmf22-plone40/eggs/Zope2-2.12.1-py2.6-linux-x86_64.egg/Shared/DC/Scripts/Bindings.py", line 361, in _bindAndExec
        return self._exec(bound_data, args, kw)
      File "/home/stefan/autotest/temp/python26-zope212-cmf22-plone40/eggs/Zope2-2.12.1-py2.6-linux-x86_64.egg/Products/PageTemplates/PageTemplateFile.py", line 130, in _exec
        return self.pt_render(extra_context=bound_names)
      File "/home/stefan/autotest/temp/python26-zope212-cmf22-plone40/eggs/Zope2-2.12.1-py2.6-linux-x86_64.egg/Products/PageTemplates/PageTemplate.py", line 80, in pt_render
        showtal=showtal)
      File "/home/stefan/autotest/temp/python26-zope212-cmf22-plone40/eggs/zope.pagetemplate-3.5.0-py2.6.egg/zope/pagetemplate/pagetemplate.py", line 115, in pt_render
        strictinsert=0, sourceAnnotations=sourceAnnotations)()
      File "/home/stefan/autotest/temp/python26-zope212-cmf22-plone40/eggs/zope.tal-3.5.1-py2.6.egg/zope/tal/talinterpreter.py", line 271, in __call__
        self.interpret(self.program)
      File "/home/stefan/autotest/temp/python26-zope212-cmf22-plone40/eggs/zope.tal-3.5.1-py2.6.egg/zope/tal/talinterpreter.py", line 343, in interpret
        handlers[opcode](self, args)
      File "/home/stefan/autotest/temp/python26-zope212-cmf22-plone40/eggs/zope.tal-3.5.1-py2.6.egg/zope/tal/talinterpreter.py", line 583, in do_setLocal_tal
        self.engine.setLocal(name, self.engine.evaluateValue(expr))
      File "/home/stefan/autotest/temp/python26-zope212-cmf22-plone40/eggs/zope.tales-3.4.0-py2.6.egg/zope/tales/tales.py", line 696, in evaluate
        return expression(self)
       - workflowConfig
       - Line 2, Column 0
       - Expression: <PythonExpr here.getWorkflowInfo(                                                 options[ 'workflow_id' ] )>
       - Names:
          {'container': <UnauthorizedBinding: container>,
           'context': <UnauthorizedBinding: context>,
           'default': <object object at 0x2ba561b4e760>,
           'here': <UnauthorizedBinding: context>,
           'loop': {},
           'nothing': None,
           'options': {'args': (), 'workflow_id': 'folder_workflow'},
           'repeat': <Products.PageTemplates.Expressions.SafeMapping object at 0x7c5fb90>,
           'request': <HTTPRequest, URL=http://nohost>,
           'root': <Application at >,
           'template': <PageTemplateFile at /plone/portal_workflow/folder_workflow/workflowConfig>,
           'user': <PloneUser 'test_user_1_'>}
      File "/home/stefan/autotest/temp/python26-zope212-cmf22-plone40/eggs/Zope2-2.12.1-py2.6-linux-x86_64.egg/Products/PageTemplates/ZRPythonExpr.py", line 49, in __call__
        return eval(self._code, vars, {})
       - __traceback_info__: here.getWorkflowInfo(                                                 options[ 'workflow_id' ] )
      File "PythonExpr", line 1, in <expression>
      File "/home/stefan/autotest/temp/python26-zope212-cmf22-plone40/eggs/Zope2-2.12.1-py2.6-linux-x86_64.egg/Shared/DC/Scripts/Bindings.py", line 195, in __getattr__
        return guarded_getattr(self._wrapped, name, default)
    Unauthorized: You are not allowed to access 'getWorkflowInfo' in this context

  Ran 11 tests with 1 failures and 0 errors in 0.279 seconds.
Tearing down left over layers:
  Tear down Products.CMFPlacefulWorkflow.tests.test_exportimport.ExportImportLayer in 0.000 seconds.
  Tear down Products.PloneTestCase.layer.PloneSite in 0.360 seconds.
  Tear down Products.PloneTestCase.layer.ZCML in 0.004 seconds.
  Tear down Testing.ZopeTestCase.layer.ZopeLite in 0.000 seconds.
Total: 34 tests, 1 failures, 0 errors in 11.562 seconds.
Running Products.CMFTestCase.layer.CMFSite tests:
  Set up Testing.ZopeTestCase.layer.ZopeLite in 0.201 seconds.
  Set up Products.CMFTestCase.layer.ZCML in 0.363 seconds.
  Set up Products.CMFTestCase.layer.CMFSite in 0.206 seconds.
  Ran 58 tests with 0 failures and 0 errors in 0.228 seconds.
Tearing down left over layers:
  Tear down Products.CMFTestCase.layer.CMFSite in 0.031 seconds.
  Tear down Products.CMFTestCase.layer.ZCML in 0.001 seconds.
  Tear down Testing.ZopeTestCase.layer.ZopeLite in 0.000 seconds.
Running zope.testing.testrunner.layer.UnitTests tests:
  Set up zope.testing.testrunner.layer.UnitTests in 0.000 seconds.
  Ran 35 tests with 0 failures and 0 errors in 0.026 seconds.
Tearing down left over layers:
  Tear down zope.testing.testrunner.layer.UnitTests in 0.000 seconds.
Running Products.PloneTestCase.layer.PloneSite tests:
  Set up Testing.ZopeTestCase.layer.ZopeLite in 1.359 seconds.
  Set up Products.PloneTestCase.layer.ZCML in 2.605 seconds.
  Set up Products.PloneTestCase.layer.PloneSite in 4.036 seconds.
  Ran 39 tests with 0 failures and 0 errors in 4.056 seconds.
Tearing down left over layers:
  Tear down Products.PloneTestCase.layer.PloneSite in 0.364 seconds.
  Tear down Products.PloneTestCase.layer.ZCML in 0.006 seconds.
  Tear down Testing.ZopeTestCase.layer.ZopeLite in 0.000 seconds.
Running Products.PloneTestCase.layer.PloneSite tests:
  Set up Testing.ZopeTestCase.layer.ZopeLite in 1.370 seconds.
  Set up Products.PloneTestCase.layer.ZCML in 2.390 seconds.
  Set up Products.PloneTestCase.layer.PloneSite in 4.031 seconds.
/home/stefan/autotest/temp/python26-zope212-cmf22-plone40/eggs/Products.PlonePAS-4.0a1-py2.6.egg/Products/PlonePAS/tools/membership.py:554: DeprecationWarning: credentialsChanged should be called with 'REQUEST' as second argument. The BBB code will be removed in CMF 2.3.
  self.credentialsChanged(password, REQUEST=REQUEST)
  Ran 61 tests with 0 failures and 0 errors in 1.107 seconds.
Tearing down left over layers:
  Tear down Products.PloneTestCase.layer.PloneSite in 0.366 seconds.
  Tear down Products.PloneTestCase.layer.ZCML in 0.004 seconds.
  Tear down Testing.ZopeTestCase.layer.ZopeLite in 0.000 seconds.
Running Products.PloneTestCase.layer.PloneSite tests:
  Set up Testing.ZopeTestCase.layer.ZopeLite in 1.375 seconds.
  Set up Products.PloneTestCase.layer.ZCML in 2.346 seconds.
  Set up Products.PloneTestCase.layer.PloneSite in 4.148 seconds.
  Ran 239 tests with 0 failures and 0 errors in 17.810 seconds.
Running zope.testing.testrunner.layer.UnitTests tests:
  Tear down Products.PloneTestCase.layer.PloneSite in 0.369 seconds.
  Tear down Products.PloneTestCase.layer.ZCML in 0.005 seconds.
  Tear down Testing.ZopeTestCase.layer.ZopeLite in 0.000 seconds.
  Set up zope.testing.testrunner.layer.UnitTests in 0.000 seconds.
  Ran 59 tests with 0 failures and 0 errors in 0.013 seconds.
Tearing down left over layers:
  Tear down zope.testing.testrunner.layer.UnitTests in 0.000 seconds.
Total: 298 tests, 0 failures, 0 errors in 26.489 seconds.
Running Products.PloneTestCase.layer.PloneSite tests:
  Set up Testing.ZopeTestCase.layer.ZopeLite in 1.341 seconds.
  Set up Products.PloneTestCase.layer.ZCML in 2.380 seconds.
  Set up Products.PloneTestCase.layer.PloneSite in 4.058 seconds.
  Ran 76 tests with 0 failures and 0 errors in 2.943 seconds.
Tearing down left over layers:
  Tear down Products.PloneTestCase.layer.PloneSite in 0.365 seconds.
  Tear down Products.PloneTestCase.layer.ZCML in 0.006 seconds.
  Tear down Testing.ZopeTestCase.layer.ZopeLite in 0.000 seconds.
Running zope.testing.testrunner.layer.UnitTests tests:
  Set up zope.testing.testrunner.layer.UnitTests in 0.000 seconds.
  Ran 76 tests with 0 failures and 0 errors in 1.523 seconds.
Tearing down left over layers:
  Tear down zope.testing.testrunner.layer.UnitTests in 0.000 seconds.
Running Products.contentmigration.tests.layer.TestLayer tests:
  Set up Testing.ZopeTestCase.layer.ZopeLite in 1.332 seconds.
  Set up Products.PloneTestCase.layer.ZCML in 2.352 seconds.
  Set up Products.PloneTestCase.layer.PloneSite in 4.054 seconds.
  Set up Products.contentmigration.tests.layer.TestLayer in 0.002 seconds.
  Ran 18 tests with 0 failures and 0 errors in 4.986 seconds.
Tearing down left over layers:
  Tear down Products.contentmigration.tests.layer.TestLayer in 0.000 seconds.
  Tear down Products.PloneTestCase.layer.PloneSite in 0.366 seconds.
  Tear down Products.PloneTestCase.layer.ZCML in 0.004 seconds.
  Tear down Testing.ZopeTestCase.layer.ZopeLite in 0.000 seconds.
Total: 0 tests, 0 failures, 0 errors in 0.000 seconds.
/home/stefan/autotest/temp/python26-zope212-cmf22-plone40/eggs/Products.i18ntestcase-1.2-py2.6.egg/Products/i18ntestcase/PotTestCase.py:13: DeprecationWarning: The popen2 module is deprecated.  Use the subprocess module.
  from popen2 import popen4
/home/stefan/autotest/temp/python26-zope212-cmf22-plone40/src/Products.kupu/Products/kupu/plone/tests/TestContent.py:4: DeprecationWarning: Products.ATReferenceBrowserWidget.ATReferenceBrowserWidget has moved to archetypes.referencebrowserwidget.widget. Import of Products.ATReferenceBrowserWidget.ATReferenceBrowserWidget will become unsupported in Plone 5.0
  from Products.ATReferenceBrowserWidget.ATReferenceBrowserWidget import ReferenceBrowserWidget
Running Testing.ZopeTestCase.layer.ZopeLite tests:
  Set up Testing.ZopeTestCase.layer.ZopeLite in 0.836 seconds.
  Ran 3 tests with 0 failures and 0 errors in 0.008 seconds.
Running Products.PloneTestCase.layer.PloneSite tests:
  Set up Products.PloneTestCase.layer.ZCML in 2.412 seconds.
  Set up Products.PloneTestCase.layer.PloneSite/home/stefan/autotest/temp/python26-zope212-cmf22-plone40/src/Products.kupu/Products/kupu/plone/util.py:25: DeprecationWarning: minimalpath() is deprecated and will be removed in CMF 2.3.
  kupu_plone_skin_dir = minimalpath(os.path.join(kupu_package_dir, relpath))
/home/stefan/autotest/temp/python26-zope212-cmf22-plone40/src/Products.kupu/Products/kupu/plone/util.py:26: DeprecationWarning: createDirectoryView() called with deprecated reg_key format. Support for old key formats will be removed in CMF 2.3. Please use the new key format <product>:<subdir> instead.
  createDirectoryView(skinstool, kupu_plone_skin_dir, name)
<string>:213: DeprecationWarning: changeSkin should be called with 'REQUEST' as second argument. The BBB code will be removed in CMF 2.3.
 in 4.481 seconds.


Failure in test testSame (Products.kupu.plone.tests.test_html2captioned.TransformTestSubclass)
Traceback (most recent call last):
  File "/usr/local/python2.6/lib/python2.6/unittest.py", line 279, in run
    testMethod()
  File "/home/stefan/autotest/temp/python26-zope212-cmf22-plone40/src/Products.kupu/Products/kupu/plone/tests/test_html2captioned.py", line 78, in testSame
    self.do_convert(filename=self.input)
  File "/home/stefan/autotest/temp/python26-zope212-cmf22-plone40/src/Products.kupu/Products/kupu/plone/tests/test_html2captioned.py", line 71, in do_convert
    got, expected, self.transform.name(), self.input))
  File "/usr/local/python2.6/lib/python2.6/unittest.py", line 350, in failUnlessEqual
    (msg or '%r != %r' % (first, second))
AssertionError: Got:
[<div>Simple text containing an embedded image</div><dl class="image-left captioned"><dt><img src="http://nohost/plone/folder/gamma/image" alt="Kupu Test Image" title="Kupu Test Image" height="331" width="500" /></dt><dd class="image-caption" style="width:500px">Test image caption</dd></dl><dl class="image-left captioned"><dt><img src="http://nohost/plone/folder/gamma/image_thumb" alt="Kupu Test Image" title="Kupu Test Image" height="84" width="128" /></dt><dd class="image-caption" style="width:500px">Test image caption</dd></dl><dl class="image-left captioned"><dt><img src="http://nohost/plone/folder/gamma/image" alt="Kupu Test Image" title="Kupu Test Image" height="331" width="500" /></dt><dd class="image-caption" style="width:500px">Test image caption</dd></dl>]

!=

Expected:
[<div>Simple text containing an embedded image</div><dl class="image-left captioned"><dt><img src="http://nohost/plone/folder/gamma/image" alt="Kupu Test Image" title="Kupu Test Image" height="331" width="500" /></dt><dd class="image-caption" style="width:500px">Test image caption</dd></dl><dl class="image-left captioned"><dt><a rel="lightbox" href="/plone/folder/gamma"><img src="http://nohost/plone/folder/gamma/image_thumb" alt="Kupu Test Image" title="Kupu Test Image" height="84" width="128" /></a></dt><dd class="image-caption" style="width:128px">Test image caption</dd></dl><dl class="image-left captioned"><dt><img src="http://nohost/plone/folder/gamma/image" alt="Kupu Test Image" title="Kupu Test Image" height="331" width="500" /></dt><dd class="image-caption" style="width:500px">Test image caption</dd></dl>]

IN html_to_captioned(/home/stefan/autotest/temp/python26-zope212-cmf22-plone40/src/Products.kupu/Products/kupu/plone/tests/input/simple.in)



Failure in test testSameNoFilename (Products.kupu.plone.tests.test_html2captioned.TransformTestSubclass)
Traceback (most recent call last):
  File "/usr/local/python2.6/lib/python2.6/unittest.py", line 279, in run
    testMethod()
  File "/home/stefan/autotest/temp/python26-zope212-cmf22-plone40/src/Products.kupu/Products/kupu/plone/tests/test_html2captioned.py", line 82, in testSameNoFilename
    self.do_convert()
  File "/home/stefan/autotest/temp/python26-zope212-cmf22-plone40/src/Products.kupu/Products/kupu/plone/tests/test_html2captioned.py", line 71, in do_convert
    got, expected, self.transform.name(), self.input))
  File "/usr/local/python2.6/lib/python2.6/unittest.py", line 350, in failUnlessEqual
    (msg or '%r != %r' % (first, second))
AssertionError: Got:
[<div>Simple text containing an embedded image</div><dl class="image-left captioned"><dt><img src="http://nohost/plone/folder/gamma/image" alt="Kupu Test Image" title="Kupu Test Image" height="331" width="500" /></dt><dd class="image-caption" style="width:500px">Test image caption</dd></dl><dl class="image-left captioned"><dt><img src="http://nohost/plone/folder/gamma/image_thumb" alt="Kupu Test Image" title="Kupu Test Image" height="84" width="128" /></dt><dd class="image-caption" style="width:500px">Test image caption</dd></dl><dl class="image-left captioned"><dt><img src="http://nohost/plone/folder/gamma/image" alt="Kupu Test Image" title="Kupu Test Image" height="331" width="500" /></dt><dd class="image-caption" style="width:500px">Test image caption</dd></dl>]

!=

Expected:
[<div>Simple text containing an embedded image</div><dl class="image-left captioned"><dt><img src="http://nohost/plone/folder/gamma/image" alt="Kupu Test Image" title="Kupu Test Image" height="331" width="500" /></dt><dd class="image-caption" style="width:500px">Test image caption</dd></dl><dl class="image-left captioned"><dt><a rel="lightbox" href="/plone/folder/gamma"><img src="http://nohost/plone/folder/gamma/image_thumb" alt="Kupu Test Image" title="Kupu Test Image" height="84" width="128" /></a></dt><dd class="image-caption" style="width:128px">Test image caption</dd></dl><dl class="image-left captioned"><dt><img src="http://nohost/plone/folder/gamma/image" alt="Kupu Test Image" title="Kupu Test Image" height="331" width="500" /></dt><dd class="image-caption" style="width:500px">Test image caption</dd></dl>]

IN html_to_captioned(/home/stefan/autotest/temp/python26-zope212-cmf22-plone40/src/Products.kupu/Products/kupu/plone/tests/input/simple.in)



Failure in test testSame (Products.kupu.plone.tests.test_html2captioned.TransformTestSubclass)
Traceback (most recent call last):
  File "/usr/local/python2.6/lib/python2.6/unittest.py", line 279, in run
    testMethod()
  File "/home/stefan/autotest/temp/python26-zope212-cmf22-plone40/src/Products.kupu/Products/kupu/plone/tests/test_html2captioned.py", line 78, in testSame
    self.do_convert(filename=self.input)
  File "/home/stefan/autotest/temp/python26-zope212-cmf22-plone40/src/Products.kupu/Products/kupu/plone/tests/test_html2captioned.py", line 71, in do_convert
    got, expected, self.transform.name(), self.input))
  File "/usr/local/python2.6/lib/python2.6/unittest.py", line 350, in failUnlessEqual
    (msg or '%r != %r' % (first, second))
AssertionError: Got:
[<div>Simple text containing an embedded image</div><dl class="image-left captioned"><dt><img src="http://nohost/plone/folder/umlauts/image" alt="Kupu Test Image åäö" title="Kupu Test Image åäö" height="331" width="500" /></dt><dd class="image-caption" style="width:500px">Test image caption åäö</dd></dl><dl class="image-left captioned"><dt><img src="http://nohost/plone/folder/umlauts/image_thumb" alt="Kupu Test Image åäö" title="Kupu Test Image åäö" height="84" width="128" /></dt><dd class="image-caption" style="width:500px">Test image caption åäö</dd></dl><dl class="image-left captioned"><dt><img src="http://nohost/plone/folder/umlauts/image" alt="Kupu Test Image åäö" title="Kupu Test Image åäö" height="331" width="500" /></dt><dd class="image-caption" style="width:500px">Test image caption åäö</dd></dl>]

!=

Expected:
[<div>Simple text containing an embedded image</div><dl class="image-left captioned"><dt><img src="http://nohost/plone/folder/umlauts/image" alt="Kupu Test Image åäö" title="Kupu Test Image åäö" height="331" width="500" /></dt><dd class="image-caption" style="width:500px">Test image caption åäö</dd></dl><dl class="image-left captioned"><dt><a rel="lightbox" href="/plone/folder/umlauts"><img src="http://nohost/plone/folder/umlauts/image_thumb" alt="Kupu Test Image åäö" title="Kupu Test Image åäö" height="84" width="128" /></a></dt><dd class="image-caption" style="width:128px">Test image caption åäö</dd></dl><dl class="image-left captioned"><dt><img src="http://nohost/plone/folder/umlauts/image" alt="Kupu Test Image åäö" title="Kupu Test Image åäö" height="331" width="500" /></dt><dd class="image-caption" style="width:500px">Test image caption åäö</dd></dl>]

IN html_to_captioned(/home/stefan/autotest/temp/python26-zope212-cmf22-plone40/src/Products.kupu/Products/kupu/plone/tests/input/umlauts.in)



Failure in test testSameNoFilename (Products.kupu.plone.tests.test_html2captioned.TransformTestSubclass)
Traceback (most recent call last):
  File "/usr/local/python2.6/lib/python2.6/unittest.py", line 279, in run
    testMethod()
  File "/home/stefan/autotest/temp/python26-zope212-cmf22-plone40/src/Products.kupu/Products/kupu/plone/tests/test_html2captioned.py", line 82, in testSameNoFilename
    self.do_convert()
  File "/home/stefan/autotest/temp/python26-zope212-cmf22-plone40/src/Products.kupu/Products/kupu/plone/tests/test_html2captioned.py", line 71, in do_convert
    got, expected, self.transform.name(), self.input))
  File "/usr/local/python2.6/lib/python2.6/unittest.py", line 350, in failUnlessEqual
    (msg or '%r != %r' % (first, second))
AssertionError: Got:
[<div>Simple text containing an embedded image</div><dl class="image-left captioned"><dt><img src="http://nohost/plone/folder/umlauts/image" alt="Kupu Test Image åäö" title="Kupu Test Image åäö" height="331" width="500" /></dt><dd class="image-caption" style="width:500px">Test image caption åäö</dd></dl><dl class="image-left captioned"><dt><img src="http://nohost/plone/folder/umlauts/image_thumb" alt="Kupu Test Image åäö" title="Kupu Test Image åäö" height="84" width="128" /></dt><dd class="image-caption" style="width:500px">Test image caption åäö</dd></dl><dl class="image-left captioned"><dt><img src="http://nohost/plone/folder/umlauts/image" alt="Kupu Test Image åäö" title="Kupu Test Image åäö" height="331" width="500" /></dt><dd class="image-caption" style="width:500px">Test image caption åäö</dd></dl>]

!=

Expected:
[<div>Simple text containing an embedded image</div><dl class="image-left captioned"><dt><img src="http://nohost/plone/folder/umlauts/image" alt="Kupu Test Image åäö" title="Kupu Test Image åäö" height="331" width="500" /></dt><dd class="image-caption" style="width:500px">Test image caption åäö</dd></dl><dl class="image-left captioned"><dt><a rel="lightbox" href="/plone/folder/umlauts"><img src="http://nohost/plone/folder/umlauts/image_thumb" alt="Kupu Test Image åäö" title="Kupu Test Image åäö" height="84" width="128" /></a></dt><dd class="image-caption" style="width:128px">Test image caption åäö</dd></dl><dl class="image-left captioned"><dt><img src="http://nohost/plone/folder/umlauts/image" alt="Kupu Test Image åäö" title="Kupu Test Image åäö" height="331" width="500" /></dt><dd class="image-caption" style="width:500px">Test image caption åäö</dd></dl>]

IN html_to_captioned(/home/stefan/autotest/temp/python26-zope212-cmf22-plone40/src/Products.kupu/Products/kupu/plone/tests/input/umlauts.in)



Error in test test_delete (Products.kupu.plone.tests.test_librarymanager.TestILibraryManager)
Traceback (most recent call last):
  File "/usr/local/python2.6/lib/python2.6/unittest.py", line 279, in run
    testMethod()
  File "/home/stefan/autotest/temp/python26-zope212-cmf22-plone40/src/Products.kupu/Products/kupu/plone/tests/test_librarymanager.py", line 102, in test_delete
    self.assertEqual(libs.getLibraries(self.context), expected)
  File "/home/stefan/autotest/temp/python26-zope212-cmf22-plone40/src/Products.kupu/Products/kupu/plone/librarytool.py", line 85, in getLibraries
    lib[key] = self.translate(lib[key], domain='kupu')
AttributeError: translate



Error in test test_expressions (Products.kupu.plone.tests.test_librarymanager.TestILibraryManager)
Traceback (most recent call last):
  File "/usr/local/python2.6/lib/python2.6/unittest.py", line 279, in run
    testMethod()
  File "/home/stefan/autotest/temp/python26-zope212-cmf22-plone40/src/Products.kupu/Products/kupu/plone/tests/test_librarymanager.py", line 90, in test_expressions
    v = libs.getLibraries(context)
  File "/home/stefan/autotest/temp/python26-zope212-cmf22-plone40/src/Products.kupu/Products/kupu/plone/librarytool.py", line 85, in getLibraries
    lib[key] = self.translate(lib[key], domain='kupu')
AttributeError: translate



Error in test test_get_library (Products.kupu.plone.tests.test_librarymanager.TestILibraryManager)
Traceback (most recent call last):
  File "/usr/local/python2.6/lib/python2.6/unittest.py", line 279, in run
    testMethod()
  File "/home/stefan/autotest/temp/python26-zope212-cmf22-plone40/src/Products.kupu/Products/kupu/plone/tests/test_librarymanager.py", line 67, in test_get_library
    self.assertEqual(libs.getLibraries(self.context), expected)
  File "/home/stefan/autotest/temp/python26-zope212-cmf22-plone40/src/Products.kupu/Products/kupu/plone/librarytool.py", line 85, in getLibraries
    lib[key] = self.translate(lib[key], domain='kupu')
AttributeError: translate



Error in test test_move (Products.kupu.plone.tests.test_librarymanager.TestILibraryManager)
Traceback (most recent call last):
  File "/usr/local/python2.6/lib/python2.6/unittest.py", line 279, in run
    testMethod()
  File "/home/stefan/autotest/temp/python26-zope212-cmf22-plone40/src/Products.kupu/Products/kupu/plone/tests/test_librarymanager.py", line 143, in test_move
    self.assertEqual(libs.getLibraries(self.context), expected)
  File "/home/stefan/autotest/temp/python26-zope212-cmf22-plone40/src/Products.kupu/Products/kupu/plone/librarytool.py", line 85, in getLibraries
    lib[key] = self.translate(lib[key], domain='kupu')
AttributeError: translate



Error in test test_update (Products.kupu.plone.tests.test_librarymanager.TestILibraryManager)
Traceback (most recent call last):
  File "/usr/local/python2.6/lib/python2.6/unittest.py", line 279, in run
    testMethod()
  File "/home/stefan/autotest/temp/python26-zope212-cmf22-plone40/src/Products.kupu/Products/kupu/plone/tests/test_librarymanager.py", line 130, in test_update
    self.assertEqual(libs.getLibraries(context), expected)
  File "/home/stefan/autotest/temp/python26-zope212-cmf22-plone40/src/Products.kupu/Products/kupu/plone/librarytool.py", line 85, in getLibraries
    lib[key] = self.translate(lib[key], domain='kupu')
AttributeError: translate

  Ran 373 tests with 4 failures and 5 errors in 14.781 seconds.
Running zope.testing.testrunner.layer.UnitTests tests:
  Tear down Products.PloneTestCase.layer.PloneSite in 0.383 seconds.
  Tear down Products.PloneTestCase.layer.ZCML in 0.004 seconds.
  Tear down Testing.ZopeTestCase.layer.ZopeLite in 0.000 seconds.
  Set up zope.testing.testrunner.layer.UnitTests in 0.000 seconds.
  Ran 8 tests with 0 failures and 0 errors in 0.001 seconds.
Tearing down left over layers:
  Tear down zope.testing.testrunner.layer.UnitTests in 0.000 seconds.
Total: 384 tests, 4 failures, 5 errors in 23.434 seconds.
Running archetypes.referencebrowserwidget.tests.base.layer tests:
  Set up Testing.ZopeTestCase.layer.ZopeLite in 0.000 seconds.
  Set up Products.PloneTestCase.layer.ZCML in 1.810 seconds.
  Set up Products.PloneTestCase.layer.PloneSite in 4.644 seconds.
  Set up archetypes.referencebrowserwidget.tests.base.layer in 0.000 seconds.


Failure in test test_requiredbehavior_multi (archetypes.referencebrowserwidget.tests.test_product.ProductsTestCase)
Traceback (most recent call last):
  File "/usr/local/python2.6/lib/python2.6/unittest.py", line 279, in run
    testMethod()
  File "/home/stefan/autotest/temp/python26-zope212-cmf22-plone40/src/archetypes.referencebrowserwidget/src/archetypes/referencebrowserwidget/tests/test_product.py", line 97, in test_requiredbehavior_multi
    assert len(value) == 2
AssertionError

  Ran 43 tests with 1 failures and 0 errors in 7.750 seconds.
Running zope.testing.testrunner.layer.UnitTests tests:
  Tear down archetypes.referencebrowserwidget.tests.base.layer in 0.000 seconds.
  Tear down Products.PloneTestCase.layer.PloneSite in 0.364 seconds.
  Tear down Products.PloneTestCase.layer.ZCML in 0.007 seconds.
  Tear down Testing.ZopeTestCase.layer.ZopeLite in 0.000 seconds.
  Set up zope.testing.testrunner.layer.UnitTests in 0.000 seconds.
  Ran 4 tests with 0 failures and 0 errors in 0.001 seconds.
Tearing down left over layers:
  Tear down zope.testing.testrunner.layer.UnitTests in 0.000 seconds.
Total: 47 tests, 1 failures, 0 errors in 15.064 seconds.
Running archetypes.schemaextender.tests.testIntegration.layer tests:
  Set up Testing.ZopeTestCase.layer.ZopeLite in 1.258 seconds.
  Set up Products.PloneTestCase.layer.ZCML in 2.389 seconds.
  Set up Products.PloneTestCase.layer.PloneSite in 4.089 seconds.
  Set up archetypes.schemaextender.tests.testIntegration.layer in 0.000 seconds.


Failure in test /home/stefan/autotest/temp/python26-zope212-cmf22-plone40/eggs/archetypes.schemaextender-1.4-py2.6.egg/archetypes/schemaextender/usage.txt
Failed doctest test for usage.txt
  File "/home/stefan/autotest/temp/python26-zope212-cmf22-plone40/eggs/archetypes.schemaextender-1.4-py2.6.egg/archetypes/schemaextender/usage.txt", line 0

----------------------------------------------------------------------
File "/home/stefan/autotest/temp/python26-zope212-cmf22-plone40/eggs/archetypes.schemaextender-1.4-py2.6.egg/archetypes/schemaextender/usage.txt", line 259, in usage.txt
Failed example:
    browser.getControl('Tags').value
Differences (ndiff with -expected +actual):
    - 'A\nB'
    + 'A\r\nB'
    ?   ++

  Ran 17 tests with 1 failures and 0 errors in 3.056 seconds.
Running zope.testing.testrunner.layer.UnitTests tests:
  Tear down archetypes.schemaextender.tests.testIntegration.layer in 0.000 seconds.
  Tear down Products.PloneTestCase.layer.PloneSite in 0.366 seconds.
  Tear down Products.PloneTestCase.layer.ZCML in 0.007 seconds.
  Tear down Testing.ZopeTestCase.layer.ZopeLite in 0.000 seconds.
  Set up zope.testing.testrunner.layer.UnitTests in 0.000 seconds.
  Ran 19 tests with 0 failures and 0 errors in 0.007 seconds.
Tearing down left over layers:
  Tear down zope.testing.testrunner.layer.UnitTests in 0.000 seconds.
Total: 36 tests, 1 failures, 0 errors in 11.600 seconds.
Running zope.testing.testrunner.layer.UnitTests tests:
  Set up zope.testing.testrunner.layer.UnitTests in 0.000 seconds.
  Ran 4 tests with 0 failures and 0 errors in 0.039 seconds.
Tearing down left over layers:
  Tear down zope.testing.testrunner.layer.UnitTests in 0.000 seconds.
Running Testing.ZopeTestCase.layer.ZopeLite tests:
  Set up Testing.ZopeTestCase.layer.ZopeLite in 0.036 seconds.
  Ran 40 tests with 0 failures and 0 errors in 0.753 seconds.
Tearing down left over layers:
  Tear down Testing.ZopeTestCase.layer.ZopeLite in 0.000 seconds.
/home/stefan/autotest/temp/python26-zope212-cmf22-plone40/src/kss.core/kss/core/tests/test_kssview_core.py:165: UserWarning: The test_class you are using doesn't subclass from ZopeTestCase.Functional. Please fix that.
  tearDown=KSSViewTestCase.beforeTearDown.im_func))
Running Testing.ZopeTestCase.layer.ZopeLite tests:
  Set up Testing.ZopeTestCase.layer.ZopeLite in 0.048 seconds.
  Ran 1 tests with 0 failures and 0 errors in 0.256 seconds.
Running kss.core.tests.base.KSSLayer tests:
  Tear down Testing.ZopeTestCase.layer.ZopeLite in 0.000 seconds.
  Set up kss.core.tests.base.KSSCoreLayer in 0.030 seconds.
  Set up kss.core.tests.base.KSSLayer in 0.056 seconds.
  Ran 29 tests with 0 failures and 0 errors in 0.154 seconds.
Running kss.core.tests.test_ttwapi.layer tests:
  Set up kss.core.tests.test_ttwapi.layer in 0.001 seconds.
  Ran 3 tests with 0 failures and 0 errors in 0.026 seconds.
Running zope.testing.testrunner.layer.UnitTests tests:
  Tear down kss.core.tests.test_ttwapi.layer in 0.000 seconds.
  Tear down kss.core.tests.base.KSSLayer in 0.000 seconds.
  Tear down kss.core.tests.base.KSSCoreLayer in 0.000 seconds.
  Set up zope.testing.testrunner.layer.UnitTests in 0.000 seconds.
/home/stefan/autotest/temp/python26-zope212-cmf22-plone40/src/kss.core/kss/core/siteview.txt:1: DeprecationWarning: ISite is deprecated. Moved to zope.location.interfaces. Importing from here will stop working in Zope 3.6
  =========
  Ran 14 tests with 0 failures and 0 errors in 0.009 seconds.
Tearing down left over layers:
  Tear down zope.testing.testrunner.layer.UnitTests in 0.000 seconds.
Total: 47 tests, 0 failures, 0 errors in 0.886 seconds.
***********************************************
WARNING: LinguaPlone not found. Skipping tests.
***********************************************
***********************************************
WARNING: LinguaPlone not found. Skipping tests.
***********************************************
Running plone.app.blob.tests.layer.BlobLayer tests:
  Set up Testing.ZopeTestCase.layer.ZopeLite in 0.903 seconds.
  Set up Products.PloneTestCase.layer.ZCML in 2.339 seconds.
  Set up Products.PloneTestCase.layer.PloneSite in 4.082 seconds.
  Set up plone.app.blob.tests.layer.BlobLayer in 0.102 seconds.
/home/stefan/autotest/temp/python26-zope212-cmf22-plone40/eggs/Products.PortalTransforms-2.0a1-py2.6.egg/Products/PortalTransforms/libtransforms/commandtransform.py:97: DeprecationWarning: os.popen4 is deprecated.  Use the subprocess module.
  cin, couterr = os.popen4(command, 'b')
  Ran 28 tests with 0 failures and 0 errors in 2 minutes 1.360 seconds.
Running plone.app.blob.tests.layer.BlobReplacementLayer tests:
  Set up plone.app.blob.tests.layer.BlobReplacementLayer in 0.188 seconds.
  Ran 39 tests with 0 failures and 0 errors in 49.627 seconds.
Running zope.testing.testrunner.layer.UnitTests tests:
  Tear down plone.app.blob.tests.layer.BlobReplacementLayer in 0.000 seconds.
  Tear down plone.app.blob.tests.layer.BlobLayer in 0.000 seconds.
  Tear down Products.PloneTestCase.layer.PloneSite in 0.352 seconds.
  Tear down Products.PloneTestCase.layer.ZCML in 0.009 seconds.
  Tear down Testing.ZopeTestCase.layer.ZopeLite in 0.000 seconds.
  Set up zope.testing.testrunner.layer.UnitTests in 0.000 seconds.
  Ran 2 tests with 0 failures and 0 errors in 0.001 seconds.
Tearing down left over layers:
  Tear down zope.testing.testrunner.layer.UnitTests in 0.000 seconds.
Total: 69 tests, 0 failures, 0 errors in 2 minutes 59.681 seconds.
Running Testing.ZopeTestCase.layer.ZopeLite tests:
  Set up Testing.ZopeTestCase.layer.ZopeLite in 0.891 seconds.
  Ran 2 tests with 0 failures and 0 errors in 0.008 seconds.
Running plone.app.folder.tests.layer.IntegrationLayer tests:
  Set up Products.PloneTestCase.layer.ZCML in 2.394 seconds.
  Set up Products.PloneTestCase.layer.PloneSite in 3.936 seconds.
  Set up plone.app.folder.tests.layer.IntegrationLayer in 0.464 seconds.
  Ran 9 tests with 0 failures and 0 errors in 2.115 seconds.
Running plone.app.folder.tests.layer.PartialOrderingIntegrationLayer tests:
  Set up plone.app.folder.tests.layer.PartialOrderingIntegrationLayer in 0.000 seconds.
  Ran 3 tests with 0 failures and 0 errors in 0.314 seconds.
Tearing down left over layers:
  Tear down plone.app.folder.tests.layer.PartialOrderingIntegrationLayer in 0.000 seconds.
  Tear down plone.app.folder.tests.layer.IntegrationLayer in 0.000 seconds.
  Tear down Products.PloneTestCase.layer.PloneSite in 0.364 seconds.
  Tear down Products.PloneTestCase.layer.ZCML in 0.004 seconds.
  Tear down Testing.ZopeTestCase.layer.ZopeLite in 0.000 seconds.
Total: 14 tests, 0 failures, 0 errors in 11.057 seconds.
Running plone.app.imaging.tests.layer.ImagingLayer tests:
  Set up Testing.ZopeTestCase.layer.ZopeLite in 1.062 seconds.
  Set up Products.PloneTestCase.layer.ZCML in 2.386 seconds.
  Set up Products.PloneTestCase.layer.PloneSite in 4.106 seconds.
  Set up plone.app.imaging.tests.layer.ImagingLayer in 0.101 seconds.


Failure in test /home/stefan/autotest/temp/python26-zope212-cmf22-plone40/src/plone.app.imaging/src/plone/app/imaging/tests/configlet.txt
Failed doctest test for configlet.txt
  File "/home/stefan/autotest/temp/python26-zope212-cmf22-plone40/src/plone.app.imaging/src/plone/app/imaging/tests/configlet.txt", line 0

----------------------------------------------------------------------
File "/home/stefan/autotest/temp/python26-zope212-cmf22-plone40/src/plone.app.imaging/src/plone/app/imaging/tests/configlet.txt", line 24, in configlet.txt
Failed example:
    self.browser.contents
Expected:
    '...Add-on Product Configuration...
     ...<img src="http://nohost/plone/image_icon.gif"...
     ...Image Handling...'
Got:
    '\n\n\n  \n<!DOCTYPE html PUBLIC\n  "-//W3C//DTD XHTML 1.0 Transitional//EN"\n  "http://www.w3.org/TR/xhtml1/DTD/xhtml1-transitional.dtd">\n\n<html xmlns="http://www.w3.org/1999/xhtml" lang="en">\n\n\n    \n    \n    \n    \n    \n\n\n\n<head>\n    <meta http-equiv="Content-Type" content="text/html; charset=utf-8" />\n\n    <!-- Forces IE8+ into newest rendering engine even if on an intranet. This has to be defined before any script/style tags. -->\n    <meta http-equiv="X-UA-Compatible" content="IE=edge" /> \n    <!-- Enables iPhone web app use, fullscreen when added to home screen -->\n    <meta name="apple-mobile-web-app-capable" content="yes" />\n\n    \n        <base href="http://nohost/plone/" /><!--[if lt IE 7]></base><![endif]-->\n    \n\n    \n\n<link rel="kss-base-url" href="http://nohost/plone/" />\n\n  \n    <link rel="stylesheet" type="text/css" media="screen" href="http://nohost/plone/portal_css/Sunburst%20Theme/member-cachekey3982.css" />\n    <link rel="stylesheet" type="text/css" href="http://nohost/plone/portal_css/Sunburst%20Theme/base-cachekey9515.css" />\n        <!--[if lt IE 8]>    \n    \n    <link rel="stylesheet" type="text/css" media="screen" href="http://nohost/plone/portal_css/Sunburst%20Theme/IEFixes-cachekey2187.css" />\n        <![endif]-->\n    \n    <link rel="stylesheet" type="text/css" media="all" href="http://nohost/plone/portal_css/Sunburst%20Theme/ploneCustom-cachekey0483.css" />\n\n  \n    <link rel="kinetic-stylesheet" type="text/css" href="http://nohost/plone/portal_kss/Sunburst%20Theme/resourcetinymce.ksstinymce-cachekey6650.kss" />\n    <link rel="kinetic-stylesheet" type="text/css" href="http://nohost/plone/portal_kss/Sunburst%20Theme/at-cachekey3654.kss" />\n  \n    <script type="text/javascript" src="http://nohost/plone/portal_javascripts/Sunburst%20Theme/jquery-cachekey3525.js"></script>\n    <script type="text/javascript" src="http://nohost/plone/portal_javascripts/Sunburst%20Theme/sarissa-cachekey5325.js"></script>\n    <script type="text/javascript" src="http://nohost/plone/portal_javascripts/Sunburst%20Theme/dropdown-cachekey4179.js"></script>\n\n\n<title>Plone site</title>\n    \n    <link rel="author" href="http://nohost/plone/author/" title="Author information" />\n\n\n\n    <link rel="shortcut icon" type="image/x-icon" href="http://nohost/plone/favicon.ico" />\n\n\n\n    <link rel="home" href="http://nohost/plone" title="Front page" />\n\n    <link rel="contents" href="http://nohost/plone/sitemap" title="Site Map" />\n\n\n\n\n\n\n    <link rel="search" href="http://nohost/plone/search_form" title="Search this site" />\n\n\n\n    \n    \n    \n    \n    \n\n    <meta name="viewport" content="width=320; initial-scale=0.6666; maximum-scale=1.0; minimum-scale=0.6666" />\n    <meta name="generator" content="Plone - http://plone.org" />\n</head>\n\n<!-- TODO: Can we do this in the @@plone view? -->\n<body class=" template-imaging-controlpanel" dir="ltr">\n\n<div id="visual-portal-wrapper">\n\n        <div id="portal-top" class="row">\n<div class="cell width-full position-0"> <!-- TODO: Temporary, this one should be in the template that is inserted -->\n            <div id="portal-header">\n    <p class="hiddenStructure">\n  <a accesskey="2" href="http://nohost/plone/@@imaging-controlpanel#documentContent">Skip to content.</a> |\n\n  <a accesskey="6" href="http://nohost/plone/@@imaging-controlpanel#portlet-navigation-tree">Skip to navigation</a>\n</p>\n\n<div id="portal-searchbox">\n    <form name="searchform" action="http://nohost/plone/search">\n\n        <label for="searchGadget" class="hiddenStructure">Search Site</label>\n\n        <div class="LSBox">\n        <input name="SearchableText" type="text" size="18" title="Search Site" accesskey="4" class="inputLabel" id="searchGadget" />\n\n        <input class="searchButton" type="submit" value="Search" />\n    \n        <div class="searchSection">\n            <input id="searchbox_currentfolder_only" class="noborder" type="checkbox" name="path" value="/plone" />\n            <label for="searchbox_currentfolder_only" style="cursor: pointer">\n                only in current section\n            </label>\n        </div>\n\n        <div class="LSResult" id="LSResult" style=""><div class="LSShadow" id="LSShadow"></div></div>\n        </div>\n    </form>\n\n    <div id="portal-advanced-search" class="hiddenStructure">\n        <a href="http://nohost/plone/search_form" accesskey="5">\n            Advanced Search&hellip;\n        </a>\n    </div>\n\n</div>\n\n<a id="portal-logo" accesskey="1" href="http://nohost/plone">\n    <img src="http://nohost/plone/logo.png" alt="" title="" height="56" width="215" /></a>\n\n\n    <h5 class="hiddenStructure">Sections</h5>\n\n    <ul id="portal-globalnav"><li id="portaltab-index_html" class="selected"><a href="http://nohost/plone" title="">Home</a></li><li id="portaltab-news" class="plain"><a href="http://nohost/plone/news" title="Site News">News</a></li><li id="portaltab-events" class="plain"><a href="http://nohost/plone/events" title="Site Events">Events</a></li><li id="portaltab-Members" class="plain"><a href="http://nohost/plone/Members" title="Container for users\' home directories">Users</a></li></ul>\n\n</div>\n\n<div id="portal-personaltools-wrapper">\n\n<h5 class="hiddenStructure">Personal tools</h5>\n\n<dl class="actionMenu" id="portal-personaltools">\n   <!-- TODO: Can we nest these in a better way? -->\n  <dt class="actionMenuHeader">\n    <!-- The following a-tag needs to be clicked to dropdown the menu -->\n    <a id="user-name" href="http://nohost/plone/dashboard">root</a>\n  </dt>\n  <dd class="actionMenuContent">\n    <ul>\n        <li>\n            <a href="http://nohost/plone/dashboard">Dashboard</a>\n        </li>\n    </ul>\n    <ul>\n        <li>\n            <a href="http://nohost/plone/personalize_form">Preferences</a>\n        </li>\n    </ul>\n    <ul>\n        <li>\n            <a href="http://nohost/plone/plone_control_panel">Site Setup</a>\n        </li>\n    </ul>\n    <ul>\n        <li>\n            <a href="http://nohost/plone/logout">Log out</a>\n        </li>\n    </ul>\n  </dd>\n  \n</dl>\n\n\n\n</div>\n\n\n    \n\n\n</div>\n        </div>\n    <div id="portal-columns" class="row">\n\n        <!-- TODO: There is probably be a more elegant way to do this ;) -->\n        \n        \n          <div id="portal-column-content" class="cell position-1:4 width-3:4">\n          \n          \n            <div class="">\n\n                \n    \n                <div id="region-content" class="documentContent">\n\n                    <a name="documentContent"></a>\n\n                    \n\n    <dl class="portalMessage info" id="kssPortalMessage" style="display:none">\n        <dt>Info</dt>\n        <dd></dd>\n    </dl>\n\n\n\n                    <div id="viewlet-above-content"></div>\n\n                    \n                        <div id="content">\n                                \n                            \n                            \n                <div>\n\n    <div>\n\n        <div id="viewspace">\n\n            \n\n                \n\n            \n\n            <h1 class="documentFirstHeading">Image handling settings</h1>\n\n            <a href="http://nohost/plone/plone_control_panel" class="link-parent">\n                Up to Site Setup\n            </a>\n\n            <p>Settings to configure image handling in Plone.</p>\n\n            <form action="http://nohost/plone/@@imaging-controlpanel" method="post" class="edit-form enableUnloadProtection" enctype="multipart/form-data" id="zc.page.browser_form">\n\n                <input type="hidden" name="fieldset.current" value="" />\n\n                \n\n                <fieldset>\n                    <legend>Imaging scaling</legend>\n                    \n\n                        <div class="field">\n\t\t\t  \n                            <label for="form.allowed_sizes">Allowed image sizes</label>\n\n                            \n\n                            <div class="formHelp">Specify all allowed maximum image dimensions, one per line. The required format is &lt;name&gt; &lt;width&gt;:&lt;height&gt;.</div>\n\n                            \n\n                            <div class="widget"><table border="0" class="sequencewidget">\n  <tr>\n    <td>\n      <input class="editcheck" type="checkbox" name="form.allowed_sizes.remove_0" />\n    </td>\n    <td>\n      \n      <input class="textType" id="form.allowed_sizes.0." name="form.allowed_sizes.0." size="20" type="text" value="large 768:768"  />\n    </td>\n  </tr>\n  <tr>\n    <td>\n      <input class="editcheck" type="checkbox" name="form.allowed_sizes.remove_1" />\n    </td>\n    <td>\n      \n      <input class="textType" id="form.allowed_sizes.1." name="form.allowed_sizes.1." size="20" type="text" value="preview 400:400"  />\n    </td>\n  </tr>\n  <tr>\n    <td>\n      <input class="editcheck" type="checkbox" name="form.allowed_sizes.remove_2" />\n    </td>\n    <td>\n      \n      <input class="textType" id="form.allowed_sizes.2." name="form.allowed_sizes.2." size="20" type="text" value="mini 200:200"  />\n    </td>\n  </tr>\n  <tr>\n    <td>\n      <input class="editcheck" type="checkbox" name="form.allowed_sizes.remove_3" />\n    </td>\n    <td>\n      \n      <input class="textType" id="form.allowed_sizes.3." name="form.allowed_sizes.3." size="20" type="text" value="thumb 128:128"  />\n    </td>\n  </tr>\n  <tr>\n    <td>\n      <input class="editcheck" type="checkbox" name="form.allowed_sizes.remove_4" />\n    </td>\n    <td>\n      \n      <input class="textType" id="form.allowed_sizes.4." name="form.allowed_sizes.4." size="20" type="text" value="tile 64:64"  />\n    </td>\n  </tr>\n  <tr>\n    <td>\n      <input class="editcheck" type="checkbox" name="form.allowed_sizes.remove_5" />\n    </td>\n    <td>\n      \n      <input class="textType" id="form.allowed_sizes.5." name="form.allowed_sizes.5." size="20" type="text" value="icon 32:32"  />\n    </td>\n  </tr>\n  <tr>\n    <td>\n      <input class="editcheck" type="checkbox" name="form.allowed_sizes.remove_6" />\n    </td>\n    <td>\n      \n      <input class="textType" id="form.allowed_sizes.6." name="form.allowed_sizes.6." size="20" type="text" value="listing 16:16"  />\n    </td>\n  </tr>\n  <tr>\n    <td colspan="2">\n      <input type="submit" value="Remove selected items" name="form.allowed_sizes.remove" />\n      <input type="submit" value="Add Allowed image sizes" name="form.allowed_sizes.add" />\n    </td>\n  </tr>\n</table>\n<input type="hidden" name="form.allowed_sizes.count" value="7" />\n</div>\n                        </div>\n\n                    \n\n                </fieldset>\n\n\n                \n\n                <div class="visualClear"><!-- --></div>\n\n                <div id="actionsView" class="formControls">\n                    <span class="actionButtons">\n                        <input type="submit" id="form.actions.save" name="form.actions.save" value="Save" class="context" />\n                        <input type="submit" id="form.actions.cancel" name="form.actions.cancel" value="Cancel" class="context" />\n                    </span>\n                </div>\n\n                <input type="hidden" name="_authenticator" value="bbaa584df3d31bca74caf7445bd1381302e9d9a1"/>\n\n            </form>\n        </div>\n\n        \n\n    </div>\n\n</div>\n              \n                        </div>\n                    \n\n                    \n                        \n\n                    \n                </div>\n            </div>\n      \n          \n          </div>      \n        \n    \n\n        \n        \n            <div id="portal-column-one" class="cell position-0 width-1:4">\n                \n\n<div class="visualPadding">\n\n<dl class="portlet" id="portlet-prefs">\n    <dt class="portletHeader">\n        <span class="portletTopLeft"></span>\n        <a href="http://nohost/plone/plone_control_panel">Site Setup</a>\n        <span class="portletTopRight"></span>\n    </dt>\n\n    <dd class="portletItem">\n\n        \n            <strong>Plone Configuration</strong>\n            <ul class="configlets">\n                \n                <li>\n                    <a href="http://nohost/plone/prefs_install_products_form">\n                        <img src="http://nohost/plone/http://nohost/plone/product_icon.png" alt="" />\n                    Add-ons\n                    </a>\n                </li>\n                \n                \n                <li>\n                    <a href="http://nohost/plone/@@calendar-controlpanel">\n                        <img src="http://nohost/plone/http://nohost/plone/event_icon.png" alt="" />\n                    Calendar\n                    </a>\n                </li>\n                \n                \n                <li>\n                    <a href="http://nohost/plone/portal_atct/atct_manageTopicIndex">\n                        <img src="http://nohost/plone/http://nohost/plone/topic_icon.png" alt="" />\n                    Collections\n                    </a>\n                </li>\n                \n                \n                <li>\n                    <a href="http://nohost/plone/@@rules-controlpanel">\n                        <img src="http://nohost/plone/http://nohost/plone/contentrules_icon.png" alt="" />\n                    Content Rules\n                    </a>\n                </li>\n                \n                \n                <li>\n                    <a href="http://nohost/plone/prefs_error_log_form">\n                        <img src="http://nohost/plone/http://nohost/plone/error_log_icon.png" alt="" />\n                    Errors\n                    </a>\n                </li>\n                \n                \n                <li>\n                    <a href="http://nohost/plone/@@filter-controlpanel">\n                        <img src="http://nohost/plone/http://nohost/plone/htmlfilter_icon.png" alt="" />\n                    HTML Filtering\n                    </a>\n                </li>\n                \n                \n                <li>\n                    <a href="http://nohost/plone/@@language-controlpanel">\n                        <img src="http://nohost/plone/http://nohost/plone/flag-plone.png" alt="" />\n                    Language\n                    </a>\n                </li>\n                \n                \n                <li>\n                    <a href="http://nohost/plone/@@mail-controlpanel">\n                        <img src="http://nohost/plone/http://nohost/plone/mail_icon.png" alt="" />\n                    Mail\n                    </a>\n                </li>\n                \n                \n                <li>\n                    <a href="http://nohost/plone/@@maintenance-controlpanel">\n                        <img src="http://nohost/plone/http://nohost/plone/maintenance_icon.png" alt="" />\n                    Maintenance\n                    </a>\n                </li>\n                \n                \n                <li>\n                    <a href="http://nohost/plone/@@markup-controlpanel">\n                        <img src="http://nohost/plone/http://nohost/plone/edit.png" alt="" />\n                    Markup\n                    </a>\n                </li>\n                \n                \n                <li>\n                    <a href="http://nohost/plone/prefs_navigation_form">\n                        <img src="http://nohost/plone/http://nohost/plone/navigation_icon.png" alt="" />\n                    Navigation\n                    </a>\n                </li>\n                \n                \n                <li>\n                    <a href="http://nohost/plone/@@search-controlpanel">\n                        <img src="http://nohost/plone/http://nohost/plone/search_icon.png" alt="" />\n                    Search\n                    </a>\n                </li>\n                \n                \n                <li>\n                    <a href="http://nohost/plone/@@security-controlpanel">\n                        <img src="http://nohost/plone/http://nohost/plone/lock_icon.png" alt="" />\n                    Security\n                    </a>\n                </li>\n                \n                \n                <li>\n                    <a href="http://nohost/plone/@@site-controlpanel">\n                        <img src="http://nohost/plone/http://nohost/plone/logoIcon.png" alt="" />\n                    Site\n                    </a>\n                </li>\n                \n                \n                <li>\n                    <a href="http://nohost/plone/@@skins-controlpanel">\n                        <img src="http://nohost/plone/http://nohost/plone/skins_icon.png" alt="" />\n                    Themes\n                    </a>\n                </li>\n                \n                \n                <li>\n                    <a href="http://nohost/plone/portal_tinymce/@@tinymce-controlpanel">\n                        <img src="http://nohost/plone/http://nohost/plone/++resource++tinymce.images/tinymce_icon.gif" alt="" />\n                    TinyMCE Visual Editor\n                    </a>\n                </li>\n                \n                \n                <li>\n                    <a href="http://nohost/plone/@@types-controlpanel">\n                        <img src="http://nohost/plone/http://nohost/plone/document_icon.png" alt="" />\n                    Types\n                    </a>\n                </li>\n                \n                \n                <li>\n                    <a href="http://nohost/plone/@@usergroup-userprefs">\n                        <img src="http://nohost/plone/http://nohost/plone/group.png" alt="" />\n                    Users and Groups\n                    </a>\n                </li>\n                \n                \n                \n                \n                \n                <li>\n                    <a href="http://nohost/plone/manage_main">\n                        <img src="http://nohost/plone/http://nohost/plone/zope_icon.png" alt="" />\n                    Zope Management Interface\n                    </a>\n                </li>\n                \n            </ul>\n        \n        <span class="portletBottomLeft"></span>\n        <span class="portletBottomRight"></span>\n    </dd>\n    <dd class="portletItem">\n\n        \n            <strong>Add-on Configuration</strong>\n            <ul class="configlets">\n                \n                <li>\n                    <a href="http://nohost/plone/@@imaging-controlpanel">\n                        <img src="http://nohost/plone/image_icon.gif" alt="" />\n                    Image Handling\n                    </a>\n                </li>\n                \n            </ul>\n        \n        <span class="portletBottomLeft"></span>\n        <span class="portletBottomRight"></span>\n    </dd>\n\n</dl>\n\n</div>\n\n\n\n\n            </div>\n        \n    \n\n        \n    </div>\n\n<div class="visualClear"></div> <!-- TODO: Temporary workaround -->\n\n    <!-- TODO: Can we do this in the @@plone view? -->\n    <div class="row">\n        <a class="managePortletsFallback" href="http://nohost/plone/@@manage-portlets">\n            Manage portlets\n        </a>\n    </div>\n\n    \n<div class="row"> <!-- TODO: Also temporary, should be in the proper template -->\n    <div class="cell width-full position-0">\n        <div id="portal-footer">\n\n<p>\n    \n    The\n    <a href="http://plone.org">Plone<sup>&reg;</sup> CMS &mdash; Open Source Content Management System</a>\n    is\n    <acronym title="Copyright">&copy;</acronym>\n    2000-2009\n    by the\n    <a href="http://plone.org/foundation">Plone Foundation</a>\n    et al.\n    \n</p>\n\n<p>\n    \n    Plone<sup>&reg;</sup> and the Plone logo are registered trademarks of the\n        <a href="http://plone.org/foundation">Plone Foundation</a>.\n    \n\n    \n    Distributed under the\n        <a href="http://creativecommons.org/licenses/GPL/2.0/">GNU GPL license</a>.\n    \n</p>\n\n</div>\n\n<div id="portal-colophon">\n\n<div class="colophonWrapper">\n<ul>\n  <li>\n    <a href="http://plone.org" title="This site was built using Plone CMS, the Open Source Content Management System. Click for more information.">\n      Powered by Plone</a>\n  </li>\n</ul>\n</div>\n</div>\n\n<ul id="portal-siteactions">\n\n    <li id="siteaction-sitemap"><a href="http://nohost/plone/sitemap" accesskey="3" title="Site Map">Site Map</a></li>\n    <li id="siteaction-accessibility"><a href="http://nohost/plone/accessibility-info" accesskey="0" title="Accessibility">Accessibility</a></li>\n    <li id="siteaction-contact"><a href="http://nohost/plone/contact-info" accesskey="9" title="Contact">Contact</a></li>\n</ul>\n\n\n    </div>\n</div>\n    \n\n</div>\n\n<!-- TODO: This needs to go away. -->\n<!-- <div id="kss-spinner"><img tal:attributes="src string:${portal_url}/spinner.png" alt="" /></div> -->\n\n</body>\n</html>\n\n\n\n\n'

  Ran 34 tests with 1 failures and 0 errors in 3.873 seconds.
Running zope.testing.testrunner.layer.UnitTests tests:
  Tear down plone.app.imaging.tests.layer.ImagingLayer in 0.000 seconds.
  Tear down Products.PloneTestCase.layer.PloneSite in 0.372 seconds.
  Tear down Products.PloneTestCase.layer.ZCML in 0.005 seconds.
  Tear down Testing.ZopeTestCase.layer.ZopeLite in 0.000 seconds.
  Set up zope.testing.testrunner.layer.UnitTests in 0.000 seconds.
  Ran 7 tests with 0 failures and 0 errors in 0.001 seconds.
Tearing down left over layers:
  Tear down zope.testing.testrunner.layer.UnitTests in 0.000 seconds.
Total: 41 tests, 1 failures, 0 errors in 12.343 seconds.
Running Products.PloneTestCase.layer.PloneSite tests:
  Set up Testing.ZopeTestCase.layer.ZopeLite in 1.372 seconds.
  Set up Products.PloneTestCase.layer.ZCML in 2.377 seconds.
  Set up Products.PloneTestCase.layer.PloneSite in 4.090 seconds.
  Ran 7 tests with 0 failures and 0 errors in 0.072 seconds.
Tearing down left over layers:
  Tear down Products.PloneTestCase.layer.PloneSite in 0.369 seconds.
  Tear down Products.PloneTestCase.layer.ZCML in 0.004 seconds.
  Tear down Testing.ZopeTestCase.layer.ZopeLite in 0.000 seconds.
Total: 0 tests, 0 failures, 0 errors in 0.000 seconds.
Running Products.PloneTestCase.layer.PloneSite tests:
  Set up Testing.ZopeTestCase.layer.ZopeLite in 1.393 seconds.
  Set up Products.PloneTestCase.layer.ZCML in 2.291 seconds.
  Set up Products.PloneTestCase.layer.PloneSite in 4.080 seconds.
  Ran 3 tests with 0 failures and 0 errors in 1.134 seconds.
Tearing down left over layers:
  Tear down Products.PloneTestCase.layer.PloneSite in 0.355 seconds.
  Tear down Products.PloneTestCase.layer.ZCML in 0.004 seconds.
  Tear down Testing.ZopeTestCase.layer.ZopeLite in 0.000 seconds.
Running Products.PloneTestCase.layer.PloneSite tests:
  Set up Testing.ZopeTestCase.layer.ZopeLite in 1.646 seconds.
  Set up Products.PloneTestCase.layer.ZCML in 2.352 seconds.
  Set up Products.PloneTestCase.layer.PloneSite in 4.032 seconds.


Failure in test /home/stefan/autotest/temp/python26-zope212-cmf22-plone40/src/plone.app.users/plone/app/users/tests/flexible_user_registration.txt
Failed doctest test for flexible_user_registration.txt
  File "/home/stefan/autotest/temp/python26-zope212-cmf22-plone40/src/plone.app.users/plone/app/users/tests/flexible_user_registration.txt", line 0

----------------------------------------------------------------------
File "/home/stefan/autotest/temp/python26-zope212-cmf22-plone40/src/plone.app.users/plone/app/users/tests/flexible_user_registration.txt", line 10, in flexible_user_registration.txt
Failed example:
    form.getControl(name='form.location')
Exception raised:
    Traceback (most recent call last):
      File "/home/stefan/autotest/temp/python26-zope212-cmf22-plone40/eggs/zope.testing-3.7.7-py2.6.egg/zope/testing/doctest.py", line 1361, in __run
        compileflags, 1) in test.globs
      File "<doctest flexible_user_registration.txt[line 10, example 3]>", line 1, in <module>
        form.getControl(name='form.location')
      File "/home/stefan/autotest/temp/python26-zope212-cmf22-plone40/eggs/zope.testbrowser-3.6.0a2-py2.6.egg/zope/testbrowser/browser.py", line 755, in getControl
        control, form = disambiguate(intermediate, msg, index)
      File "/home/stefan/autotest/temp/python26-zope212-cmf22-plone40/eggs/zope.testbrowser-3.6.0a2-py2.6.egg/zope/testbrowser/browser.py", line 54, in disambiguate
        raise LookupError(msg)
    LookupError: name 'form.location'
----------------------------------------------------------------------
File "/home/stefan/autotest/temp/python26-zope212-cmf22-plone40/src/plone.app.users/plone/app/users/tests/flexible_user_registration.txt", line 12, in flexible_user_registration.txt
Failed example:
    form.getControl(name='form.home_page')
Exception raised:
    Traceback (most recent call last):
      File "/home/stefan/autotest/temp/python26-zope212-cmf22-plone40/eggs/zope.testing-3.7.7-py2.6.egg/zope/testing/doctest.py", line 1361, in __run
        compileflags, 1) in test.globs
      File "<doctest flexible_user_registration.txt[line 12, example 4]>", line 1, in <module>
        form.getControl(name='form.home_page')
      File "/home/stefan/autotest/temp/python26-zope212-cmf22-plone40/eggs/zope.testbrowser-3.6.0a2-py2.6.egg/zope/testbrowser/browser.py", line 755, in getControl
        control, form = disambiguate(intermediate, msg, index)
      File "/home/stefan/autotest/temp/python26-zope212-cmf22-plone40/eggs/zope.testbrowser-3.6.0a2-py2.6.egg/zope/testbrowser/browser.py", line 54, in disambiguate
        raise LookupError(msg)
    LookupError: name 'form.home_page'
----------------------------------------------------------------------
File "/home/stefan/autotest/temp/python26-zope212-cmf22-plone40/src/plone.app.users/plone/app/users/tests/flexible_user_registration.txt", line 22, in flexible_user_registration.txt
Failed example:
    'Member Registration' in browser.contents
Expected:
    True
Got:
    False
----------------------------------------------------------------------
File "/home/stefan/autotest/temp/python26-zope212-cmf22-plone40/src/plone.app.users/plone/app/users/tests/flexible_user_registration.txt", line 24, in flexible_user_registration.txt
Failed example:
    link = browser.getLink(url='http://nohost/plone/@@member-registration')
Exception raised:
    Traceback (most recent call last):
      File "/home/stefan/autotest/temp/python26-zope212-cmf22-plone40/eggs/zope.testing-3.7.7-py2.6.egg/zope/testing/doctest.py", line 1361, in __run
        compileflags, 1) in test.globs
      File "<doctest flexible_user_registration.txt[line 24, example 11]>", line 1, in <module>
        link = browser.getLink(url='http://nohost/plone/@@member-registration')
      File "/home/stefan/autotest/temp/python26-zope212-cmf22-plone40/eggs/zope.testbrowser-3.6.0a2-py2.6.egg/zope/testbrowser/browser.py", line 327, in getLink
        return Link(self.mech_browser.find_link(**args), self)
      File "build/bdist.linux-x86_64/egg/mechanize/_mechanize.py", line 626, in find_link
    LinkNotFoundError
----------------------------------------------------------------------
File "/home/stefan/autotest/temp/python26-zope212-cmf22-plone40/src/plone.app.users/plone/app/users/tests/flexible_user_registration.txt", line 25, in flexible_user_registration.txt
Failed example:
    link
Exception raised:
    Traceback (most recent call last):
      File "/home/stefan/autotest/temp/python26-zope212-cmf22-plone40/eggs/zope.testing-3.7.7-py2.6.egg/zope/testing/doctest.py", line 1361, in __run
        compileflags, 1) in test.globs
      File "<doctest flexible_user_registration.txt[line 25, example 12]>", line 1, in <module>
        link
    NameError: name 'link' is not defined
----------------------------------------------------------------------
File "/home/stefan/autotest/temp/python26-zope212-cmf22-plone40/src/plone.app.users/plone/app/users/tests/flexible_user_registration.txt", line 27, in flexible_user_registration.txt
Failed example:
    link.click()
Exception raised:
    Traceback (most recent call last):
      File "/home/stefan/autotest/temp/python26-zope212-cmf22-plone40/eggs/zope.testing-3.7.7-py2.6.egg/zope/testing/doctest.py", line 1361, in __run
        compileflags, 1) in test.globs
      File "<doctest flexible_user_registration.txt[line 27, example 13]>", line 1, in <module>
        link.click()
    NameError: name 'link' is not defined
----------------------------------------------------------------------
File "/home/stefan/autotest/temp/python26-zope212-cmf22-plone40/src/plone.app.users/plone/app/users/tests/flexible_user_registration.txt", line 28, in flexible_user_registration.txt
Failed example:
    'Registration settings' in browser.contents
Expected:
    True
Got:
    False
----------------------------------------------------------------------
File "/home/stefan/autotest/temp/python26-zope212-cmf22-plone40/src/plone.app.users/plone/app/users/tests/flexible_user_registration.txt", line 33, in flexible_user_registration.txt
Failed example:
    form = browser.getForm(action='http://nohost/plone/@@member-registration')
Exception raised:
    Traceback (most recent call last):
      File "/home/stefan/autotest/temp/python26-zope212-cmf22-plone40/eggs/zope.testing-3.7.7-py2.6.egg/zope/testing/doctest.py", line 1361, in __run
        compileflags, 1) in test.globs
      File "<doctest flexible_user_registration.txt[line 33, example 15]>", line 1, in <module>
        form = browser.getForm(action='http://nohost/plone/@@member-registration')
      File "/home/stefan/autotest/temp/python26-zope212-cmf22-plone40/eggs/zope.testbrowser-3.6.0a2-py2.6.egg/zope/testbrowser/browser.py", line 398, in getForm
        form = disambiguate(matching_forms, '', index)
      File "/home/stefan/autotest/temp/python26-zope212-cmf22-plone40/eggs/zope.testbrowser-3.6.0a2-py2.6.egg/zope/testbrowser/browser.py", line 54, in disambiguate
        raise LookupError(msg)
    LookupError
----------------------------------------------------------------------
File "/home/stefan/autotest/temp/python26-zope212-cmf22-plone40/src/plone.app.users/plone/app/users/tests/flexible_user_registration.txt", line 34, in flexible_user_registration.txt
Failed example:
    join_form_fields = form.getControl(name='form.join_form_fields.to')
Exception raised:
    Traceback (most recent call last):
      File "/home/stefan/autotest/temp/python26-zope212-cmf22-plone40/eggs/zope.testing-3.7.7-py2.6.egg/zope/testing/doctest.py", line 1361, in __run
        compileflags, 1) in test.globs
      File "<doctest flexible_user_registration.txt[line 34, example 16]>", line 1, in <module>
        join_form_fields = form.getControl(name='form.join_form_fields.to')
      File "/home/stefan/autotest/temp/python26-zope212-cmf22-plone40/eggs/zope.testbrowser-3.6.0a2-py2.6.egg/zope/testbrowser/browser.py", line 752, in getControl
        raise zope.testbrowser.interfaces.ExpiredError
    ExpiredError
----------------------------------------------------------------------
File "/home/stefan/autotest/temp/python26-zope212-cmf22-plone40/src/plone.app.users/plone/app/users/tests/flexible_user_registration.txt", line 35, in flexible_user_registration.txt
Failed example:
    'location' in join_form_fields.displayOptions
Exception raised:
    Traceback (most recent call last):
      File "/home/stefan/autotest/temp/python26-zope212-cmf22-plone40/eggs/zope.testing-3.7.7-py2.6.egg/zope/testing/doctest.py", line 1361, in __run
        compileflags, 1) in test.globs
      File "<doctest flexible_user_registration.txt[line 35, example 17]>", line 1, in <module>
        'location' in join_form_fields.displayOptions
    NameError: name 'join_form_fields' is not defined
----------------------------------------------------------------------
File "/home/stefan/autotest/temp/python26-zope212-cmf22-plone40/src/plone.app.users/plone/app/users/tests/flexible_user_registration.txt", line 37, in flexible_user_registration.txt
Failed example:
    'home_page' in join_form_fields.displayOptions
Exception raised:
    Traceback (most recent call last):
      File "/home/stefan/autotest/temp/python26-zope212-cmf22-plone40/eggs/zope.testing-3.7.7-py2.6.egg/zope/testing/doctest.py", line 1361, in __run
        compileflags, 1) in test.globs
      File "<doctest flexible_user_registration.txt[line 37, example 18]>", line 1, in <module>
        'home_page' in join_form_fields.displayOptions
    NameError: name 'join_form_fields' is not defined
----------------------------------------------------------------------
File "/home/stefan/autotest/temp/python26-zope212-cmf22-plone40/src/plone.app.users/plone/app/users/tests/flexible_user_registration.txt", line 45, in flexible_user_registration.txt
Failed example:
    homepage = join_form_fields.getControl(value='home_page')
Exception raised:
    Traceback (most recent call last):
      File "/home/stefan/autotest/temp/python26-zope212-cmf22-plone40/eggs/zope.testing-3.7.7-py2.6.egg/zope/testing/doctest.py", line 1361, in __run
        compileflags, 1) in test.globs
      File "<doctest flexible_user_registration.txt[line 45, example 19]>", line 1, in <module>
        homepage = join_form_fields.getControl(value='home_page')
    NameError: name 'join_form_fields' is not defined
----------------------------------------------------------------------
File "/home/stefan/autotest/temp/python26-zope212-cmf22-plone40/src/plone.app.users/plone/app/users/tests/flexible_user_registration.txt", line 46, in flexible_user_registration.txt
Failed example:
    homepage.click()
Exception raised:
    Traceback (most recent call last):
      File "/home/stefan/autotest/temp/python26-zope212-cmf22-plone40/eggs/zope.testing-3.7.7-py2.6.egg/zope/testing/doctest.py", line 1361, in __run
        compileflags, 1) in test.globs
      File "<doctest flexible_user_registration.txt[line 46, example 20]>", line 1, in <module>
        homepage.click()
    NameError: name 'homepage' is not defined
----------------------------------------------------------------------
File "/home/stefan/autotest/temp/python26-zope212-cmf22-plone40/src/plone.app.users/plone/app/users/tests/flexible_user_registration.txt", line 47, in flexible_user_registration.txt
Failed example:
    to_left = form.getControl(name='to2fromButton')
Exception raised:
    Traceback (most recent call last):
      File "/home/stefan/autotest/temp/python26-zope212-cmf22-plone40/eggs/zope.testing-3.7.7-py2.6.egg/zope/testing/doctest.py", line 1361, in __run
        compileflags, 1) in test.globs
      File "<doctest flexible_user_registration.txt[line 47, example 21]>", line 1, in <module>
        to_left = form.getControl(name='to2fromButton')
      File "/home/stefan/autotest/temp/python26-zope212-cmf22-plone40/eggs/zope.testbrowser-3.6.0a2-py2.6.egg/zope/testbrowser/browser.py", line 752, in getControl
        raise zope.testbrowser.interfaces.ExpiredError
    ExpiredError
----------------------------------------------------------------------
File "/home/stefan/autotest/temp/python26-zope212-cmf22-plone40/src/plone.app.users/plone/app/users/tests/flexible_user_registration.txt", line 48, in flexible_user_registration.txt
Failed example:
    to_left
Exception raised:
    Traceback (most recent call last):
      File "/home/stefan/autotest/temp/python26-zope212-cmf22-plone40/eggs/zope.testing-3.7.7-py2.6.egg/zope/testing/doctest.py", line 1361, in __run
        compileflags, 1) in test.globs
      File "<doctest flexible_user_registration.txt[line 48, example 22]>", line 1, in <module>
        to_left
    NameError: name 'to_left' is not defined
----------------------------------------------------------------------
File "/home/stefan/autotest/temp/python26-zope212-cmf22-plone40/src/plone.app.users/plone/app/users/tests/flexible_user_registration.txt", line 50, in flexible_user_registration.txt
Failed example:
    to_left.clear()
Exception raised:
    Traceback (most recent call last):
      File "/home/stefan/autotest/temp/python26-zope212-cmf22-plone40/eggs/zope.testing-3.7.7-py2.6.egg/zope/testing/doctest.py", line 1361, in __run
        compileflags, 1) in test.globs
      File "<doctest flexible_user_registration.txt[line 50, example 23]>", line 1, in <module>
        to_left.clear()
    NameError: name 'to_left' is not defined
----------------------------------------------------------------------
File "/home/stefan/autotest/temp/python26-zope212-cmf22-plone40/src/plone.app.users/plone/app/users/tests/flexible_user_registration.txt", line 51, in flexible_user_registration.txt
Failed example:
    submit_button = form.getControl(name='form.actions.save')
Exception raised:
    Traceback (most recent call last):
      File "/home/stefan/autotest/temp/python26-zope212-cmf22-plone40/eggs/zope.testing-3.7.7-py2.6.egg/zope/testing/doctest.py", line 1361, in __run
        compileflags, 1) in test.globs
      File "<doctest flexible_user_registration.txt[line 51, example 24]>", line 1, in <module>
        submit_button = form.getControl(name='form.actions.save')
      File "/home/stefan/autotest/temp/python26-zope212-cmf22-plone40/eggs/zope.testbrowser-3.6.0a2-py2.6.egg/zope/testbrowser/browser.py", line 752, in getControl
        raise zope.testbrowser.interfaces.ExpiredError
    ExpiredError
----------------------------------------------------------------------
File "/home/stefan/autotest/temp/python26-zope212-cmf22-plone40/src/plone.app.users/plone/app/users/tests/flexible_user_registration.txt", line 52, in flexible_user_registration.txt
Failed example:
    submit_button.click()
Exception raised:
    Traceback (most recent call last):
      File "/home/stefan/autotest/temp/python26-zope212-cmf22-plone40/eggs/zope.testing-3.7.7-py2.6.egg/zope/testing/doctest.py", line 1361, in __run
        compileflags, 1) in test.globs
      File "<doctest flexible_user_registration.txt[line 52, example 25]>", line 1, in <module>
        submit_button.click()
    NameError: name 'submit_button' is not defined
----------------------------------------------------------------------
File "/home/stefan/autotest/temp/python26-zope212-cmf22-plone40/src/plone.app.users/plone/app/users/tests/flexible_user_registration.txt", line 56, in flexible_user_registration.txt
Failed example:
    form = browser.getForm(action='http://nohost/plone/@@member-registration')
Exception raised:
    Traceback (most recent call last):
      File "/home/stefan/autotest/temp/python26-zope212-cmf22-plone40/eggs/zope.testing-3.7.7-py2.6.egg/zope/testing/doctest.py", line 1361, in __run
        compileflags, 1) in test.globs
      File "<doctest flexible_user_registration.txt[line 56, example 26]>", line 1, in <module>
        form = browser.getForm(action='http://nohost/plone/@@member-registration')
      File "/home/stefan/autotest/temp/python26-zope212-cmf22-plone40/eggs/zope.testbrowser-3.6.0a2-py2.6.egg/zope/testbrowser/browser.py", line 398, in getForm
        form = disambiguate(matching_forms, '', index)
      File "/home/stefan/autotest/temp/python26-zope212-cmf22-plone40/eggs/zope.testbrowser-3.6.0a2-py2.6.egg/zope/testbrowser/browser.py", line 54, in disambiguate
        raise LookupError(msg)
    LookupError
----------------------------------------------------------------------
File "/home/stefan/autotest/temp/python26-zope212-cmf22-plone40/src/plone.app.users/plone/app/users/tests/flexible_user_registration.txt", line 57, in flexible_user_registration.txt
Failed example:
    disabled_fields = form.getControl(name='form.join_form_fields.from')
Exception raised:
    Traceback (most recent call last):
      File "/home/stefan/autotest/temp/python26-zope212-cmf22-plone40/eggs/zope.testing-3.7.7-py2.6.egg/zope/testing/doctest.py", line 1361, in __run
        compileflags, 1) in test.globs
      File "<doctest flexible_user_registration.txt[line 57, example 27]>", line 1, in <module>
        disabled_fields = form.getControl(name='form.join_form_fields.from')
      File "/home/stefan/autotest/temp/python26-zope212-cmf22-plone40/eggs/zope.testbrowser-3.6.0a2-py2.6.egg/zope/testbrowser/browser.py", line 752, in getControl
        raise zope.testbrowser.interfaces.ExpiredError
    ExpiredError
----------------------------------------------------------------------
File "/home/stefan/autotest/temp/python26-zope212-cmf22-plone40/src/plone.app.users/plone/app/users/tests/flexible_user_registration.txt", line 58, in flexible_user_registration.txt
Failed example:
    'home_page' in disabled_fields.displayOptions
Exception raised:
    Traceback (most recent call last):
      File "/home/stefan/autotest/temp/python26-zope212-cmf22-plone40/eggs/zope.testing-3.7.7-py2.6.egg/zope/testing/doctest.py", line 1361, in __run
        compileflags, 1) in test.globs
      File "<doctest flexible_user_registration.txt[line 58, example 28]>", line 1, in <module>
        'home_page' in disabled_fields.displayOptions
    NameError: name 'disabled_fields' is not defined

  Ran 7 tests with 1 failures and 0 errors in 0.771 seconds.
Tearing down left over layers:
  Tear down Products.PloneTestCase.layer.PloneSite in 0.360 seconds.
  Tear down Products.PloneTestCase.layer.ZCML in 0.005 seconds.
  Tear down Testing.ZopeTestCase.layer.ZopeLite in 0.000 seconds.
Running plone.folder.tests.layer.PartialOrderingLayer tests:
  Set up plone.folder.tests.layer.PartialOrderingLayer in 0.000 seconds.
  Ran 11 tests with 0 failures and 0 errors in 0.007 seconds.
Running plone.folder.tests.layer.PloneFolderLayer tests:
  Tear down plone.folder.tests.layer.PartialOrderingLayer in 0.000 seconds.
  Set up plone.folder.tests.layer.PloneFolderLayer in 0.000 seconds.
  Ran 45 tests with 0 failures and 0 errors in 0.031 seconds.
Tearing down left over layers:
  Tear down plone.folder.tests.layer.PloneFolderLayer in 0.000 seconds.
Total: 56 tests, 0 failures, 0 errors in 0.171 seconds.
Running Products.PloneTestCase.layer.PloneSite tests:
  Set up Testing.ZopeTestCase.layer.ZopeLite in 1.382 seconds.
  Set up Products.PloneTestCase.layer.ZCML in 2.344 seconds.
  Set up Products.PloneTestCase.layer.PloneSite in 4.284 seconds.
  Ran 41 tests with 0 failures and 0 errors in 0.364 seconds.
Tearing down left over layers:
  Tear down Products.PloneTestCase.layer.PloneSite in 0.359 seconds.
  Tear down Products.PloneTestCase.layer.ZCML in 0.004 seconds.
  Tear down Testing.ZopeTestCase.layer.ZopeLite in 0.000 seconds.
Total: 0 tests, 0 failures, 0 errors in 0.000 seconds.
Total: 0 tests, 0 failures, 0 errors in 0.000 seconds.
Running Products.PloneTestCase.layer.ZCML tests:
  Set up Testing.ZopeTestCase.layer.ZopeLite in 0.888 seconds.
  Set up Products.PloneTestCase.layer.ZCML in 2.371 seconds.
/home/stefan/autotest/temp/python26-zope212-cmf22-plone40/src/wicked/wicked/cache.py:34: DeprecationWarning: object.__init__() takes no parameters
  super(CacheStore, self).__init__(self)
  Ran 16 tests with 0 failures and 0 errors in 0.058 seconds.
Running wicked.at.tests.wickedtestcase.WickedSite tests:
  Set up Products.PloneTestCase.layer.PloneSite in 4.960 seconds.
  Set up wicked.at.tests.wickedtestcase.WickedSite in 0.003 seconds.
/home/stefan/autotest/temp/python26-zope212-cmf22-plone40/eggs/Zope2-2.12.1-py2.6-linux-x86_64.egg/OFS/subscribers.py:73: DeprecationWarning: wicked.atcontent.ironicwiki.IronicWiki.manage_afterAdd is discouraged. You should use event subscribers instead.
  DeprecationWarning)
/home/stefan/autotest/temp/python26-zope212-cmf22-plone40/eggs/Zope2-2.12.1-py2.6-linux-x86_64.egg/OFS/subscribers.py:73: DeprecationWarning: wicked.atcontent.ironicwiki.IronicWiki.manage_beforeDelete is discouraged. You should use event subscribers instead.
  DeprecationWarning)
/home/stefan/autotest/temp/python26-zope212-cmf22-plone40/eggs/Zope2-2.12.1-py2.6-linux-x86_64.egg/OFS/subscribers.py:73: DeprecationWarning: wicked.atcontent.ironicwiki.IronicWiki.manage_afterClone is discouraged. You should use event subscribers instead.
  DeprecationWarning)
  Ran 23 tests with 0 failures and 0 errors in 4.742 seconds.
Running wicked.at.tests.test_scope.Scoped tests:
  Set up wicked.at.tests.test_scope.Scoped in 0.000 seconds.
  Ran 3 tests with 0 failures and 0 errors in 0.528 seconds.
Running wicked.plone.tests.SelectiveATCT tests:
  Tear down wicked.at.tests.test_scope.Scoped in 0.000 seconds.
  Tear down wicked.at.tests.wickedtestcase.WickedSite in 0.002 seconds.
  Set up wicked.plone.tests.SelectiveATCT in 0.003 seconds.
  Ran 22 tests with 0 failures and 0 errors in 4.958 seconds.
Running wicked.plone.tests.ZCMLLayer tests:
  Tear down wicked.plone.tests.SelectiveATCT in 0.004 seconds.
  Set up wicked.plone.tests.ZCMLLayer in 0.018 seconds.
  Ran 8 tests with 0 failures and 0 errors in 0.726 seconds.
Running zope.testing.testrunner.layer.UnitTests tests:
  Tear down wicked.plone.tests.ZCMLLayer in 0.386 seconds.
  Tear down Products.PloneTestCase.layer.PloneSite in 0.001 seconds.
  Tear down Products.PloneTestCase.layer.ZCML in 0.004 seconds.
  Tear down Testing.ZopeTestCase.layer.ZopeLite in 0.000 seconds.
  Set up zope.testing.testrunner.layer.UnitTests in 0.000 seconds.
  Ran 34 tests with 0 failures and 0 errors in 0.016 seconds.
Tearing down left over layers:
  Tear down zope.testing.testrunner.layer.UnitTests in 0.000 seconds.
Total: 106 tests, 0 failures, 0 errors in 20.889 seconds.
#### Running tests for group ATCT ####
#### Finished tests for group ATCT ####

#### Running tests for group Archetypes ####
#### Finished tests for group Archetypes ####

#### Running tests for group CMF ####
#### Finished tests for group CMF ####

#### Running tests for group CMFEditions ####
#### Finished tests for group CMFEditions ####

#### Running tests for group Plone ####
#### Finished tests for group Plone ####

#### Running tests for group PlonePAS ####
#### Finished tests for group PlonePAS ####

#### Running tests for group plone ####
#### Finished tests for group plone ####

#### Running tests for group portlets ####
#### Finished tests for group portlets ####

#### Running tests for Products.CMFPlacefulWorkflow ####
#### Finished tests for Products.CMFPlacefulWorkflow ####

#### Running tests for Products.CMFTestCase ####
#### Finished tests for Products.CMFTestCase ####

#### Running tests for Products.ExtendedPathIndex ####
#### Finished tests for Products.ExtendedPathIndex ####

#### Running tests for Products.PasswordResetTool ####
#### Finished tests for Products.PasswordResetTool ####

#### Running tests for Products.PloneTestCase ####
#### Finished tests for Products.PloneTestCase ####

#### Running tests for Products.ResourceRegistries ####
#### Finished tests for Products.ResourceRegistries ####

#### Running tests for Products.TinyMCE ####
#### Finished tests for Products.TinyMCE ####

#### Running tests for Products.ZopeVersionControl ####
#### Finished tests for Products.ZopeVersionControl ####

#### Running tests for Products.contentmigration ####
#### Finished tests for Products.contentmigration ####

#### Running tests for Products.i18ntestcase ####
#### Finished tests for Products.i18ntestcase ####

#### Running tests for Products.kupu ####
#### Finished tests for Products.kupu ####

#### Running tests for archetypes.referencebrowserwidget ####
#### Finished tests for archetypes.referencebrowserwidget ####

#### Running tests for archetypes.schemaextender ####
#### Finished tests for archetypes.schemaextender ####

#### Running tests for collective.monkeypatcher ####
#### Finished tests for collective.monkeypatcher ####

#### Running tests for five.customerize ####
#### Finished tests for five.customerize ####

#### Running tests for kss.core ####
#### Finished tests for kss.core ####

#### Running tests for plone.app.blob ####
#### Finished tests for plone.app.blob ####

#### Running tests for plone.app.folder ####
#### Finished tests for plone.app.folder ####

#### Running tests for plone.app.imaging ####
#### Finished tests for plone.app.imaging ####

#### Running tests for plone.app.jquerytools ####
#### Finished tests for plone.app.jquerytools ####

#### Running tests for plone.app.locales ####
#### Finished tests for plone.app.locales ####

#### Running tests for plone.app.openid ####
#### Finished tests for plone.app.openid ####

#### Running tests for plone.app.users ####
#### Finished tests for plone.app.users ####

#### Running tests for plone.folder ####
#### Finished tests for plone.folder ####

#### Running tests for plone.stringinterp ####
#### Finished tests for plone.stringinterp ####

#### Running tests for plonetheme.classic ####
#### Finished tests for plonetheme.classic ####

#### Running tests for plonetheme.sunburst ####
#### Finished tests for plonetheme.sunburst ####

#### Running tests for wicked ####
#### Finished tests for wicked ####

Packages with test failures:

Failing tests in group Plone
Failing tests in group plone
Failing tests in group portlets
Failing tests in Products.CMFPlacefulWorkflow
Failing tests in Products.kupu
Failing tests in archetypes.referencebrowserwidget
Failing tests in archetypes.schemaextender
Failing tests in plone.app.imaging
Failing tests in plone.app.users

Total time elapsed: 1108.163 seconds

Grand total: 86 packages, 9 failures


FAILED (86 packages, 9 failures)




More information about the Testbot mailing list