[Testbot] FAILED (86 packages, 9 failures) : Plone-4.0 Zope-2.12 Python-2.6.4

Plone Tests plone-tests at epy.co.at
Tue Nov 17 03:14:57 UTC 2009


Plone Tests : FAILED (86 packages, 9 failures)
Plone-4.0 Zope-2.12 Python-2.6.4

Running ./bin/alltests -q --no-color --no-progress
Running Products.CMFTestCase.layer.CMFSite tests:
  Set up Testing.ZopeTestCase.layer.ZopeLite in 1.018 seconds.
  Set up Products.CMFTestCase.layer.ZCML in 3.081 seconds.
  Set up Products.CMFTestCase.layer.CMFSite in 2.023 seconds.
  Ran 31 tests with 0 failures and 0 errors in 0.560 seconds.
Running Products.PloneTestCase.layer.PloneSite tests:
  Tear down Products.CMFTestCase.layer.CMFSite in 0.068 seconds.
  Tear down Products.CMFTestCase.layer.ZCML in 0.004 seconds.
  Set up Products.PloneTestCase.layer.ZCML in 1.711 seconds.
  Set up Products.PloneTestCase.layer.PloneSite in 3.979 seconds.


Failure in test /home/stefan/autotest/temp/python26-zope212-cmf22-plone40/src/Products.ATContentTypes/Products/ATContentTypes/tests/http_access.txt
Failed doctest test for http_access.txt
  File "/home/stefan/autotest/temp/python26-zope212-cmf22-plone40/src/Products.ATContentTypes/Products/ATContentTypes/tests/http_access.txt", line 0

----------------------------------------------------------------------
File "/home/stefan/autotest/temp/python26-zope212-cmf22-plone40/src/Products.ATContentTypes/Products/ATContentTypes/tests/http_access.txt", line 66, in http_access.txt
Failed example:
    from collective import testcaselayer
Exception raised:
    Traceback (most recent call last):
      File "/home/stefan/autotest/temp/python26-zope212-cmf22-plone40/eggs/zope.testing-3.7.7-py2.6.egg/zope/testing/doctest.py", line 1361, in __run
        compileflags, 1) in test.globs
      File "<doctest http_access.txt[line 66, example 27]>", line 1, in <module>
        from collective import testcaselayer
    ImportError: cannot import name testcaselayer
----------------------------------------------------------------------
File "/home/stefan/autotest/temp/python26-zope212-cmf22-plone40/src/Products.ATContentTypes/Products/ATContentTypes/tests/http_access.txt", line 67, in http_access.txt
Failed example:
    zcml.load_config('testing.zcml', testcaselayer)
Exception raised:
    Traceback (most recent call last):
      File "/home/stefan/autotest/temp/python26-zope212-cmf22-plone40/eggs/zope.testing-3.7.7-py2.6.egg/zope/testing/doctest.py", line 1361, in __run
        compileflags, 1) in test.globs
      File "<doctest http_access.txt[line 67, example 28]>", line 1, in <module>
        zcml.load_config('testing.zcml', testcaselayer)
    NameError: name 'testcaselayer' is not defined
----------------------------------------------------------------------
File "/home/stefan/autotest/temp/python26-zope212-cmf22-plone40/src/Products.ATContentTypes/Products/ATContentTypes/tests/http_access.txt", line 286, in http_access.txt
Failed example:
    print http(r"""
    GET /%s HTTP/1.1
    Authorization: Basic %s:%s
    Range: bytes=0-4
    """ % (imgpath, user_name, user_password))
Differences (ndiff with -expected +actual):
      HTTP/1.1 206 Partial Content
      Accept-Ranges: bytes
      Content-Disposition: inline; filename="test-image"
    - Content-Length: 5
    + Content-Length: 65
    ?                 +
      Content-Range: bytes 0-4/905
      Content-Type: image/gif
    - Last-Modified: ...
    + Last-Modified: Tue, 17 Nov 2009 02:20:31 GMT
      <BLANKLINE>
    - GIF89
    + <plone.app.blob.iterators.BlobStreamIterator object at 0xa536f10>
----------------------------------------------------------------------
File "/home/stefan/autotest/temp/python26-zope212-cmf22-plone40/src/Products.ATContentTypes/Products/ATContentTypes/tests/http_access.txt", line 305, in http_access.txt
Failed example:
    print http(r"""
    GET /%s HTTP/1.1
    Authorization: Basic %s:%s
    If-Range: %s
    Range: bytes=0-4
    """ % (imgpath, user_name, user_password, rfc1123_date(past)))
Differences (ndiff with -expected +actual):
      HTTP/1.1 200 OK
      Accept-Ranges: bytes
      Content-Disposition: inline; filename="test-image"
    - Content-Length: 905
    ?                 ^^
    + Content-Length: 65
    ?                 ^
    - Content-Type: image/gif...
    ?                        ---
    + Content-Type: image/gif
    - ...
    + Last-Modified: Tue, 17 Nov 2009 02:20:31 GMT
      <BLANKLINE>
    - GIF89...
    + <plone.app.blob.iterators.BlobStreamIterator object at 0xa536c90>
----------------------------------------------------------------------
File "/home/stefan/autotest/temp/python26-zope212-cmf22-plone40/src/Products.ATContentTypes/Products/ATContentTypes/tests/http_access.txt", line 329, in http_access.txt
Failed example:
    print http(r"""
    GET /%s HTTP/1.1
    Authorization: Basic %s:%s
    If-Range: %s
    Range: bytes=0-4
    """ % (imgpath, user_name, user_password, etag))
Differences (ndiff with -expected +actual):
      HTTP/1.1 200 OK
      Accept-Ranges: bytes
      Content-Disposition: inline; filename="test-image"
    - Content-Length: 905
    ?                 ^^
    + Content-Length: 65
    ?                 ^
    - Content-Type: image/gif...
    ?                        ---
    + Content-Type: image/gif
    - ...
    + Last-Modified: Tue, 17 Nov 2009 02:20:31 GMT
      <BLANKLINE>
    - GIF89...
    + <plone.app.blob.iterators.BlobStreamIterator object at 0xa536f50>
----------------------------------------------------------------------
File "/home/stefan/autotest/temp/python26-zope212-cmf22-plone40/src/Products.ATContentTypes/Products/ATContentTypes/tests/http_access.txt", line 368, in http_access.txt
Failed example:
    print http(r"""
    GET /%s HTTP/1.1
    Authorization: Basic %s:%s
    If-Modified-Since: %s
    """ % (imgpath, user_name, user_password, rfc1123_date(past)))
Differences (ndiff with -expected +actual):
      HTTP/1.1 200 OK
      Accept-Ranges: bytes
      Content-Disposition: inline; filename="test-image"
    - Content-Length: 905
    ?                 ^^
    + Content-Length: 65
    ?                 ^
    - Content-Type: image/gif...
    ?                        ---
    + Content-Type: image/gif
    - ...
    + Last-Modified: Tue, 17 Nov 2009 02:20:31 GMT
      <BLANKLINE>
    - GIF89...
    + <plone.app.blob.iterators.BlobStreamIterator object at 0xa536a10>

  Ran 711 tests with 1 failures and 0 errors in 1 minutes 9.564 seconds.
Tearing down left over layers:
  Tear down Products.PloneTestCase.layer.PloneSite in 0.368 seconds.
  Tear down Products.PloneTestCase.layer.ZCML in 0.010 seconds.
  Tear down Testing.ZopeTestCase.layer.ZopeLite in 0.000 seconds.
Total: 742 tests, 1 failures, 0 errors in 1 minutes 22.892 seconds.
Failed to import ZPsycopgDA
Failed to import ZMySQLDA
Running Testing.ZopeTestCase.layer.ZopeLite tests:
  Set up Testing.ZopeTestCase.layer.ZopeLite in 0.792 seconds.
  Ran 36 tests with 0 failures and 0 errors in 0.081 seconds.
Running Products.Archetypes.tests.layer.ZCML tests:
  Set up Products.CMFCore.testing.FunctionalZCMLLayer in 0.191 seconds.
  Set up Products.Archetypes.tests.layer.ZCML in 0.174 seconds.
  Ran 59 tests with 0 failures and 0 errors in 1.141 seconds.
Running Products.Archetypes.tests.layer.ArchetypesSite tests:
  Set up Products.Archetypes.tests.layer.ArchetypesSite in 2.002 seconds.
/home/stefan/autotest/temp/python26-zope212-cmf22-plone40/eggs/Zope2-2.12.1-py2.6-linux-x86_64.egg/OFS/subscribers.py:73: DeprecationWarning: Products.Archetypes.tests.test_classgen.Dummy.manage_afterAdd is discouraged. You should use event subscribers instead.
  DeprecationWarning)
/home/stefan/autotest/temp/python26-zope212-cmf22-plone40/eggs/Zope2-2.12.1-py2.6-linux-x86_64.egg/OFS/subscribers.py:73: DeprecationWarning: Products.Archetypes.tests.test_annotation.AnnDummy.manage_afterAdd is discouraged. You should use event subscribers instead.
  DeprecationWarning)
/home/stefan/autotest/temp/python26-zope212-cmf22-plone40/eggs/Zope2-2.12.1-py2.6-linux-x86_64.egg/OFS/subscribers.py:73: DeprecationWarning: Products.Archetypes.tests.test_event.Dummy.manage_afterAdd is discouraged. You should use event subscribers instead.
  DeprecationWarning)
  Ran 511 tests with 0 failures and 0 errors in 39.244 seconds.
Running Products.PloneTestCase.layer.PloneSite tests:
  Tear down Products.Archetypes.tests.layer.ArchetypesSite in 0.068 seconds.
  Tear down Products.Archetypes.tests.layer.ZCML in 0.004 seconds.
  Tear down Products.CMFCore.testing.FunctionalZCMLLayer in 0.000 seconds.
  Set up Products.PloneTestCase.layer.ZCML in 2.284 seconds.
  Set up Products.PloneTestCase.layer.PloneSite in 3.919 seconds.
  Ran 9 tests with 0 failures and 0 errors in 1.066 seconds.
Running plone.app.kss.tests.kss_and_plone_layer.KSSAndPloneLayer tests:
  Set up plone.app.kss.tests.kss_and_plone_layer.KSSAndPloneLayer in 0.006 seconds.
  Ran 19 tests with 0 failures and 0 errors in 1.544 seconds.
Running zope.testing.testrunner.layer.UnitTests tests:
  Tear down plone.app.kss.tests.kss_and_plone_layer.KSSAndPloneLayer in 0.000 seconds.
  Tear down Products.PloneTestCase.layer.PloneSite in 0.357 seconds.
  Tear down Products.PloneTestCase.layer.ZCML in 0.005 seconds.
  Tear down Testing.ZopeTestCase.layer.ZopeLite in 0.000 seconds.
  Set up zope.testing.testrunner.layer.UnitTests in 0.000 seconds.
/home/stefan/autotest/temp/python26-zope212-cmf22-plone40/src/Products.Archetypes/Products/Archetypes/ClassGen.py:152: UserWarning: The method 'makeFoo' was already protected by a different permission than the one declared on the field. Assuming that the explicit permission declared is the correct one and has preference over the permission declared on the field.
  self.handle_mode(klass, generator, type, field, mode)
  Ran 28 tests with 0 failures and 0 errors in 0.130 seconds.
Tearing down left over layers:
  Tear down zope.testing.testrunner.layer.UnitTests in 0.000 seconds.
Total: 662 tests, 0 failures, 0 errors in 54.378 seconds.
Running Testing.ZopeTestCase.layer.ZopeLite tests:
  Set up Testing.ZopeTestCase.layer.ZopeLite in 0.055 seconds.
  Ran 170 tests with 0 failures and 0 errors in 0.704 seconds.
Running Products.CMFCore.testing.ExportImportZCMLLayer tests:
  Set up Products.CMFCore.testing.ExportImportZCMLLayer in 0.000 seconds.
  Ran 10 tests with 0 failures and 0 errors in 0.643 seconds.
Running Products.GenericSetup.testing.ExportImportZCMLLayer tests:
  Tear down Products.CMFCore.testing.ExportImportZCMLLayer in 0.000 seconds.
  Set up Products.GenericSetup.testing.ExportImportZCMLLayer in 0.047 seconds.
  Ran 186 tests with 0 failures and 0 errors in 0.684 seconds.
Running zope.testing.testrunner.layer.UnitTests tests:
  Tear down Products.GenericSetup.testing.ExportImportZCMLLayer in 0.000 seconds.
  Tear down Testing.ZopeTestCase.layer.ZopeLite in 0.000 seconds.
  Set up zope.testing.testrunner.layer.UnitTests in 0.000 seconds.
  Ran 166 tests with 0 failures and 0 errors in 0.152 seconds.
Tearing down left over layers:
  Tear down zope.testing.testrunner.layer.UnitTests in 0.000 seconds.
Total: 532 tests, 0 failures, 0 errors in 2.659 seconds.
Running Testing.ZopeTestCase.layer.ZopeLite tests:
  Set up Testing.ZopeTestCase.layer.ZopeLite in 0.909 seconds.
  Ran 27 tests with 0 failures and 0 errors in 0.057 seconds.
Running Products.PloneTestCase.layer.PloneSite tests:
  Set up Products.PloneTestCase.layer.ZCML in 2.415 seconds.
  Set up Products.PloneTestCase.layer.PloneSite in 5.081 seconds.
/home/stefan/autotest/temp/python26-zope212-cmf22-plone40/eggs/Zope2-2.12.1-py2.6-linux-x86_64.egg/OFS/subscribers.py:73: DeprecationWarning: Products.FAQ.FAQ.FAQ.manage_afterAdd is discouraged. You should use event subscribers instead.
  DeprecationWarning)
/home/stefan/autotest/temp/python26-zope212-cmf22-plone40/eggs/Zope2-2.12.1-py2.6-linux-x86_64.egg/OFS/subscribers.py:73: DeprecationWarning: Products.FAQ.FAQQuestion.FAQQuestion.manage_afterAdd is discouraged. You should use event subscribers instead.
  DeprecationWarning)
  Ran 145 tests with 0 failures and 0 errors in 51.327 seconds.
Running Products.CMFDiffTool.tests.BaseTestCase.CMFDiffToolLayer tests:
  Set up Products.CMFDiffTool.tests.BaseTestCase.CMFDiffToolLayer in 0.013 seconds.
  Ran 2 tests with 0 failures and 0 errors in 0.174 seconds.
Running Products.CMFTestCase.layer.CMFSite tests:
  Tear down Products.CMFDiffTool.tests.BaseTestCase.CMFDiffToolLayer in 0.378 seconds.
  Tear down Products.PloneTestCase.layer.PloneSite in 0.006 seconds.
  Tear down Products.PloneTestCase.layer.ZCML in 0.004 seconds.
  Set up Products.CMFTestCase.layer.ZCML in 1.725 seconds.
  Set up Products.CMFTestCase.layer.CMFSite in 1.512 seconds.
  Ran 20 tests with 0 failures and 0 errors in 0.391 seconds.
Running zope.testing.testrunner.layer.UnitTests tests:
  Tear down Products.CMFTestCase.layer.CMFSite in 0.069 seconds.
  Tear down Products.CMFTestCase.layer.ZCML in 0.003 seconds.
  Tear down Testing.ZopeTestCase.layer.ZopeLite in 0.000 seconds.
  Set up zope.testing.testrunner.layer.UnitTests in 0.000 seconds.
  Ran 10 tests with 0 failures and 0 errors in 0.005 seconds.
Tearing down left over layers:
  Tear down zope.testing.testrunner.layer.UnitTests in 0.000 seconds.
Total: 204 tests, 0 failures, 0 errors in 1 minutes 5.043 seconds.
Running Testing.ZopeTestCase.layer.ZopeLite tests:
  Set up Testing.ZopeTestCase.layer.ZopeLite in 0.622 seconds.
  Ran 126 tests with 0 failures and 0 errors in 0.753 seconds.
Running Products.CMFTestCase.layer.CMFSite tests:
  Set up Products.CMFTestCase.layer.ZCML in 2.232 seconds.
  Set up Products.CMFTestCase.layer.CMFSite in 0.227 seconds.
  Ran 53 tests with 0 failures and 0 errors in 2.594 seconds.
Running Products.PloneTestCase.layer.ZCML tests:
  Tear down Products.CMFTestCase.layer.CMFSite in 0.041 seconds.
  Tear down Products.CMFTestCase.layer.ZCML in 0.003 seconds.
  Set up Products.PloneTestCase.layer.ZCML in 1.781 seconds.
  Ran 12 tests with 0 failures and 0 errors in 0.016 seconds.
Running Products.PloneTestCase.layer.PloneSite tests:
  Set up Products.PloneTestCase.layer.PloneSite in 4.180 seconds.


Failure in test test_menu_presence (plone.app.kss.tests.test_kss_attributes.TestContentMenu)
Failed doctest test for plone.app.kss.tests.test_kss_attributes.TestContentMenu.test_menu_presence
  File "/home/stefan/autotest/temp/python26-zope212-cmf22-plone40/src/plone.app.kss/plone/app/kss/tests/test_kss_attributes.py", line 183, in test_menu_presence

----------------------------------------------------------------------
File "/home/stefan/autotest/temp/python26-zope212-cmf22-plone40/src/plone.app.kss/plone/app/kss/tests/test_kss_attributes.py", line 230, in plone.app.kss.tests.test_kss_attributes.TestContentMenu.test_menu_presence
Failed example:
    content_td is not None
Differences (ndiff with -expected +actual):
    - True
    + False
----------------------------------------------------------------------
File "/home/stefan/autotest/temp/python26-zope212-cmf22-plone40/src/plone.app.kss/plone/app/kss/tests/test_kss_attributes.py", line 232, in plone.app.kss.tests.test_kss_attributes.TestContentMenu.test_menu_presence
Failed example:
    content_actions = content_td.find('div', {'class': 'contentActions'})
Exception raised:
    Traceback (most recent call last):
      File "/home/stefan/autotest/temp/python26-zope212-cmf22-plone40/eggs/zope.testing-3.7.7-py2.6.egg/zope/testing/doctest.py", line 1361, in __run
        compileflags, 1) in test.globs
      File "<doctest plone.app.kss.tests.test_kss_attributes.TestContentMenu.test_menu_presence[line 49, example 17]>", line 1, in <module>
        content_actions = content_td.find('div', {'class': 'contentActions'})
    AttributeError: 'NoneType' object has no attribute 'find'
----------------------------------------------------------------------
File "/home/stefan/autotest/temp/python26-zope212-cmf22-plone40/src/plone.app.kss/plone/app/kss/tests/test_kss_attributes.py", line 233, in plone.app.kss.tests.test_kss_attributes.TestContentMenu.test_menu_presence
Failed example:
    content_actions is not None
Exception raised:
    Traceback (most recent call last):
      File "/home/stefan/autotest/temp/python26-zope212-cmf22-plone40/eggs/zope.testing-3.7.7-py2.6.egg/zope/testing/doctest.py", line 1361, in __run
        compileflags, 1) in test.globs
      File "<doctest plone.app.kss.tests.test_kss_attributes.TestContentMenu.test_menu_presence[line 50, example 18]>", line 1, in <module>
        content_actions is not None
    NameError: name 'content_actions' is not defined
----------------------------------------------------------------------
File "/home/stefan/autotest/temp/python26-zope212-cmf22-plone40/src/plone.app.kss/plone/app/kss/tests/test_kss_attributes.py", line 238, in plone.app.kss.tests.test_kss_attributes.TestContentMenu.test_menu_presence
Failed example:
    content_actions_ul = content_actions.find('ul', {'id': 'contentActionMenus'})
Exception raised:
    Traceback (most recent call last):
      File "/home/stefan/autotest/temp/python26-zope212-cmf22-plone40/eggs/zope.testing-3.7.7-py2.6.egg/zope/testing/doctest.py", line 1361, in __run
        compileflags, 1) in test.globs
      File "<doctest plone.app.kss.tests.test_kss_attributes.TestContentMenu.test_menu_presence[line 55, example 19]>", line 1, in <module>
        content_actions_ul = content_actions.find('ul', {'id': 'contentActionMenus'})
    NameError: name 'content_actions' is not defined
----------------------------------------------------------------------
File "/home/stefan/autotest/temp/python26-zope212-cmf22-plone40/src/plone.app.kss/plone/app/kss/tests/test_kss_attributes.py", line 239, in plone.app.kss.tests.test_kss_attributes.TestContentMenu.test_menu_presence
Failed example:
    content_actions_ul is not None
Exception raised:
    Traceback (most recent call last):
      File "/home/stefan/autotest/temp/python26-zope212-cmf22-plone40/eggs/zope.testing-3.7.7-py2.6.egg/zope/testing/doctest.py", line 1361, in __run
        compileflags, 1) in test.globs
      File "<doctest plone.app.kss.tests.test_kss_attributes.TestContentMenu.test_menu_presence[line 56, example 20]>", line 1, in <module>
        content_actions_ul is not None
    NameError: name 'content_actions_ul' is not defined



Failure in test testAddEventRegistrationJS (plone.app.upgrade.v25.tests.TestMigrations_v2_5_0)
Traceback (most recent call last):
  File "/usr/local/python2.6/lib/python2.6/unittest.py", line 279, in run
    testMethod()
  File "/home/stefan/autotest/temp/python26-zope212-cmf22-plone40/src/plone.app.upgrade/plone/app/upgrade/v25/tests.py", line 38, in testAddEventRegistrationJS
    self.assertEqual(jsreg.getResourcePosition('event-registration.js'), 3)
  File "/usr/local/python2.6/lib/python2.6/unittest.py", line 350, in failUnlessEqual
    (msg or '%r != %r' % (first, second))
AssertionError: 4 != 3

  Ran 1815 tests with 2 failures and 0 errors in 4 minutes 9.886 seconds.
Running plone.app.contentrules.tests.test_configuration.TestContentrulesGSLayer tests:
  Set up plone.app.contentrules.tests.test_configuration.TestContentrulesGSLayer in 0.002 seconds.
  Ran 6 tests with 0 failures and 0 errors in 3.701 seconds.
Running plone.app.customerize.tests.layer.PloneCustomerize tests:
  Tear down plone.app.contentrules.tests.test_configuration.TestContentrulesGSLayer in 0.000 seconds.
  Set up plone.app.customerize.tests.layer.PloneCustomerize in 0.000 seconds.
  Ran 27 tests with 0 failures and 0 errors in 1 minutes 0.906 seconds.
Running plone.app.kss.tests.kss_and_plone_layer.KSSAndPloneLayer tests:
  Tear down plone.app.customerize.tests.layer.PloneCustomerize in 0.000 seconds.
  Set up plone.app.kss.tests.kss_and_plone_layer.KSSAndPloneLayer in 0.004 seconds.


Error in test testChangeViewTemplate (plone.app.kss.tests.test_menus.ContentActionMenusTestCase)
Traceback (most recent call last):
  File "/usr/local/python2.6/lib/python2.6/unittest.py", line 279, in run
    testMethod()
  File "/home/stefan/autotest/temp/python26-zope212-cmf22-plone40/src/plone.app.kss/plone/app/kss/tests/test_menus.py", line 57, in testChangeViewTemplate
    result = view.changeViewTemplate(url)
  File "<wrapper>", line 5, in wrapper
  File "/home/stefan/autotest/temp/python26-zope212-cmf22-plone40/src/kss.core/kss/core/actionwrapper.py", line 238, in apply
    result = self.f(obj, *arg, **kw)
  File "/home/stefan/autotest/temp/python26-zope212-cmf22-plone40/src/plone.app.kss/plone/app/kss/content_replacer.py", line 239, in changeViewTemplate
    self.getCommandSet('plone').refreshContentMenu()
  File "/home/stefan/autotest/temp/python26-zope212-cmf22-plone40/src/plone.app.kss/plone/app/kss/commands/plonecommands.py", line 92, in refreshContentMenu
    self.getCommandSet('zope').refreshProvider(selector, 'plone.contentmenu')
  File "/home/stefan/autotest/temp/python26-zope212-cmf22-plone40/src/plone.app.kss/plone/app/kss/commands/zopecommands.py", line 17, in refreshProvider
    renderer = provider.__of__(self.context)
AttributeError: 'ContentMenuProvider' object has no attribute '__of__'



Error in test testChangeWorkflowState (plone.app.kss.tests.test_menus.ContentActionMenusTestCase)
Traceback (most recent call last):
  File "/usr/local/python2.6/lib/python2.6/unittest.py", line 279, in run
    testMethod()
  File "/home/stefan/autotest/temp/python26-zope212-cmf22-plone40/src/plone.app.kss/plone/app/kss/tests/test_menus.py", line 118, in testChangeWorkflowState
    result = view.changeWorkflowState(url)
  File "<wrapper>", line 5, in wrapper
  File "/home/stefan/autotest/temp/python26-zope212-cmf22-plone40/src/kss.core/kss/core/actionwrapper.py", line 238, in apply
    result = self.f(obj, *arg, **kw)
  File "/home/stefan/autotest/temp/python26-zope212-cmf22-plone40/src/plone.app.kss/plone/app/kss/content_replacer.py", line 267, in changeWorkflowState
    plonecommands.refreshContentMenu()
  File "/home/stefan/autotest/temp/python26-zope212-cmf22-plone40/src/plone.app.kss/plone/app/kss/commands/plonecommands.py", line 92, in refreshContentMenu
    self.getCommandSet('zope').refreshProvider(selector, 'plone.contentmenu')
  File "/home/stefan/autotest/temp/python26-zope212-cmf22-plone40/src/plone.app.kss/plone/app/kss/commands/zopecommands.py", line 17, in refreshProvider
    renderer = provider.__of__(self.context)
AttributeError: 'ContentMenuProvider' object has no attribute '__of__'



Error in test testCopyObject (plone.app.kss.tests.test_menus.ContentActionMenusTestCase)
Traceback (most recent call last):
  File "/usr/local/python2.6/lib/python2.6/unittest.py", line 279, in run
    testMethod()
  File "/home/stefan/autotest/temp/python26-zope212-cmf22-plone40/src/plone.app.kss/plone/app/kss/tests/test_menus.py", line 107, in testCopyObject
    result = view.copyObject()
  File "<wrapper>", line 5, in wrapper
  File "/home/stefan/autotest/temp/python26-zope212-cmf22-plone40/src/kss.core/kss/core/actionwrapper.py", line 238, in apply
    result = self.f(obj, *arg, **kw)
  File "/home/stefan/autotest/temp/python26-zope212-cmf22-plone40/src/plone.app.kss/plone/app/kss/content_replacer.py", line 190, in copyObject
    self.getCommandSet('plone').refreshContentMenu()
  File "/home/stefan/autotest/temp/python26-zope212-cmf22-plone40/src/plone.app.kss/plone/app/kss/commands/plonecommands.py", line 92, in refreshContentMenu
    self.getCommandSet('zope').refreshProvider(selector, 'plone.contentmenu')
  File "/home/stefan/autotest/temp/python26-zope212-cmf22-plone40/src/plone.app.kss/plone/app/kss/commands/zopecommands.py", line 17, in refreshProvider
    renderer = provider.__of__(self.context)
AttributeError: 'ContentMenuProvider' object has no attribute '__of__'



Error in test testCutObject (plone.app.kss.tests.test_menus.ContentActionMenusTestCase)
Traceback (most recent call last):
  File "/usr/local/python2.6/lib/python2.6/unittest.py", line 279, in run
    testMethod()
  File "/home/stefan/autotest/temp/python26-zope212-cmf22-plone40/src/plone.app.kss/plone/app/kss/tests/test_menus.py", line 83, in testCutObject
    result = view.cutObject()
  File "<wrapper>", line 5, in wrapper
  File "/home/stefan/autotest/temp/python26-zope212-cmf22-plone40/src/kss.core/kss/core/actionwrapper.py", line 238, in apply
    result = self.f(obj, *arg, **kw)
  File "/home/stefan/autotest/temp/python26-zope212-cmf22-plone40/src/plone.app.kss/plone/app/kss/content_replacer.py", line 182, in cutObject
    self.getCommandSet('plone').refreshContentMenu()
  File "/home/stefan/autotest/temp/python26-zope212-cmf22-plone40/src/plone.app.kss/plone/app/kss/commands/plonecommands.py", line 92, in refreshContentMenu
    self.getCommandSet('zope').refreshProvider(selector, 'plone.contentmenu')
  File "/home/stefan/autotest/temp/python26-zope212-cmf22-plone40/src/plone.app.kss/plone/app/kss/commands/zopecommands.py", line 17, in refreshProvider
    renderer = provider.__of__(self.context)
AttributeError: 'ContentMenuProvider' object has no attribute '__of__'



Error in test testKssCopyObject (plone.app.kss.tests.test_menus.ContentActionMenusTestCase)
Traceback (most recent call last):
  File "/usr/local/python2.6/lib/python2.6/unittest.py", line 279, in run
    testMethod()
  File "/home/stefan/autotest/temp/python26-zope212-cmf22-plone40/src/plone.app.kss/plone/app/kss/tests/test_menus.py", line 93, in testKssCopyObject
    result = view.copyObject()
  File "<wrapper>", line 5, in wrapper
  File "/home/stefan/autotest/temp/python26-zope212-cmf22-plone40/src/kss.core/kss/core/actionwrapper.py", line 238, in apply
    result = self.f(obj, *arg, **kw)
  File "/home/stefan/autotest/temp/python26-zope212-cmf22-plone40/src/plone.app.kss/plone/app/kss/content_replacer.py", line 190, in copyObject
    self.getCommandSet('plone').refreshContentMenu()
  File "/home/stefan/autotest/temp/python26-zope212-cmf22-plone40/src/plone.app.kss/plone/app/kss/commands/plonecommands.py", line 92, in refreshContentMenu
    self.getCommandSet('zope').refreshProvider(selector, 'plone.contentmenu')
  File "/home/stefan/autotest/temp/python26-zope212-cmf22-plone40/src/plone.app.kss/plone/app/kss/commands/zopecommands.py", line 17, in refreshProvider
    renderer = provider.__of__(self.context)
AttributeError: 'ContentMenuProvider' object has no attribute '__of__'



Error in test testKssCutObject (plone.app.kss.tests.test_menus.ContentActionMenusTestCase)
Traceback (most recent call last):
  File "/usr/local/python2.6/lib/python2.6/unittest.py", line 279, in run
    testMethod()
  File "/home/stefan/autotest/temp/python26-zope212-cmf22-plone40/src/plone.app.kss/plone/app/kss/tests/test_menus.py", line 68, in testKssCutObject
    result = view.cutObject()
  File "<wrapper>", line 5, in wrapper
  File "/home/stefan/autotest/temp/python26-zope212-cmf22-plone40/src/kss.core/kss/core/actionwrapper.py", line 238, in apply
    result = self.f(obj, *arg, **kw)
  File "/home/stefan/autotest/temp/python26-zope212-cmf22-plone40/src/plone.app.kss/plone/app/kss/content_replacer.py", line 182, in cutObject
    self.getCommandSet('plone').refreshContentMenu()
  File "/home/stefan/autotest/temp/python26-zope212-cmf22-plone40/src/plone.app.kss/plone/app/kss/commands/plonecommands.py", line 92, in refreshContentMenu
    self.getCommandSet('zope').refreshProvider(selector, 'plone.contentmenu')
  File "/home/stefan/autotest/temp/python26-zope212-cmf22-plone40/src/plone.app.kss/plone/app/kss/commands/zopecommands.py", line 17, in refreshProvider
    renderer = provider.__of__(self.context)
AttributeError: 'ContentMenuProvider' object has no attribute '__of__'



Error in test testReplaceContentRegion (plone.app.kss.tests.test_menus.ContentActionMenusTestCase)
Traceback (most recent call last):
  File "/usr/local/python2.6/lib/python2.6/unittest.py", line 279, in run
    testMethod()
  File "/home/stefan/autotest/temp/python26-zope212-cmf22-plone40/src/plone.app.kss/plone/app/kss/tests/test_menus.py", line 43, in testReplaceContentRegion
    result = view.replaceContentRegion(self.fpage.absolute_url(), tabid='contentview-edit')
  File "<wrapper>", line 5, in wrapper
  File "/home/stefan/autotest/temp/python26-zope212-cmf22-plone40/src/kss.core/kss/core/actionwrapper.py", line 238, in apply
    result = self.f(obj, *arg, **kw)
  File "/home/stefan/autotest/temp/python26-zope212-cmf22-plone40/src/plone.app.kss/plone/app/kss/content_replacer.py", line 171, in replaceContentRegion
    self.getCommandSet('plone').refreshContentMenu()
  File "/home/stefan/autotest/temp/python26-zope212-cmf22-plone40/src/plone.app.kss/plone/app/kss/commands/plonecommands.py", line 92, in refreshContentMenu
    self.getCommandSet('zope').refreshProvider(selector, 'plone.contentmenu')
  File "/home/stefan/autotest/temp/python26-zope212-cmf22-plone40/src/plone.app.kss/plone/app/kss/commands/zopecommands.py", line 17, in refreshProvider
    renderer = provider.__of__(self.context)
AttributeError: 'ContentMenuProvider' object has no attribute '__of__'

  Ran 13 tests with 0 failures and 7 errors in 0.879 seconds.
Running plone.app.linkintegrity.tests.layer.PloneLinkintegrity tests:
  Tear down plone.app.kss.tests.kss_and_plone_layer.KSSAndPloneLayer in 0.000 seconds.
  Set up plone.app.linkintegrity.tests.layer.PloneLinkintegrity in 0.451 seconds.
  Ran 117 tests with 0 failures and 0 errors in 23.654 seconds.
Running plone.app.viewletmanager.tests.test_exportimport.Layer tests:
  Tear down plone.app.linkintegrity.tests.layer.PloneLinkintegrity in 0.052 seconds.
  Tear down Products.PloneTestCase.layer.PloneSite in 0.413 seconds.
  Tear down Products.PloneTestCase.layer.ZCML in 0.015 seconds.
  Tear down Testing.ZopeTestCase.layer.ZopeLite in 0.000 seconds.
  Set up plone.app.viewletmanager.tests.test_exportimport.Layer in 0.000 seconds.
  Ran 16 tests with 0 failures and 0 errors in 0.050 seconds.
Running zope.testing.testrunner.layer.UnitTests tests:
  Tear down plone.app.viewletmanager.tests.test_exportimport.Layer in 0.000 seconds.
  Set up zope.testing.testrunner.layer.UnitTests in 0.000 seconds.
  Ran 143 tests with 0 failures and 0 errors in 0.858 seconds.
Tearing down left over layers:
  Tear down zope.testing.testrunner.layer.UnitTests in 0.000 seconds.
Total: 2328 tests, 2 failures, 7 errors in 5 minutes 57.093 seconds.
Running Testing.ZopeTestCase.layer.ZopeLite tests:
  Set up Testing.ZopeTestCase.layer.ZopeLite in 1.406 seconds.
  Ran 165 tests with 0 failures and 0 errors in 0.634 seconds.
Running Products.PloneTestCase.layer.ZCML tests:
  Set up Products.PloneTestCase.layer.ZCML in 2.288 seconds.
  Ran 34 tests with 0 failures and 0 errors in 0.212 seconds.
Running Products.PlonePAS.tests.layer.PlonePASLayer tests:
  Set up Products.PloneTestCase.layer.PloneSite in 3.889 seconds.
  Set up Products.PlonePAS.tests.layer.PlonePASLayer in 0.000 seconds.
  Ran 152 tests with 0 failures and 0 errors in 1.819 seconds.
Running zope.testing.testrunner.layer.UnitTests tests:
  Tear down Products.PlonePAS.tests.layer.PlonePASLayer in 0.000 seconds.
  Tear down Products.PloneTestCase.layer.PloneSite in 0.354 seconds.
  Tear down Products.PloneTestCase.layer.ZCML in 0.004 seconds.
  Tear down Testing.ZopeTestCase.layer.ZopeLite in 0.000 seconds.
  Set up zope.testing.testrunner.layer.UnitTests in 0.000 seconds.
  Ran 371 tests with 0 failures and 0 errors in 0.486 seconds.
Tearing down left over layers:
  Tear down zope.testing.testrunner.layer.UnitTests in 0.000 seconds.
Total: 722 tests, 0 failures, 0 errors in 11.859 seconds.
Running Products.PloneTestCase.layer.PloneSite tests:
  Set up Testing.ZopeTestCase.layer.ZopeLite in 1.322 seconds.
  Set up Products.PloneTestCase.layer.ZCML in 2.380 seconds.
  Set up Products.PloneTestCase.layer.PloneSite in 4.149 seconds.
/home/stefan/autotest/temp/python26-zope212-cmf22-plone40/src/borg.localrole/borg/localrole/bbb/bbb.txt:1: DeprecationWarning: IWorkspace is deprecated. Please use borg.localrole.interfaces.ILocalRoleProvider instead
  =========
/home/stefan/autotest/temp/python26-zope212-cmf22-plone40/src/borg.localrole/borg/localrole/bbb/bbb.txt:1: DeprecationWarning: IGroupAwareWorkspace is deprecated. Please use borg.localrole.interfaces.ILocalRoleProvider instead
  =========
  Ran 36 tests with 0 failures and 0 errors in 0.133 seconds.
Running plone.browserlayer.tests.test_doctest.PloneBrowserLayerLayer tests:
  Set up plone.browserlayer.tests.test_doctest.PloneBrowserLayerLayer in 0.003 seconds.
  Ran 9 tests with 0 failures and 0 errors in 0.977 seconds.
Running plone.theme.tests.test_doctest.PloneThemeLayer tests:
  Tear down plone.browserlayer.tests.test_doctest.PloneBrowserLayerLayer in 0.000 seconds.
  Set up plone.theme.tests.test_doctest.PloneThemeLayer in 0.003 seconds.
  Ran 5 tests with 0 failures and 0 errors in 0.053 seconds.
Running zope.testing.testrunner.layer.UnitTests tests:
  Tear down plone.theme.tests.test_doctest.PloneThemeLayer in 0.000 seconds.
  Tear down Products.PloneTestCase.layer.PloneSite in 0.367 seconds.
  Tear down Products.PloneTestCase.layer.ZCML in 0.004 seconds.
  Tear down Testing.ZopeTestCase.layer.ZopeLite in 0.000 seconds.
  Set up zope.testing.testrunner.layer.UnitTests in 0.000 seconds.
/usr/local/python2.6/lib/python2.6/mhlib.py:83: DeprecationWarning: the multifile module has been deprecated since Python 2.5
  import multifile


Failure in test /home/stefan/autotest/temp/python26-zope212-cmf22-plone40/eggs/z3c.autoinclude-0.3.1-py2.6.egg/z3c/autoinclude/tests/../dependency.txt
Traceback (most recent call last):
  File "/usr/local/python2.6/lib/python2.6/unittest.py", line 279, in run
    testMethod()
  File "/usr/local/python2.6/lib/python2.6/doctest.py", line 2145, in runTest
    raise self.failureException(self.format_failure(new.getvalue()))
AssertionError: Failed doctest test for dependency.txt
  File "/home/stefan/autotest/temp/python26-zope212-cmf22-plone40/eggs/z3c.autoinclude-0.3.1-py2.6.egg/z3c/autoinclude/tests/../dependency.txt", line 0

----------------------------------------------------------------------
File "/home/stefan/autotest/temp/python26-zope212-cmf22-plone40/eggs/z3c.autoinclude-0.3.1-py2.6.egg/z3c/autoinclude/tests/../dependency.txt", line 102, in dependency.txt
Failed example:
    sibling_include_finder.dottedNames()
Expected:
    ['F.G', 'F.H']
Got:
    ['F.H', 'F.G']
----------------------------------------------------------------------
File "/home/stefan/autotest/temp/python26-zope212-cmf22-plone40/eggs/z3c.autoinclude-0.3.1-py2.6.egg/z3c/autoinclude/tests/../dependency.txt", line 108, in dependency.txt
Failed example:
    pprint(b_include_finder.includableInfo(['configure.zcml',
                                            'meta.zcml']))
Expected:
    {'configure.zcml': ['F.H'], 'meta.zcml': ['testdirective', 'F.G', 'F.H']}
Got:
    {'configure.zcml': ['F.H'], 'meta.zcml': ['testdirective', 'F.H', 'F.G']}
----------------------------------------------------------------------
File "/home/stefan/autotest/temp/python26-zope212-cmf22-plone40/eggs/z3c.autoinclude-0.3.1-py2.6.egg/z3c/autoinclude/tests/../dependency.txt", line 142, in dependency.txt
Failed example:
    pprint(package_includes('BCPackage'))
Expected:
    {'configure.zcml': ['F.H'],
     'meta.zcml': ['testdirective', 'F.G', 'F.H'],
     'overrides.zcml': []}
Got:
    {'configure.zcml': ['F.H'],
     'meta.zcml': ['testdirective', 'F.H', 'F.G'],
     'overrides.zcml': []}


  Ran 262 tests with 1 failures and 0 errors in 14.971 seconds.
Tearing down left over layers:
  Tear down zope.testing.testrunner.layer.UnitTests in 0.000 seconds.
Total: 312 tests, 1 failures, 0 errors in 25.280 seconds.
Running Products.PloneTestCase.layer.PloneSite tests:
  Set up Testing.ZopeTestCase.layer.ZopeLite in 0.868 seconds.
  Set up Products.PloneTestCase.layer.ZCML in 2.273 seconds.
  Set up Products.PloneTestCase.layer.PloneSite Traceback (most recent call last):
  File "/home/stefan/autotest/temp/python26-zope212-cmf22-plone40/eggs/zope.testing-3.7.7-py2.6.egg/zope/testing/testrunner/runner.py", line 361, in run_layer
    setup_layer(options, layer, setup_layers)
  File "/home/stefan/autotest/temp/python26-zope212-cmf22-plone40/eggs/zope.testing-3.7.7-py2.6.egg/zope/testing/testrunner/runner.py", line 518, in setup_layer
    layer.setUp()
  File "/home/stefan/autotest/temp/python26-zope212-cmf22-plone40/eggs/Products.PloneTestCase-0.9.9-py2.6.egg/Products/PloneTestCase/layer.py", line 33, in setUp
    func(*args, **kw)
  File "/home/stefan/autotest/temp/python26-zope212-cmf22-plone40/eggs/Products.PloneTestCase-0.9.9-py2.6.egg/Products/PloneTestCase/setup.py", line 164, in setupPloneSite
    base_profile, extension_profiles).run()
  File "/home/stefan/autotest/temp/python26-zope212-cmf22-plone40/eggs/Products.PloneTestCase-0.9.9-py2.6.egg/Products/PloneTestCase/setup.py", line 211, in run
    self._setupProfiles()
  File "/home/stefan/autotest/temp/python26-zope212-cmf22-plone40/eggs/Products.PloneTestCase-0.9.9-py2.6.egg/Products/PloneTestCase/setup.py", line 280, in _setupProfiles
    setup.runAllImportStepsFromProfile(profile_id)
  File "/home/stefan/autotest/temp/python26-zope212-cmf22-plone40/eggs/Products.GenericSetup-1.5.0b1-py2.6.egg/Products/GenericSetup/tool.py", line 331, in runAllImportStepsFromProfile
    ignore_dependencies=ignore_dependencies)
   - __traceback_info__: profile-plone.app.portlets:default
  File "/home/stefan/autotest/temp/python26-zope212-cmf22-plone40/eggs/Products.GenericSetup-1.5.0b1-py2.6.egg/Products/GenericSetup/tool.py", line 1058, in _runImportStepsFromContext
    chain = self.getProfileDependencyChain( profile_id )
  File "/home/stefan/autotest/temp/python26-zope212-cmf22-plone40/eggs/Products.GenericSetup-1.5.0b1-py2.6.egg/Products/GenericSetup/tool.py", line 1039, in getProfileDependencyChain
    dependencies = self.getDependenciesForProfile( profile_id )
  File "/home/stefan/autotest/temp/python26-zope212-cmf22-plone40/eggs/Products.GenericSetup-1.5.0b1-py2.6.egg/Products/GenericSetup/tool.py", line 825, in getDependenciesForProfile
    raise KeyError, profile_id
KeyError: 'profile-plone.app.portlets:default'

Running plone.app.portlets.tests.test_configuration.TestPortletZCMLLayer tests:
  Set up Products.PloneTestCase.layer.PloneSite Traceback (most recent call last):
  File "/home/stefan/autotest/temp/python26-zope212-cmf22-plone40/eggs/zope.testing-3.7.7-py2.6.egg/zope/testing/testrunner/runner.py", line 361, in run_layer
    setup_layer(options, layer, setup_layers)
  File "/home/stefan/autotest/temp/python26-zope212-cmf22-plone40/eggs/zope.testing-3.7.7-py2.6.egg/zope/testing/testrunner/runner.py", line 513, in setup_layer
    setup_layer(options, base, setup_layers)
  File "/home/stefan/autotest/temp/python26-zope212-cmf22-plone40/eggs/zope.testing-3.7.7-py2.6.egg/zope/testing/testrunner/runner.py", line 518, in setup_layer
    layer.setUp()
  File "/home/stefan/autotest/temp/python26-zope212-cmf22-plone40/eggs/Products.PloneTestCase-0.9.9-py2.6.egg/Products/PloneTestCase/layer.py", line 33, in setUp
    func(*args, **kw)
  File "/home/stefan/autotest/temp/python26-zope212-cmf22-plone40/eggs/Products.PloneTestCase-0.9.9-py2.6.egg/Products/PloneTestCase/setup.py", line 164, in setupPloneSite
    base_profile, extension_profiles).run()
  File "/home/stefan/autotest/temp/python26-zope212-cmf22-plone40/eggs/Products.PloneTestCase-0.9.9-py2.6.egg/Products/PloneTestCase/setup.py", line 211, in run
    self._setupProfiles()
  File "/home/stefan/autotest/temp/python26-zope212-cmf22-plone40/eggs/Products.PloneTestCase-0.9.9-py2.6.egg/Products/PloneTestCase/setup.py", line 280, in _setupProfiles
    setup.runAllImportStepsFromProfile(profile_id)
  File "/home/stefan/autotest/temp/python26-zope212-cmf22-plone40/eggs/Products.GenericSetup-1.5.0b1-py2.6.egg/Products/GenericSetup/tool.py", line 331, in runAllImportStepsFromProfile
    ignore_dependencies=ignore_dependencies)
   - __traceback_info__: profile-plone.app.portlets:default
  File "/home/stefan/autotest/temp/python26-zope212-cmf22-plone40/eggs/Products.GenericSetup-1.5.0b1-py2.6.egg/Products/GenericSetup/tool.py", line 1058, in _runImportStepsFromContext
    chain = self.getProfileDependencyChain( profile_id )
  File "/home/stefan/autotest/temp/python26-zope212-cmf22-plone40/eggs/Products.GenericSetup-1.5.0b1-py2.6.egg/Products/GenericSetup/tool.py", line 1039, in getProfileDependencyChain
    dependencies = self.getDependenciesForProfile( profile_id )
  File "/home/stefan/autotest/temp/python26-zope212-cmf22-plone40/eggs/Products.GenericSetup-1.5.0b1-py2.6.egg/Products/GenericSetup/tool.py", line 825, in getDependenciesForProfile
    raise KeyError, profile_id
KeyError: 'profile-plone.app.portlets:default'

Running plone.app.portlets.tests.test_configuration.TestPortletGSLayer tests:
  Set up Products.PloneTestCase.layer.PloneSite Traceback (most recent call last):
  File "/home/stefan/autotest/temp/python26-zope212-cmf22-plone40/eggs/zope.testing-3.7.7-py2.6.egg/zope/testing/testrunner/runner.py", line 361, in run_layer
    setup_layer(options, layer, setup_layers)
  File "/home/stefan/autotest/temp/python26-zope212-cmf22-plone40/eggs/zope.testing-3.7.7-py2.6.egg/zope/testing/testrunner/runner.py", line 513, in setup_layer
    setup_layer(options, base, setup_layers)
  File "/home/stefan/autotest/temp/python26-zope212-cmf22-plone40/eggs/zope.testing-3.7.7-py2.6.egg/zope/testing/testrunner/runner.py", line 513, in setup_layer
    setup_layer(options, base, setup_layers)
  File "/home/stefan/autotest/temp/python26-zope212-cmf22-plone40/eggs/zope.testing-3.7.7-py2.6.egg/zope/testing/testrunner/runner.py", line 518, in setup_layer
    layer.setUp()
  File "/home/stefan/autotest/temp/python26-zope212-cmf22-plone40/eggs/Products.PloneTestCase-0.9.9-py2.6.egg/Products/PloneTestCase/layer.py", line 33, in setUp
    func(*args, **kw)
  File "/home/stefan/autotest/temp/python26-zope212-cmf22-plone40/eggs/Products.PloneTestCase-0.9.9-py2.6.egg/Products/PloneTestCase/setup.py", line 164, in setupPloneSite
    base_profile, extension_profiles).run()
  File "/home/stefan/autotest/temp/python26-zope212-cmf22-plone40/eggs/Products.PloneTestCase-0.9.9-py2.6.egg/Products/PloneTestCase/setup.py", line 211, in run
    self._setupProfiles()
  File "/home/stefan/autotest/temp/python26-zope212-cmf22-plone40/eggs/Products.PloneTestCase-0.9.9-py2.6.egg/Products/PloneTestCase/setup.py", line 280, in _setupProfiles
    setup.runAllImportStepsFromProfile(profile_id)
  File "/home/stefan/autotest/temp/python26-zope212-cmf22-plone40/eggs/Products.GenericSetup-1.5.0b1-py2.6.egg/Products/GenericSetup/tool.py", line 331, in runAllImportStepsFromProfile
    ignore_dependencies=ignore_dependencies)
   - __traceback_info__: profile-plone.app.portlets:default
  File "/home/stefan/autotest/temp/python26-zope212-cmf22-plone40/eggs/Products.GenericSetup-1.5.0b1-py2.6.egg/Products/GenericSetup/tool.py", line 1058, in _runImportStepsFromContext
    chain = self.getProfileDependencyChain( profile_id )
  File "/home/stefan/autotest/temp/python26-zope212-cmf22-plone40/eggs/Products.GenericSetup-1.5.0b1-py2.6.egg/Products/GenericSetup/tool.py", line 1039, in getProfileDependencyChain
    dependencies = self.getDependenciesForProfile( profile_id )
  File "/home/stefan/autotest/temp/python26-zope212-cmf22-plone40/eggs/Products.GenericSetup-1.5.0b1-py2.6.egg/Products/GenericSetup/tool.py", line 825, in getDependenciesForProfile
    raise KeyError, profile_id
KeyError: 'profile-plone.app.portlets:default'

Running zope.testing.testrunner.layer.UnitTests tests:
  Tear down Products.PloneTestCase.layer.ZCML in 0.004 seconds.
  Tear down Testing.ZopeTestCase.layer.ZopeLite in 0.000 seconds.
  Set up zope.testing.testrunner.layer.UnitTests in 0.000 seconds.
  Ran 54 tests with 0 failures and 0 errors in 0.151 seconds.
Tearing down left over layers:
  Tear down zope.testing.testrunner.layer.UnitTests in 0.000 seconds.
Total: 54 tests, 0 failures, 3 errors in 7.601 seconds.
Running Products.PloneTestCase.layer.PloneSite tests:
  Set up Testing.ZopeTestCase.layer.ZopeLite in 0.000 seconds.
  Set up Products.PloneTestCase.layer.ZCML in 1.813 seconds.
  Set up Products.PloneTestCase.layer.PloneSite in 5.165 seconds.
  Ran 23 tests with 0 failures and 0 errors in 3.449 seconds.
Running Products.CMFPlacefulWorkflow.tests.test_exportimport.ExportImportLayer tests:
  Set up Products.CMFPlacefulWorkflow.tests.test_exportimport.ExportImportLayer in 0.001 seconds.


Failure in test /home/stefan/autotest/temp/python26-zope212-cmf22-plone40/src/Products.CMFPlacefulWorkflow/Products/CMFPlacefulWorkflow/tests/exportimport.txt
Failed doctest test for exportimport.txt
  File "/home/stefan/autotest/temp/python26-zope212-cmf22-plone40/src/Products.CMFPlacefulWorkflow/Products/CMFPlacefulWorkflow/tests/exportimport.txt", line 0

----------------------------------------------------------------------
File "/home/stefan/autotest/temp/python26-zope212-cmf22-plone40/src/Products.CMFPlacefulWorkflow/Products/CMFPlacefulWorkflow/tests/exportimport.txt", line 23, in exportimport.txt
Failed example:
    ps.createSnapshot('sn_1')
Exception raised:
    Traceback (most recent call last):
      File "/home/stefan/autotest/temp/python26-zope212-cmf22-plone40/eggs/zope.testing-3.7.7-py2.6.egg/zope/testing/doctest.py", line 1361, in __run
        compileflags, 1) in test.globs
      File "<doctest exportimport.txt[line 23, example 4]>", line 1, in <module>
        ps.createSnapshot('sn_1')
      File "/home/stefan/autotest/temp/python26-zope212-cmf22-plone40/eggs/Products.GenericSetup-1.5.0b1-py2.6.egg/Products/GenericSetup/tool.py", line 370, in createSnapshot
        messages[step_id] = handler(context)
      File "/home/stefan/autotest/temp/python26-zope212-cmf22-plone40/eggs/Products.CMFCore-2.2.0_alpha-py2.6.egg/Products/CMFCore/exportimport/workflow.py", line 138, in exportWorkflowTool
        exportObjects(tool, '', context)
      File "/home/stefan/autotest/temp/python26-zope212-cmf22-plone40/eggs/Products.GenericSetup-1.5.0b1-py2.6.egg/Products/GenericSetup/utils.py", line 810, in exportObjects
        exportObjects(sub, path+'/', context)
      File "/home/stefan/autotest/temp/python26-zope212-cmf22-plone40/eggs/Products.GenericSetup-1.5.0b1-py2.6.egg/Products/GenericSetup/utils.py", line 804, in exportObjects
        body = exporter.body
      File "/home/stefan/autotest/temp/python26-zope212-cmf22-plone40/eggs/Products.DCWorkflow-2.2.0_alpha-py2.6.egg/Products/DCWorkflow/exportimport.py", line 52, in _exportBody
        return wfdc.__of__(self.context).generateWorkflowXML()
      File "/home/stefan/autotest/temp/python26-zope212-cmf22-plone40/eggs/Products.DCWorkflow-2.2.0_alpha-py2.6.egg/Products/DCWorkflow/exportimport.py", line 142, in generateWorkflowXML
        return self._workflowConfig(workflow_id=self._obj.getId())
      File "/home/stefan/autotest/temp/python26-zope212-cmf22-plone40/eggs/Zope2-2.12.1-py2.6-linux-x86_64.egg/Shared/DC/Scripts/Bindings.py", line 324, in __call__
        return self._bindAndExec(args, kw, None)
      File "/home/stefan/autotest/temp/python26-zope212-cmf22-plone40/eggs/Zope2-2.12.1-py2.6-linux-x86_64.egg/Shared/DC/Scripts/Bindings.py", line 361, in _bindAndExec
        return self._exec(bound_data, args, kw)
      File "/home/stefan/autotest/temp/python26-zope212-cmf22-plone40/eggs/Zope2-2.12.1-py2.6-linux-x86_64.egg/Products/PageTemplates/PageTemplateFile.py", line 130, in _exec
        return self.pt_render(extra_context=bound_names)
      File "/home/stefan/autotest/temp/python26-zope212-cmf22-plone40/eggs/Zope2-2.12.1-py2.6-linux-x86_64.egg/Products/PageTemplates/PageTemplate.py", line 80, in pt_render
        showtal=showtal)
      File "/home/stefan/autotest/temp/python26-zope212-cmf22-plone40/eggs/zope.pagetemplate-3.5.0-py2.6.egg/zope/pagetemplate/pagetemplate.py", line 115, in pt_render
        strictinsert=0, sourceAnnotations=sourceAnnotations)()
      File "/home/stefan/autotest/temp/python26-zope212-cmf22-plone40/eggs/zope.tal-3.5.1-py2.6.egg/zope/tal/talinterpreter.py", line 271, in __call__
        self.interpret(self.program)
      File "/home/stefan/autotest/temp/python26-zope212-cmf22-plone40/eggs/zope.tal-3.5.1-py2.6.egg/zope/tal/talinterpreter.py", line 343, in interpret
        handlers[opcode](self, args)
      File "/home/stefan/autotest/temp/python26-zope212-cmf22-plone40/eggs/zope.tal-3.5.1-py2.6.egg/zope/tal/talinterpreter.py", line 583, in do_setLocal_tal
        self.engine.setLocal(name, self.engine.evaluateValue(expr))
      File "/home/stefan/autotest/temp/python26-zope212-cmf22-plone40/eggs/zope.tales-3.4.0-py2.6.egg/zope/tales/tales.py", line 696, in evaluate
        return expression(self)
       - workflowConfig
       - Line 2, Column 0
       - Expression: <PythonExpr here.getWorkflowInfo(                                                 options[ 'workflow_id' ] )>
       - Names:
          {'container': <UnauthorizedBinding: container>,
           'context': <UnauthorizedBinding: context>,
           'default': <object object at 0x2ab564318760>,
           'here': <UnauthorizedBinding: context>,
           'loop': {},
           'nothing': None,
           'options': {'args': (), 'workflow_id': 'folder_workflow'},
           'repeat': <Products.PageTemplates.Expressions.SafeMapping object at 0x8066a70>,
           'request': <HTTPRequest, URL=http://nohost>,
           'root': <Application at >,
           'template': <PageTemplateFile at /plone/portal_workflow/folder_workflow/workflowConfig>,
           'user': <PloneUser 'test_user_1_'>}
      File "/home/stefan/autotest/temp/python26-zope212-cmf22-plone40/eggs/Zope2-2.12.1-py2.6-linux-x86_64.egg/Products/PageTemplates/ZRPythonExpr.py", line 49, in __call__
        return eval(self._code, vars, {})
       - __traceback_info__: here.getWorkflowInfo(                                                 options[ 'workflow_id' ] )
      File "PythonExpr", line 1, in <expression>
      File "/home/stefan/autotest/temp/python26-zope212-cmf22-plone40/eggs/Zope2-2.12.1-py2.6-linux-x86_64.egg/Shared/DC/Scripts/Bindings.py", line 195, in __getattr__
        return guarded_getattr(self._wrapped, name, default)
    Unauthorized: You are not allowed to access 'getWorkflowInfo' in this context

  Ran 11 tests with 1 failures and 0 errors in 0.283 seconds.
Tearing down left over layers:
  Tear down Products.CMFPlacefulWorkflow.tests.test_exportimport.ExportImportLayer in 0.000 seconds.
  Tear down Products.PloneTestCase.layer.PloneSite in 0.361 seconds.
  Tear down Products.PloneTestCase.layer.ZCML in 0.004 seconds.
  Tear down Testing.ZopeTestCase.layer.ZopeLite in 0.000 seconds.
Total: 34 tests, 1 failures, 0 errors in 11.541 seconds.
Running Products.CMFTestCase.layer.CMFSite tests:
  Set up Testing.ZopeTestCase.layer.ZopeLite in 0.202 seconds.
  Set up Products.CMFTestCase.layer.ZCML in 0.364 seconds.
  Set up Products.CMFTestCase.layer.CMFSite in 0.208 seconds.
  Ran 58 tests with 0 failures and 0 errors in 0.227 seconds.
Tearing down left over layers:
  Tear down Products.CMFTestCase.layer.CMFSite in 0.027 seconds.
  Tear down Products.CMFTestCase.layer.ZCML in 0.001 seconds.
  Tear down Testing.ZopeTestCase.layer.ZopeLite in 0.000 seconds.
Running zope.testing.testrunner.layer.UnitTests tests:
  Set up zope.testing.testrunner.layer.UnitTests in 0.000 seconds.
  Ran 35 tests with 0 failures and 0 errors in 0.027 seconds.
Tearing down left over layers:
  Tear down zope.testing.testrunner.layer.UnitTests in 0.000 seconds.
Running Products.PloneTestCase.layer.PloneSite tests:
  Set up Testing.ZopeTestCase.layer.ZopeLite in 1.350 seconds.
  Set up Products.PloneTestCase.layer.ZCML in 2.368 seconds.
  Set up Products.PloneTestCase.layer.PloneSite in 4.065 seconds.
  Ran 39 tests with 0 failures and 0 errors in 4.144 seconds.
Tearing down left over layers:
  Tear down Products.PloneTestCase.layer.PloneSite in 0.365 seconds.
  Tear down Products.PloneTestCase.layer.ZCML in 0.006 seconds.
  Tear down Testing.ZopeTestCase.layer.ZopeLite in 0.000 seconds.
Running Products.PloneTestCase.layer.PloneSite tests:
  Set up Testing.ZopeTestCase.layer.ZopeLite in 1.378 seconds.
  Set up Products.PloneTestCase.layer.ZCML in 2.401 seconds.
  Set up Products.PloneTestCase.layer.PloneSite in 4.055 seconds.
/home/stefan/autotest/temp/python26-zope212-cmf22-plone40/eggs/Products.PlonePAS-4.0a1-py2.6.egg/Products/PlonePAS/tools/membership.py:554: DeprecationWarning: credentialsChanged should be called with 'REQUEST' as second argument. The BBB code will be removed in CMF 2.3.
  self.credentialsChanged(password, REQUEST=REQUEST)
  Ran 61 tests with 0 failures and 0 errors in 1.107 seconds.
Tearing down left over layers:
  Tear down Products.PloneTestCase.layer.PloneSite in 0.369 seconds.
  Tear down Products.PloneTestCase.layer.ZCML in 0.004 seconds.
  Tear down Testing.ZopeTestCase.layer.ZopeLite in 0.000 seconds.
Running Products.PloneTestCase.layer.PloneSite tests:
  Set up Testing.ZopeTestCase.layer.ZopeLite in 1.823 seconds.
  Set up Products.PloneTestCase.layer.ZCML in 2.353 seconds.
  Set up Products.PloneTestCase.layer.PloneSite in 4.194 seconds.
  Ran 239 tests with 0 failures and 0 errors in 17.994 seconds.
Running zope.testing.testrunner.layer.UnitTests tests:
  Tear down Products.PloneTestCase.layer.PloneSite in 0.373 seconds.
  Tear down Products.PloneTestCase.layer.ZCML in 0.005 seconds.
  Tear down Testing.ZopeTestCase.layer.ZopeLite in 0.000 seconds.
  Set up zope.testing.testrunner.layer.UnitTests in 0.000 seconds.
  Ran 59 tests with 0 failures and 0 errors in 0.013 seconds.
Tearing down left over layers:
  Tear down zope.testing.testrunner.layer.UnitTests in 0.000 seconds.
Total: 298 tests, 0 failures, 0 errors in 27.180 seconds.
Running Products.PloneTestCase.layer.PloneSite tests:
  Set up Testing.ZopeTestCase.layer.ZopeLite in 1.370 seconds.
  Set up Products.PloneTestCase.layer.ZCML in 2.346 seconds.
  Set up Products.PloneTestCase.layer.PloneSite in 4.229 seconds.
  Ran 76 tests with 0 failures and 0 errors in 2.952 seconds.
Tearing down left over layers:
  Tear down Products.PloneTestCase.layer.PloneSite in 0.365 seconds.
  Tear down Products.PloneTestCase.layer.ZCML in 0.006 seconds.
  Tear down Testing.ZopeTestCase.layer.ZopeLite in 0.000 seconds.
Running zope.testing.testrunner.layer.UnitTests tests:
  Set up zope.testing.testrunner.layer.UnitTests in 0.000 seconds.
  Ran 76 tests with 0 failures and 0 errors in 1.532 seconds.
Tearing down left over layers:
  Tear down zope.testing.testrunner.layer.UnitTests in 0.000 seconds.
Running Products.contentmigration.tests.layer.TestLayer tests:
  Set up Testing.ZopeTestCase.layer.ZopeLite in 1.336 seconds.
  Set up Products.PloneTestCase.layer.ZCML in 2.377 seconds.
  Set up Products.PloneTestCase.layer.PloneSite in 4.040 seconds.
  Set up Products.contentmigration.tests.layer.TestLayer in 0.002 seconds.
  Ran 18 tests with 0 failures and 0 errors in 4.979 seconds.
Tearing down left over layers:
  Tear down Products.contentmigration.tests.layer.TestLayer in 0.000 seconds.
  Tear down Products.PloneTestCase.layer.PloneSite in 0.363 seconds.
  Tear down Products.PloneTestCase.layer.ZCML in 0.004 seconds.
  Tear down Testing.ZopeTestCase.layer.ZopeLite in 0.000 seconds.
Total: 0 tests, 0 failures, 0 errors in 0.000 seconds.
/home/stefan/autotest/temp/python26-zope212-cmf22-plone40/eggs/Products.i18ntestcase-1.2-py2.6.egg/Products/i18ntestcase/PotTestCase.py:13: DeprecationWarning: The popen2 module is deprecated.  Use the subprocess module.
  from popen2 import popen4
/home/stefan/autotest/temp/python26-zope212-cmf22-plone40/src/Products.kupu/Products/kupu/plone/tests/TestContent.py:4: DeprecationWarning: Products.ATReferenceBrowserWidget.ATReferenceBrowserWidget has moved to archetypes.referencebrowserwidget.widget. Import of Products.ATReferenceBrowserWidget.ATReferenceBrowserWidget will become unsupported in Plone 5.0
  from Products.ATReferenceBrowserWidget.ATReferenceBrowserWidget import ReferenceBrowserWidget
Running Testing.ZopeTestCase.layer.ZopeLite tests:
  Set up Testing.ZopeTestCase.layer.ZopeLite in 0.836 seconds.
  Ran 3 tests with 0 failures and 0 errors in 0.008 seconds.
Running Products.PloneTestCase.layer.PloneSite tests:
  Set up Products.PloneTestCase.layer.ZCML in 2.375 seconds.
  Set up Products.PloneTestCase.layer.PloneSite/home/stefan/autotest/temp/python26-zope212-cmf22-plone40/src/Products.kupu/Products/kupu/plone/util.py:25: DeprecationWarning: minimalpath() is deprecated and will be removed in CMF 2.3.
  kupu_plone_skin_dir = minimalpath(os.path.join(kupu_package_dir, relpath))
/home/stefan/autotest/temp/python26-zope212-cmf22-plone40/src/Products.kupu/Products/kupu/plone/util.py:26: DeprecationWarning: createDirectoryView() called with deprecated reg_key format. Support for old key formats will be removed in CMF 2.3. Please use the new key format <product>:<subdir> instead.
  createDirectoryView(skinstool, kupu_plone_skin_dir, name)
<string>:213: DeprecationWarning: changeSkin should be called with 'REQUEST' as second argument. The BBB code will be removed in CMF 2.3.
 in 4.531 seconds.


Failure in test testSame (Products.kupu.plone.tests.test_html2captioned.TransformTestSubclass)
Traceback (most recent call last):
  File "/usr/local/python2.6/lib/python2.6/unittest.py", line 279, in run
    testMethod()
  File "/home/stefan/autotest/temp/python26-zope212-cmf22-plone40/src/Products.kupu/Products/kupu/plone/tests/test_html2captioned.py", line 78, in testSame
    self.do_convert(filename=self.input)
  File "/home/stefan/autotest/temp/python26-zope212-cmf22-plone40/src/Products.kupu/Products/kupu/plone/tests/test_html2captioned.py", line 71, in do_convert
    got, expected, self.transform.name(), self.input))
  File "/usr/local/python2.6/lib/python2.6/unittest.py", line 350, in failUnlessEqual
    (msg or '%r != %r' % (first, second))
AssertionError: Got:
[<div>Simple text containing an embedded image</div><dl class="image-left captioned"><dt><img src="http://nohost/plone/folder/gamma/image" alt="Kupu Test Image" title="Kupu Test Image" height="331" width="500" /></dt><dd class="image-caption" style="width:500px">Test image caption</dd></dl><dl class="image-left captioned"><dt><img src="http://nohost/plone/folder/gamma/image_thumb" alt="Kupu Test Image" title="Kupu Test Image" height="84" width="128" /></dt><dd class="image-caption" style="width:500px">Test image caption</dd></dl><dl class="image-left captioned"><dt><img src="http://nohost/plone/folder/gamma/image" alt="Kupu Test Image" title="Kupu Test Image" height="331" width="500" /></dt><dd class="image-caption" style="width:500px">Test image caption</dd></dl>]

!=

Expected:
[<div>Simple text containing an embedded image</div><dl class="image-left captioned"><dt><img src="http://nohost/plone/folder/gamma/image" alt="Kupu Test Image" title="Kupu Test Image" height="331" width="500" /></dt><dd class="image-caption" style="width:500px">Test image caption</dd></dl><dl class="image-left captioned"><dt><a rel="lightbox" href="/plone/folder/gamma"><img src="http://nohost/plone/folder/gamma/image_thumb" alt="Kupu Test Image" title="Kupu Test Image" height="84" width="128" /></a></dt><dd class="image-caption" style="width:128px">Test image caption</dd></dl><dl class="image-left captioned"><dt><img src="http://nohost/plone/folder/gamma/image" alt="Kupu Test Image" title="Kupu Test Image" height="331" width="500" /></dt><dd class="image-caption" style="width:500px">Test image caption</dd></dl>]

IN html_to_captioned(/home/stefan/autotest/temp/python26-zope212-cmf22-plone40/src/Products.kupu/Products/kupu/plone/tests/input/simple.in)



Failure in test testSameNoFilename (Products.kupu.plone.tests.test_html2captioned.TransformTestSubclass)
Traceback (most recent call last):
  File "/usr/local/python2.6/lib/python2.6/unittest.py", line 279, in run
    testMethod()
  File "/home/stefan/autotest/temp/python26-zope212-cmf22-plone40/src/Products.kupu/Products/kupu/plone/tests/test_html2captioned.py", line 82, in testSameNoFilename
    self.do_convert()
  File "/home/stefan/autotest/temp/python26-zope212-cmf22-plone40/src/Products.kupu/Products/kupu/plone/tests/test_html2captioned.py", line 71, in do_convert
    got, expected, self.transform.name(), self.input))
  File "/usr/local/python2.6/lib/python2.6/unittest.py", line 350, in failUnlessEqual
    (msg or '%r != %r' % (first, second))
AssertionError: Got:
[<div>Simple text containing an embedded image</div><dl class="image-left captioned"><dt><img src="http://nohost/plone/folder/gamma/image" alt="Kupu Test Image" title="Kupu Test Image" height="331" width="500" /></dt><dd class="image-caption" style="width:500px">Test image caption</dd></dl><dl class="image-left captioned"><dt><img src="http://nohost/plone/folder/gamma/image_thumb" alt="Kupu Test Image" title="Kupu Test Image" height="84" width="128" /></dt><dd class="image-caption" style="width:500px">Test image caption</dd></dl><dl class="image-left captioned"><dt><img src="http://nohost/plone/folder/gamma/image" alt="Kupu Test Image" title="Kupu Test Image" height="331" width="500" /></dt><dd class="image-caption" style="width:500px">Test image caption</dd></dl>]

!=

Expected:
[<div>Simple text containing an embedded image</div><dl class="image-left captioned"><dt><img src="http://nohost/plone/folder/gamma/image" alt="Kupu Test Image" title="Kupu Test Image" height="331" width="500" /></dt><dd class="image-caption" style="width:500px">Test image caption</dd></dl><dl class="image-left captioned"><dt><a rel="lightbox" href="/plone/folder/gamma"><img src="http://nohost/plone/folder/gamma/image_thumb" alt="Kupu Test Image" title="Kupu Test Image" height="84" width="128" /></a></dt><dd class="image-caption" style="width:128px">Test image caption</dd></dl><dl class="image-left captioned"><dt><img src="http://nohost/plone/folder/gamma/image" alt="Kupu Test Image" title="Kupu Test Image" height="331" width="500" /></dt><dd class="image-caption" style="width:500px">Test image caption</dd></dl>]

IN html_to_captioned(/home/stefan/autotest/temp/python26-zope212-cmf22-plone40/src/Products.kupu/Products/kupu/plone/tests/input/simple.in)



Failure in test testSame (Products.kupu.plone.tests.test_html2captioned.TransformTestSubclass)
Traceback (most recent call last):
  File "/usr/local/python2.6/lib/python2.6/unittest.py", line 279, in run
    testMethod()
  File "/home/stefan/autotest/temp/python26-zope212-cmf22-plone40/src/Products.kupu/Products/kupu/plone/tests/test_html2captioned.py", line 78, in testSame
    self.do_convert(filename=self.input)
  File "/home/stefan/autotest/temp/python26-zope212-cmf22-plone40/src/Products.kupu/Products/kupu/plone/tests/test_html2captioned.py", line 71, in do_convert
    got, expected, self.transform.name(), self.input))
  File "/usr/local/python2.6/lib/python2.6/unittest.py", line 350, in failUnlessEqual
    (msg or '%r != %r' % (first, second))
AssertionError: Got:
[<div>Simple text containing an embedded image</div><dl class="image-left captioned"><dt><img src="http://nohost/plone/folder/umlauts/image" alt="Kupu Test Image åäö" title="Kupu Test Image åäö" height="331" width="500" /></dt><dd class="image-caption" style="width:500px">Test image caption åäö</dd></dl><dl class="image-left captioned"><dt><img src="http://nohost/plone/folder/umlauts/image_thumb" alt="Kupu Test Image åäö" title="Kupu Test Image åäö" height="84" width="128" /></dt><dd class="image-caption" style="width:500px">Test image caption åäö</dd></dl><dl class="image-left captioned"><dt><img src="http://nohost/plone/folder/umlauts/image" alt="Kupu Test Image åäö" title="Kupu Test Image åäö" height="331" width="500" /></dt><dd class="image-caption" style="width:500px">Test image caption åäö</dd></dl>]

!=

Expected:
[<div>Simple text containing an embedded image</div><dl class="image-left captioned"><dt><img src="http://nohost/plone/folder/umlauts/image" alt="Kupu Test Image åäö" title="Kupu Test Image åäö" height="331" width="500" /></dt><dd class="image-caption" style="width:500px">Test image caption åäö</dd></dl><dl class="image-left captioned"><dt><a rel="lightbox" href="/plone/folder/umlauts"><img src="http://nohost/plone/folder/umlauts/image_thumb" alt="Kupu Test Image åäö" title="Kupu Test Image åäö" height="84" width="128" /></a></dt><dd class="image-caption" style="width:128px">Test image caption åäö</dd></dl><dl class="image-left captioned"><dt><img src="http://nohost/plone/folder/umlauts/image" alt="Kupu Test Image åäö" title="Kupu Test Image åäö" height="331" width="500" /></dt><dd class="image-caption" style="width:500px">Test image caption åäö</dd></dl>]

IN html_to_captioned(/home/stefan/autotest/temp/python26-zope212-cmf22-plone40/src/Products.kupu/Products/kupu/plone/tests/input/umlauts.in)



Failure in test testSameNoFilename (Products.kupu.plone.tests.test_html2captioned.TransformTestSubclass)
Traceback (most recent call last):
  File "/usr/local/python2.6/lib/python2.6/unittest.py", line 279, in run
    testMethod()
  File "/home/stefan/autotest/temp/python26-zope212-cmf22-plone40/src/Products.kupu/Products/kupu/plone/tests/test_html2captioned.py", line 82, in testSameNoFilename
    self.do_convert()
  File "/home/stefan/autotest/temp/python26-zope212-cmf22-plone40/src/Products.kupu/Products/kupu/plone/tests/test_html2captioned.py", line 71, in do_convert
    got, expected, self.transform.name(), self.input))
  File "/usr/local/python2.6/lib/python2.6/unittest.py", line 350, in failUnlessEqual
    (msg or '%r != %r' % (first, second))
AssertionError: Got:
[<div>Simple text containing an embedded image</div><dl class="image-left captioned"><dt><img src="http://nohost/plone/folder/umlauts/image" alt="Kupu Test Image åäö" title="Kupu Test Image åäö" height="331" width="500" /></dt><dd class="image-caption" style="width:500px">Test image caption åäö</dd></dl><dl class="image-left captioned"><dt><img src="http://nohost/plone/folder/umlauts/image_thumb" alt="Kupu Test Image åäö" title="Kupu Test Image åäö" height="84" width="128" /></dt><dd class="image-caption" style="width:500px">Test image caption åäö</dd></dl><dl class="image-left captioned"><dt><img src="http://nohost/plone/folder/umlauts/image" alt="Kupu Test Image åäö" title="Kupu Test Image åäö" height="331" width="500" /></dt><dd class="image-caption" style="width:500px">Test image caption åäö</dd></dl>]

!=

Expected:
[<div>Simple text containing an embedded image</div><dl class="image-left captioned"><dt><img src="http://nohost/plone/folder/umlauts/image" alt="Kupu Test Image åäö" title="Kupu Test Image åäö" height="331" width="500" /></dt><dd class="image-caption" style="width:500px">Test image caption åäö</dd></dl><dl class="image-left captioned"><dt><a rel="lightbox" href="/plone/folder/umlauts"><img src="http://nohost/plone/folder/umlauts/image_thumb" alt="Kupu Test Image åäö" title="Kupu Test Image åäö" height="84" width="128" /></a></dt><dd class="image-caption" style="width:128px">Test image caption åäö</dd></dl><dl class="image-left captioned"><dt><img src="http://nohost/plone/folder/umlauts/image" alt="Kupu Test Image åäö" title="Kupu Test Image åäö" height="331" width="500" /></dt><dd class="image-caption" style="width:500px">Test image caption åäö</dd></dl>]

IN html_to_captioned(/home/stefan/autotest/temp/python26-zope212-cmf22-plone40/src/Products.kupu/Products/kupu/plone/tests/input/umlauts.in)



Error in test test_delete (Products.kupu.plone.tests.test_librarymanager.TestILibraryManager)
Traceback (most recent call last):
  File "/usr/local/python2.6/lib/python2.6/unittest.py", line 279, in run
    testMethod()
  File "/home/stefan/autotest/temp/python26-zope212-cmf22-plone40/src/Products.kupu/Products/kupu/plone/tests/test_librarymanager.py", line 102, in test_delete
    self.assertEqual(libs.getLibraries(self.context), expected)
  File "/home/stefan/autotest/temp/python26-zope212-cmf22-plone40/src/Products.kupu/Products/kupu/plone/librarytool.py", line 85, in getLibraries
    lib[key] = self.translate(lib[key], domain='kupu')
AttributeError: translate



Error in test test_expressions (Products.kupu.plone.tests.test_librarymanager.TestILibraryManager)
Traceback (most recent call last):
  File "/usr/local/python2.6/lib/python2.6/unittest.py", line 279, in run
    testMethod()
  File "/home/stefan/autotest/temp/python26-zope212-cmf22-plone40/src/Products.kupu/Products/kupu/plone/tests/test_librarymanager.py", line 90, in test_expressions
    v = libs.getLibraries(context)
  File "/home/stefan/autotest/temp/python26-zope212-cmf22-plone40/src/Products.kupu/Products/kupu/plone/librarytool.py", line 85, in getLibraries
    lib[key] = self.translate(lib[key], domain='kupu')
AttributeError: translate



Error in test test_get_library (Products.kupu.plone.tests.test_librarymanager.TestILibraryManager)
Traceback (most recent call last):
  File "/usr/local/python2.6/lib/python2.6/unittest.py", line 279, in run
    testMethod()
  File "/home/stefan/autotest/temp/python26-zope212-cmf22-plone40/src/Products.kupu/Products/kupu/plone/tests/test_librarymanager.py", line 67, in test_get_library
    self.assertEqual(libs.getLibraries(self.context), expected)
  File "/home/stefan/autotest/temp/python26-zope212-cmf22-plone40/src/Products.kupu/Products/kupu/plone/librarytool.py", line 85, in getLibraries
    lib[key] = self.translate(lib[key], domain='kupu')
AttributeError: translate



Error in test test_move (Products.kupu.plone.tests.test_librarymanager.TestILibraryManager)
Traceback (most recent call last):
  File "/usr/local/python2.6/lib/python2.6/unittest.py", line 279, in run
    testMethod()
  File "/home/stefan/autotest/temp/python26-zope212-cmf22-plone40/src/Products.kupu/Products/kupu/plone/tests/test_librarymanager.py", line 143, in test_move
    self.assertEqual(libs.getLibraries(self.context), expected)
  File "/home/stefan/autotest/temp/python26-zope212-cmf22-plone40/src/Products.kupu/Products/kupu/plone/librarytool.py", line 85, in getLibraries
    lib[key] = self.translate(lib[key], domain='kupu')
AttributeError: translate



Error in test test_update (Products.kupu.plone.tests.test_librarymanager.TestILibraryManager)
Traceback (most recent call last):
  File "/usr/local/python2.6/lib/python2.6/unittest.py", line 279, in run
    testMethod()
  File "/home/stefan/autotest/temp/python26-zope212-cmf22-plone40/src/Products.kupu/Products/kupu/plone/tests/test_librarymanager.py", line 130, in test_update
    self.assertEqual(libs.getLibraries(context), expected)
  File "/home/stefan/autotest/temp/python26-zope212-cmf22-plone40/src/Products.kupu/Products/kupu/plone/librarytool.py", line 85, in getLibraries
    lib[key] = self.translate(lib[key], domain='kupu')
AttributeError: translate

  Ran 373 tests with 4 failures and 5 errors in 14.867 seconds.
Running zope.testing.testrunner.layer.UnitTests tests:
  Tear down Products.PloneTestCase.layer.PloneSite in 0.388 seconds.
  Tear down Products.PloneTestCase.layer.ZCML in 0.004 seconds.
  Tear down Testing.ZopeTestCase.layer.ZopeLite in 0.000 seconds.
  Set up zope.testing.testrunner.layer.UnitTests in 0.000 seconds.
  Ran 8 tests with 0 failures and 0 errors in 0.001 seconds.
Tearing down left over layers:
  Tear down zope.testing.testrunner.layer.UnitTests in 0.000 seconds.
Total: 384 tests, 4 failures, 5 errors in 23.539 seconds.
Running archetypes.referencebrowserwidget.tests.base.layer tests:
  Set up Testing.ZopeTestCase.layer.ZopeLite in 0.000 seconds.
  Set up Products.PloneTestCase.layer.ZCML in 1.828 seconds.
  Set up Products.PloneTestCase.layer.PloneSite in 4.634 seconds.
  Set up archetypes.referencebrowserwidget.tests.base.layer in 0.000 seconds.


Failure in test test_requiredbehavior_multi (archetypes.referencebrowserwidget.tests.test_product.ProductsTestCase)
Traceback (most recent call last):
  File "/usr/local/python2.6/lib/python2.6/unittest.py", line 279, in run
    testMethod()
  File "/home/stefan/autotest/temp/python26-zope212-cmf22-plone40/src/archetypes.referencebrowserwidget/src/archetypes/referencebrowserwidget/tests/test_product.py", line 97, in test_requiredbehavior_multi
    assert len(value) == 2
AssertionError

  Ran 43 tests with 1 failures and 0 errors in 7.737 seconds.
Running zope.testing.testrunner.layer.UnitTests tests:
  Tear down archetypes.referencebrowserwidget.tests.base.layer in 0.000 seconds.
  Tear down Products.PloneTestCase.layer.PloneSite in 0.368 seconds.
  Tear down Products.PloneTestCase.layer.ZCML in 0.007 seconds.
  Tear down Testing.ZopeTestCase.layer.ZopeLite in 0.000 seconds.
  Set up zope.testing.testrunner.layer.UnitTests in 0.000 seconds.
  Ran 4 tests with 0 failures and 0 errors in 0.001 seconds.
Tearing down left over layers:
  Tear down zope.testing.testrunner.layer.UnitTests in 0.000 seconds.
Total: 47 tests, 1 failures, 0 errors in 15.057 seconds.
Running archetypes.schemaextender.tests.testIntegration.layer tests:
  Set up Testing.ZopeTestCase.layer.ZopeLite in 1.267 seconds.
  Set up Products.PloneTestCase.layer.ZCML in 2.348 seconds.
  Set up Products.PloneTestCase.layer.PloneSite in 4.048 seconds.
  Set up archetypes.schemaextender.tests.testIntegration.layer in 0.000 seconds.


Failure in test /home/stefan/autotest/temp/python26-zope212-cmf22-plone40/eggs/archetypes.schemaextender-1.4-py2.6.egg/archetypes/schemaextender/usage.txt
Failed doctest test for usage.txt
  File "/home/stefan/autotest/temp/python26-zope212-cmf22-plone40/eggs/archetypes.schemaextender-1.4-py2.6.egg/archetypes/schemaextender/usage.txt", line 0

----------------------------------------------------------------------
File "/home/stefan/autotest/temp/python26-zope212-cmf22-plone40/eggs/archetypes.schemaextender-1.4-py2.6.egg/archetypes/schemaextender/usage.txt", line 259, in usage.txt
Failed example:
    browser.getControl('Tags').value
Differences (ndiff with -expected +actual):
    - 'A\nB'
    + 'A\r\nB'
    ?   ++

  Ran 17 tests with 1 failures and 0 errors in 3.067 seconds.
Running zope.testing.testrunner.layer.UnitTests tests:
  Tear down archetypes.schemaextender.tests.testIntegration.layer in 0.000 seconds.
  Tear down Products.PloneTestCase.layer.PloneSite in 0.365 seconds.
  Tear down Products.PloneTestCase.layer.ZCML in 0.007 seconds.
  Tear down Testing.ZopeTestCase.layer.ZopeLite in 0.000 seconds.
  Set up zope.testing.testrunner.layer.UnitTests in 0.000 seconds.
  Ran 19 tests with 0 failures and 0 errors in 0.007 seconds.
Tearing down left over layers:
  Tear down zope.testing.testrunner.layer.UnitTests in 0.000 seconds.
Total: 36 tests, 1 failures, 0 errors in 11.536 seconds.
Running zope.testing.testrunner.layer.UnitTests tests:
  Set up zope.testing.testrunner.layer.UnitTests in 0.000 seconds.
  Ran 4 tests with 0 failures and 0 errors in 0.039 seconds.
Tearing down left over layers:
  Tear down zope.testing.testrunner.layer.UnitTests in 0.000 seconds.
Running Testing.ZopeTestCase.layer.ZopeLite tests:
  Set up Testing.ZopeTestCase.layer.ZopeLite in 0.036 seconds.
  Ran 40 tests with 0 failures and 0 errors in 0.765 seconds.
Tearing down left over layers:
  Tear down Testing.ZopeTestCase.layer.ZopeLite in 0.000 seconds.
/home/stefan/autotest/temp/python26-zope212-cmf22-plone40/src/kss.core/kss/core/tests/test_kssview_core.py:165: UserWarning: The test_class you are using doesn't subclass from ZopeTestCase.Functional. Please fix that.
  tearDown=KSSViewTestCase.beforeTearDown.im_func))
Running Testing.ZopeTestCase.layer.ZopeLite tests:
  Set up Testing.ZopeTestCase.layer.ZopeLite in 0.046 seconds.
  Ran 1 tests with 0 failures and 0 errors in 0.258 seconds.
Running kss.core.tests.base.KSSLayer tests:
  Tear down Testing.ZopeTestCase.layer.ZopeLite in 0.000 seconds.
  Set up kss.core.tests.base.KSSCoreLayer in 0.030 seconds.
  Set up kss.core.tests.base.KSSLayer in 0.056 seconds.
  Ran 29 tests with 0 failures and 0 errors in 0.155 seconds.
Running kss.core.tests.test_ttwapi.layer tests:
  Set up kss.core.tests.test_ttwapi.layer in 0.001 seconds.
  Ran 3 tests with 0 failures and 0 errors in 0.026 seconds.
Running zope.testing.testrunner.layer.UnitTests tests:
  Tear down kss.core.tests.test_ttwapi.layer in 0.000 seconds.
  Tear down kss.core.tests.base.KSSLayer in 0.000 seconds.
  Tear down kss.core.tests.base.KSSCoreLayer in 0.000 seconds.
  Set up zope.testing.testrunner.layer.UnitTests in 0.000 seconds.
/home/stefan/autotest/temp/python26-zope212-cmf22-plone40/src/kss.core/kss/core/siteview.txt:1: DeprecationWarning: ISite is deprecated. Moved to zope.location.interfaces. Importing from here will stop working in Zope 3.6
  =========
  Ran 14 tests with 0 failures and 0 errors in 0.009 seconds.
Tearing down left over layers:
  Tear down zope.testing.testrunner.layer.UnitTests in 0.000 seconds.
Total: 47 tests, 0 failures, 0 errors in 0.889 seconds.
***********************************************
WARNING: LinguaPlone not found. Skipping tests.
***********************************************
***********************************************
WARNING: LinguaPlone not found. Skipping tests.
***********************************************
Running plone.app.blob.tests.layer.BlobLayer tests:
  Set up Testing.ZopeTestCase.layer.ZopeLite in 0.884 seconds.
  Set up Products.PloneTestCase.layer.ZCML in 2.361 seconds.
  Set up Products.PloneTestCase.layer.PloneSite in 4.060 seconds.
  Set up plone.app.blob.tests.layer.BlobLayer in 0.103 seconds.
/home/stefan/autotest/temp/python26-zope212-cmf22-plone40/eggs/Products.PortalTransforms-2.0a1-py2.6.egg/Products/PortalTransforms/libtransforms/commandtransform.py:97: DeprecationWarning: os.popen4 is deprecated.  Use the subprocess module.
  cin, couterr = os.popen4(command, 'b')
  Ran 28 tests with 0 failures and 0 errors in 2 minutes 0.455 seconds.
Running plone.app.blob.tests.layer.BlobReplacementLayer tests:
  Set up plone.app.blob.tests.layer.BlobReplacementLayer in 0.190 seconds.
  Ran 39 tests with 0 failures and 0 errors in 49.451 seconds.
Running zope.testing.testrunner.layer.UnitTests tests:
  Tear down plone.app.blob.tests.layer.BlobReplacementLayer in 0.000 seconds.
  Tear down plone.app.blob.tests.layer.BlobLayer in 0.000 seconds.
  Tear down Products.PloneTestCase.layer.PloneSite in 0.352 seconds.
  Tear down Products.PloneTestCase.layer.ZCML in 0.009 seconds.
  Tear down Testing.ZopeTestCase.layer.ZopeLite in 0.000 seconds.
  Set up zope.testing.testrunner.layer.UnitTests in 0.000 seconds.
  Ran 2 tests with 0 failures and 0 errors in 0.001 seconds.
Tearing down left over layers:
  Tear down zope.testing.testrunner.layer.UnitTests in 0.000 seconds.
Total: 69 tests, 0 failures, 0 errors in 2 minutes 58.582 seconds.
Running Testing.ZopeTestCase.layer.ZopeLite tests:
  Set up Testing.ZopeTestCase.layer.ZopeLite in 0.895 seconds.
  Ran 2 tests with 0 failures and 0 errors in 0.008 seconds.
Running plone.app.folder.tests.layer.IntegrationLayer tests:
  Set up Products.PloneTestCase.layer.ZCML in 2.375 seconds.
  Set up Products.PloneTestCase.layer.PloneSite in 3.947 seconds.
  Set up plone.app.folder.tests.layer.IntegrationLayer in 0.468 seconds.
  Ran 9 tests with 0 failures and 0 errors in 2.117 seconds.
Running plone.app.folder.tests.layer.PartialOrderingIntegrationLayer tests:
  Set up plone.app.folder.tests.layer.PartialOrderingIntegrationLayer in 0.000 seconds.
  Ran 3 tests with 0 failures and 0 errors in 0.313 seconds.
Tearing down left over layers:
  Tear down plone.app.folder.tests.layer.PartialOrderingIntegrationLayer in 0.000 seconds.
  Tear down plone.app.folder.tests.layer.IntegrationLayer in 0.000 seconds.
  Tear down Products.PloneTestCase.layer.PloneSite in 0.365 seconds.
  Tear down Products.PloneTestCase.layer.ZCML in 0.004 seconds.
  Tear down Testing.ZopeTestCase.layer.ZopeLite in 0.000 seconds.
Total: 14 tests, 0 failures, 0 errors in 11.061 seconds.
Running plone.app.imaging.tests.layer.ImagingLayer tests:
  Set up Testing.ZopeTestCase.layer.ZopeLite in 0.891 seconds.
  Set up Products.PloneTestCase.layer.ZCML in 2.346 seconds.
  Set up Products.PloneTestCase.layer.PloneSite in 4.063 seconds.
  Set up plone.app.imaging.tests.layer.ImagingLayer in 0.102 seconds.
  Ran 34 tests with 0 failures and 0 errors in 3.867 seconds.
Running zope.testing.testrunner.layer.UnitTests tests:
  Tear down plone.app.imaging.tests.layer.ImagingLayer in 0.000 seconds.
  Tear down Products.PloneTestCase.layer.PloneSite in 0.375 seconds.
  Tear down Products.PloneTestCase.layer.ZCML in 0.005 seconds.
  Tear down Testing.ZopeTestCase.layer.ZopeLite in 0.000 seconds.
  Set up zope.testing.testrunner.layer.UnitTests in 0.000 seconds.
  Ran 7 tests with 0 failures and 0 errors in 0.001 seconds.
Tearing down left over layers:
  Tear down zope.testing.testrunner.layer.UnitTests in 0.000 seconds.
Total: 41 tests, 0 failures, 0 errors in 12.085 seconds.
Running Products.PloneTestCase.layer.PloneSite tests:
  Set up Testing.ZopeTestCase.layer.ZopeLite in 1.370 seconds.
  Set up Products.PloneTestCase.layer.ZCML in 2.382 seconds.
  Set up Products.PloneTestCase.layer.PloneSite in 4.076 seconds.
  Ran 7 tests with 0 failures and 0 errors in 0.071 seconds.
Tearing down left over layers:
  Tear down Products.PloneTestCase.layer.PloneSite in 0.363 seconds.
  Tear down Products.PloneTestCase.layer.ZCML in 0.004 seconds.
  Tear down Testing.ZopeTestCase.layer.ZopeLite in 0.000 seconds.
Total: 0 tests, 0 failures, 0 errors in 0.000 seconds.
Running Products.PloneTestCase.layer.PloneSite tests:
  Set up Testing.ZopeTestCase.layer.ZopeLite in 1.395 seconds.
  Set up Products.PloneTestCase.layer.ZCML in 2.290 seconds.
  Set up Products.PloneTestCase.layer.PloneSite in 4.079 seconds.
  Ran 3 tests with 0 failures and 0 errors in 1.131 seconds.
Tearing down left over layers:
  Tear down Products.PloneTestCase.layer.PloneSite in 0.352 seconds.
  Tear down Products.PloneTestCase.layer.ZCML in 0.004 seconds.
  Tear down Testing.ZopeTestCase.layer.ZopeLite in 0.000 seconds.
Running Products.PloneTestCase.layer.PloneSite tests:
  Set up Testing.ZopeTestCase.layer.ZopeLite in 1.619 seconds.
  Set up Products.PloneTestCase.layer.ZCML in 2.372 seconds.
  Set up Products.PloneTestCase.layer.PloneSite in 4.070 seconds.


Failure in test /home/stefan/autotest/temp/python26-zope212-cmf22-plone40/src/plone.app.users/plone/app/users/tests/flexible_user_registration.txt
Failed doctest test for flexible_user_registration.txt
  File "/home/stefan/autotest/temp/python26-zope212-cmf22-plone40/src/plone.app.users/plone/app/users/tests/flexible_user_registration.txt", line 0

----------------------------------------------------------------------
File "/home/stefan/autotest/temp/python26-zope212-cmf22-plone40/src/plone.app.users/plone/app/users/tests/flexible_user_registration.txt", line 10, in flexible_user_registration.txt
Failed example:
    form.getControl(name='form.location')
Exception raised:
    Traceback (most recent call last):
      File "/home/stefan/autotest/temp/python26-zope212-cmf22-plone40/eggs/zope.testing-3.7.7-py2.6.egg/zope/testing/doctest.py", line 1361, in __run
        compileflags, 1) in test.globs
      File "<doctest flexible_user_registration.txt[line 10, example 3]>", line 1, in <module>
        form.getControl(name='form.location')
      File "/home/stefan/autotest/temp/python26-zope212-cmf22-plone40/eggs/zope.testbrowser-3.6.0a2-py2.6.egg/zope/testbrowser/browser.py", line 755, in getControl
        control, form = disambiguate(intermediate, msg, index)
      File "/home/stefan/autotest/temp/python26-zope212-cmf22-plone40/eggs/zope.testbrowser-3.6.0a2-py2.6.egg/zope/testbrowser/browser.py", line 54, in disambiguate
        raise LookupError(msg)
    LookupError: name 'form.location'
----------------------------------------------------------------------
File "/home/stefan/autotest/temp/python26-zope212-cmf22-plone40/src/plone.app.users/plone/app/users/tests/flexible_user_registration.txt", line 12, in flexible_user_registration.txt
Failed example:
    form.getControl(name='form.home_page')
Exception raised:
    Traceback (most recent call last):
      File "/home/stefan/autotest/temp/python26-zope212-cmf22-plone40/eggs/zope.testing-3.7.7-py2.6.egg/zope/testing/doctest.py", line 1361, in __run
        compileflags, 1) in test.globs
      File "<doctest flexible_user_registration.txt[line 12, example 4]>", line 1, in <module>
        form.getControl(name='form.home_page')
      File "/home/stefan/autotest/temp/python26-zope212-cmf22-plone40/eggs/zope.testbrowser-3.6.0a2-py2.6.egg/zope/testbrowser/browser.py", line 755, in getControl
        control, form = disambiguate(intermediate, msg, index)
      File "/home/stefan/autotest/temp/python26-zope212-cmf22-plone40/eggs/zope.testbrowser-3.6.0a2-py2.6.egg/zope/testbrowser/browser.py", line 54, in disambiguate
        raise LookupError(msg)
    LookupError: name 'form.home_page'
----------------------------------------------------------------------
File "/home/stefan/autotest/temp/python26-zope212-cmf22-plone40/src/plone.app.users/plone/app/users/tests/flexible_user_registration.txt", line 22, in flexible_user_registration.txt
Failed example:
    'Member Registration' in browser.contents
Expected:
    True
Got:
    False
----------------------------------------------------------------------
File "/home/stefan/autotest/temp/python26-zope212-cmf22-plone40/src/plone.app.users/plone/app/users/tests/flexible_user_registration.txt", line 24, in flexible_user_registration.txt
Failed example:
    link = browser.getLink(url='http://nohost/plone/@@member-registration')
Exception raised:
    Traceback (most recent call last):
      File "/home/stefan/autotest/temp/python26-zope212-cmf22-plone40/eggs/zope.testing-3.7.7-py2.6.egg/zope/testing/doctest.py", line 1361, in __run
        compileflags, 1) in test.globs
      File "<doctest flexible_user_registration.txt[line 24, example 11]>", line 1, in <module>
        link = browser.getLink(url='http://nohost/plone/@@member-registration')
      File "/home/stefan/autotest/temp/python26-zope212-cmf22-plone40/eggs/zope.testbrowser-3.6.0a2-py2.6.egg/zope/testbrowser/browser.py", line 327, in getLink
        return Link(self.mech_browser.find_link(**args), self)
      File "build/bdist.linux-x86_64/egg/mechanize/_mechanize.py", line 626, in find_link
    LinkNotFoundError
----------------------------------------------------------------------
File "/home/stefan/autotest/temp/python26-zope212-cmf22-plone40/src/plone.app.users/plone/app/users/tests/flexible_user_registration.txt", line 25, in flexible_user_registration.txt
Failed example:
    link
Exception raised:
    Traceback (most recent call last):
      File "/home/stefan/autotest/temp/python26-zope212-cmf22-plone40/eggs/zope.testing-3.7.7-py2.6.egg/zope/testing/doctest.py", line 1361, in __run
        compileflags, 1) in test.globs
      File "<doctest flexible_user_registration.txt[line 25, example 12]>", line 1, in <module>
        link
    NameError: name 'link' is not defined
----------------------------------------------------------------------
File "/home/stefan/autotest/temp/python26-zope212-cmf22-plone40/src/plone.app.users/plone/app/users/tests/flexible_user_registration.txt", line 27, in flexible_user_registration.txt
Failed example:
    link.click()
Exception raised:
    Traceback (most recent call last):
      File "/home/stefan/autotest/temp/python26-zope212-cmf22-plone40/eggs/zope.testing-3.7.7-py2.6.egg/zope/testing/doctest.py", line 1361, in __run
        compileflags, 1) in test.globs
      File "<doctest flexible_user_registration.txt[line 27, example 13]>", line 1, in <module>
        link.click()
    NameError: name 'link' is not defined
----------------------------------------------------------------------
File "/home/stefan/autotest/temp/python26-zope212-cmf22-plone40/src/plone.app.users/plone/app/users/tests/flexible_user_registration.txt", line 28, in flexible_user_registration.txt
Failed example:
    'Registration settings' in browser.contents
Expected:
    True
Got:
    False
----------------------------------------------------------------------
File "/home/stefan/autotest/temp/python26-zope212-cmf22-plone40/src/plone.app.users/plone/app/users/tests/flexible_user_registration.txt", line 33, in flexible_user_registration.txt
Failed example:
    form = browser.getForm(action='http://nohost/plone/@@member-registration')
Exception raised:
    Traceback (most recent call last):
      File "/home/stefan/autotest/temp/python26-zope212-cmf22-plone40/eggs/zope.testing-3.7.7-py2.6.egg/zope/testing/doctest.py", line 1361, in __run
        compileflags, 1) in test.globs
      File "<doctest flexible_user_registration.txt[line 33, example 15]>", line 1, in <module>
        form = browser.getForm(action='http://nohost/plone/@@member-registration')
      File "/home/stefan/autotest/temp/python26-zope212-cmf22-plone40/eggs/zope.testbrowser-3.6.0a2-py2.6.egg/zope/testbrowser/browser.py", line 398, in getForm
        form = disambiguate(matching_forms, '', index)
      File "/home/stefan/autotest/temp/python26-zope212-cmf22-plone40/eggs/zope.testbrowser-3.6.0a2-py2.6.egg/zope/testbrowser/browser.py", line 54, in disambiguate
        raise LookupError(msg)
    LookupError
----------------------------------------------------------------------
File "/home/stefan/autotest/temp/python26-zope212-cmf22-plone40/src/plone.app.users/plone/app/users/tests/flexible_user_registration.txt", line 34, in flexible_user_registration.txt
Failed example:
    join_form_fields = form.getControl(name='form.join_form_fields.to')
Exception raised:
    Traceback (most recent call last):
      File "/home/stefan/autotest/temp/python26-zope212-cmf22-plone40/eggs/zope.testing-3.7.7-py2.6.egg/zope/testing/doctest.py", line 1361, in __run
        compileflags, 1) in test.globs
      File "<doctest flexible_user_registration.txt[line 34, example 16]>", line 1, in <module>
        join_form_fields = form.getControl(name='form.join_form_fields.to')
      File "/home/stefan/autotest/temp/python26-zope212-cmf22-plone40/eggs/zope.testbrowser-3.6.0a2-py2.6.egg/zope/testbrowser/browser.py", line 752, in getControl
        raise zope.testbrowser.interfaces.ExpiredError
    ExpiredError
----------------------------------------------------------------------
File "/home/stefan/autotest/temp/python26-zope212-cmf22-plone40/src/plone.app.users/plone/app/users/tests/flexible_user_registration.txt", line 35, in flexible_user_registration.txt
Failed example:
    'location' in join_form_fields.displayOptions
Exception raised:
    Traceback (most recent call last):
      File "/home/stefan/autotest/temp/python26-zope212-cmf22-plone40/eggs/zope.testing-3.7.7-py2.6.egg/zope/testing/doctest.py", line 1361, in __run
        compileflags, 1) in test.globs
      File "<doctest flexible_user_registration.txt[line 35, example 17]>", line 1, in <module>
        'location' in join_form_fields.displayOptions
    NameError: name 'join_form_fields' is not defined
----------------------------------------------------------------------
File "/home/stefan/autotest/temp/python26-zope212-cmf22-plone40/src/plone.app.users/plone/app/users/tests/flexible_user_registration.txt", line 37, in flexible_user_registration.txt
Failed example:
    'home_page' in join_form_fields.displayOptions
Exception raised:
    Traceback (most recent call last):
      File "/home/stefan/autotest/temp/python26-zope212-cmf22-plone40/eggs/zope.testing-3.7.7-py2.6.egg/zope/testing/doctest.py", line 1361, in __run
        compileflags, 1) in test.globs
      File "<doctest flexible_user_registration.txt[line 37, example 18]>", line 1, in <module>
        'home_page' in join_form_fields.displayOptions
    NameError: name 'join_form_fields' is not defined
----------------------------------------------------------------------
File "/home/stefan/autotest/temp/python26-zope212-cmf22-plone40/src/plone.app.users/plone/app/users/tests/flexible_user_registration.txt", line 45, in flexible_user_registration.txt
Failed example:
    homepage = join_form_fields.getControl(value='home_page')
Exception raised:
    Traceback (most recent call last):
      File "/home/stefan/autotest/temp/python26-zope212-cmf22-plone40/eggs/zope.testing-3.7.7-py2.6.egg/zope/testing/doctest.py", line 1361, in __run
        compileflags, 1) in test.globs
      File "<doctest flexible_user_registration.txt[line 45, example 19]>", line 1, in <module>
        homepage = join_form_fields.getControl(value='home_page')
    NameError: name 'join_form_fields' is not defined
----------------------------------------------------------------------
File "/home/stefan/autotest/temp/python26-zope212-cmf22-plone40/src/plone.app.users/plone/app/users/tests/flexible_user_registration.txt", line 46, in flexible_user_registration.txt
Failed example:
    homepage.click()
Exception raised:
    Traceback (most recent call last):
      File "/home/stefan/autotest/temp/python26-zope212-cmf22-plone40/eggs/zope.testing-3.7.7-py2.6.egg/zope/testing/doctest.py", line 1361, in __run
        compileflags, 1) in test.globs
      File "<doctest flexible_user_registration.txt[line 46, example 20]>", line 1, in <module>
        homepage.click()
    NameError: name 'homepage' is not defined
----------------------------------------------------------------------
File "/home/stefan/autotest/temp/python26-zope212-cmf22-plone40/src/plone.app.users/plone/app/users/tests/flexible_user_registration.txt", line 47, in flexible_user_registration.txt
Failed example:
    to_left = form.getControl(name='to2fromButton')
Exception raised:
    Traceback (most recent call last):
      File "/home/stefan/autotest/temp/python26-zope212-cmf22-plone40/eggs/zope.testing-3.7.7-py2.6.egg/zope/testing/doctest.py", line 1361, in __run
        compileflags, 1) in test.globs
      File "<doctest flexible_user_registration.txt[line 47, example 21]>", line 1, in <module>
        to_left = form.getControl(name='to2fromButton')
      File "/home/stefan/autotest/temp/python26-zope212-cmf22-plone40/eggs/zope.testbrowser-3.6.0a2-py2.6.egg/zope/testbrowser/browser.py", line 752, in getControl
        raise zope.testbrowser.interfaces.ExpiredError
    ExpiredError
----------------------------------------------------------------------
File "/home/stefan/autotest/temp/python26-zope212-cmf22-plone40/src/plone.app.users/plone/app/users/tests/flexible_user_registration.txt", line 48, in flexible_user_registration.txt
Failed example:
    to_left
Exception raised:
    Traceback (most recent call last):
      File "/home/stefan/autotest/temp/python26-zope212-cmf22-plone40/eggs/zope.testing-3.7.7-py2.6.egg/zope/testing/doctest.py", line 1361, in __run
        compileflags, 1) in test.globs
      File "<doctest flexible_user_registration.txt[line 48, example 22]>", line 1, in <module>
        to_left
    NameError: name 'to_left' is not defined
----------------------------------------------------------------------
File "/home/stefan/autotest/temp/python26-zope212-cmf22-plone40/src/plone.app.users/plone/app/users/tests/flexible_user_registration.txt", line 50, in flexible_user_registration.txt
Failed example:
    to_left.clear()
Exception raised:
    Traceback (most recent call last):
      File "/home/stefan/autotest/temp/python26-zope212-cmf22-plone40/eggs/zope.testing-3.7.7-py2.6.egg/zope/testing/doctest.py", line 1361, in __run
        compileflags, 1) in test.globs
      File "<doctest flexible_user_registration.txt[line 50, example 23]>", line 1, in <module>
        to_left.clear()
    NameError: name 'to_left' is not defined
----------------------------------------------------------------------
File "/home/stefan/autotest/temp/python26-zope212-cmf22-plone40/src/plone.app.users/plone/app/users/tests/flexible_user_registration.txt", line 51, in flexible_user_registration.txt
Failed example:
    submit_button = form.getControl(name='form.actions.save')
Exception raised:
    Traceback (most recent call last):
      File "/home/stefan/autotest/temp/python26-zope212-cmf22-plone40/eggs/zope.testing-3.7.7-py2.6.egg/zope/testing/doctest.py", line 1361, in __run
        compileflags, 1) in test.globs
      File "<doctest flexible_user_registration.txt[line 51, example 24]>", line 1, in <module>
        submit_button = form.getControl(name='form.actions.save')
      File "/home/stefan/autotest/temp/python26-zope212-cmf22-plone40/eggs/zope.testbrowser-3.6.0a2-py2.6.egg/zope/testbrowser/browser.py", line 752, in getControl
        raise zope.testbrowser.interfaces.ExpiredError
    ExpiredError
----------------------------------------------------------------------
File "/home/stefan/autotest/temp/python26-zope212-cmf22-plone40/src/plone.app.users/plone/app/users/tests/flexible_user_registration.txt", line 52, in flexible_user_registration.txt
Failed example:
    submit_button.click()
Exception raised:
    Traceback (most recent call last):
      File "/home/stefan/autotest/temp/python26-zope212-cmf22-plone40/eggs/zope.testing-3.7.7-py2.6.egg/zope/testing/doctest.py", line 1361, in __run
        compileflags, 1) in test.globs
      File "<doctest flexible_user_registration.txt[line 52, example 25]>", line 1, in <module>
        submit_button.click()
    NameError: name 'submit_button' is not defined
----------------------------------------------------------------------
File "/home/stefan/autotest/temp/python26-zope212-cmf22-plone40/src/plone.app.users/plone/app/users/tests/flexible_user_registration.txt", line 56, in flexible_user_registration.txt
Failed example:
    form = browser.getForm(action='http://nohost/plone/@@member-registration')
Exception raised:
    Traceback (most recent call last):
      File "/home/stefan/autotest/temp/python26-zope212-cmf22-plone40/eggs/zope.testing-3.7.7-py2.6.egg/zope/testing/doctest.py", line 1361, in __run
        compileflags, 1) in test.globs
      File "<doctest flexible_user_registration.txt[line 56, example 26]>", line 1, in <module>
        form = browser.getForm(action='http://nohost/plone/@@member-registration')
      File "/home/stefan/autotest/temp/python26-zope212-cmf22-plone40/eggs/zope.testbrowser-3.6.0a2-py2.6.egg/zope/testbrowser/browser.py", line 398, in getForm
        form = disambiguate(matching_forms, '', index)
      File "/home/stefan/autotest/temp/python26-zope212-cmf22-plone40/eggs/zope.testbrowser-3.6.0a2-py2.6.egg/zope/testbrowser/browser.py", line 54, in disambiguate
        raise LookupError(msg)
    LookupError
----------------------------------------------------------------------
File "/home/stefan/autotest/temp/python26-zope212-cmf22-plone40/src/plone.app.users/plone/app/users/tests/flexible_user_registration.txt", line 57, in flexible_user_registration.txt
Failed example:
    disabled_fields = form.getControl(name='form.join_form_fields.from')
Exception raised:
    Traceback (most recent call last):
      File "/home/stefan/autotest/temp/python26-zope212-cmf22-plone40/eggs/zope.testing-3.7.7-py2.6.egg/zope/testing/doctest.py", line 1361, in __run
        compileflags, 1) in test.globs
      File "<doctest flexible_user_registration.txt[line 57, example 27]>", line 1, in <module>
        disabled_fields = form.getControl(name='form.join_form_fields.from')
      File "/home/stefan/autotest/temp/python26-zope212-cmf22-plone40/eggs/zope.testbrowser-3.6.0a2-py2.6.egg/zope/testbrowser/browser.py", line 752, in getControl
        raise zope.testbrowser.interfaces.ExpiredError
    ExpiredError
----------------------------------------------------------------------
File "/home/stefan/autotest/temp/python26-zope212-cmf22-plone40/src/plone.app.users/plone/app/users/tests/flexible_user_registration.txt", line 58, in flexible_user_registration.txt
Failed example:
    'home_page' in disabled_fields.displayOptions
Exception raised:
    Traceback (most recent call last):
      File "/home/stefan/autotest/temp/python26-zope212-cmf22-plone40/eggs/zope.testing-3.7.7-py2.6.egg/zope/testing/doctest.py", line 1361, in __run
        compileflags, 1) in test.globs
      File "<doctest flexible_user_registration.txt[line 58, example 28]>", line 1, in <module>
        'home_page' in disabled_fields.displayOptions
    NameError: name 'disabled_fields' is not defined

  Ran 7 tests with 1 failures and 0 errors in 0.787 seconds.
Tearing down left over layers:
  Tear down Products.PloneTestCase.layer.PloneSite in 0.364 seconds.
  Tear down Products.PloneTestCase.layer.ZCML in 0.005 seconds.
  Tear down Testing.ZopeTestCase.layer.ZopeLite in 0.000 seconds.
Running plone.folder.tests.layer.PartialOrderingLayer tests:
  Set up plone.folder.tests.layer.PartialOrderingLayer in 0.000 seconds.
  Ran 11 tests with 0 failures and 0 errors in 0.007 seconds.
Running plone.folder.tests.layer.PloneFolderLayer tests:
  Tear down plone.folder.tests.layer.PartialOrderingLayer in 0.000 seconds.
  Set up plone.folder.tests.layer.PloneFolderLayer in 0.000 seconds.
  Ran 45 tests with 0 failures and 0 errors in 0.031 seconds.
Tearing down left over layers:
  Tear down plone.folder.tests.layer.PloneFolderLayer in 0.000 seconds.
Total: 56 tests, 0 failures, 0 errors in 0.170 seconds.
Running Products.PloneTestCase.layer.PloneSite tests:
  Set up Testing.ZopeTestCase.layer.ZopeLite in 1.369 seconds.
  Set up Products.PloneTestCase.layer.ZCML in 2.361 seconds.
  Set up Products.PloneTestCase.layer.PloneSite in 4.329 seconds.
  Ran 41 tests with 0 failures and 0 errors in 0.370 seconds.
Tearing down left over layers:
  Tear down Products.PloneTestCase.layer.PloneSite in 0.363 seconds.
  Tear down Products.PloneTestCase.layer.ZCML in 0.004 seconds.
  Tear down Testing.ZopeTestCase.layer.ZopeLite in 0.000 seconds.
Total: 0 tests, 0 failures, 0 errors in 0.000 seconds.
Total: 0 tests, 0 failures, 0 errors in 0.000 seconds.
Running Products.PloneTestCase.layer.ZCML tests:
  Set up Testing.ZopeTestCase.layer.ZopeLite in 0.903 seconds.
  Set up Products.PloneTestCase.layer.ZCML in 2.363 seconds.
/home/stefan/autotest/temp/python26-zope212-cmf22-plone40/src/wicked/wicked/cache.py:34: DeprecationWarning: object.__init__() takes no parameters
  super(CacheStore, self).__init__(self)
  Ran 16 tests with 0 failures and 0 errors in 0.060 seconds.
Running wicked.at.tests.wickedtestcase.WickedSite tests:
  Set up Products.PloneTestCase.layer.PloneSite in 5.085 seconds.
  Set up wicked.at.tests.wickedtestcase.WickedSite in 0.003 seconds.
/home/stefan/autotest/temp/python26-zope212-cmf22-plone40/eggs/Zope2-2.12.1-py2.6-linux-x86_64.egg/OFS/subscribers.py:73: DeprecationWarning: wicked.atcontent.ironicwiki.IronicWiki.manage_afterAdd is discouraged. You should use event subscribers instead.
  DeprecationWarning)
/home/stefan/autotest/temp/python26-zope212-cmf22-plone40/eggs/Zope2-2.12.1-py2.6-linux-x86_64.egg/OFS/subscribers.py:73: DeprecationWarning: wicked.atcontent.ironicwiki.IronicWiki.manage_beforeDelete is discouraged. You should use event subscribers instead.
  DeprecationWarning)
/home/stefan/autotest/temp/python26-zope212-cmf22-plone40/eggs/Zope2-2.12.1-py2.6-linux-x86_64.egg/OFS/subscribers.py:73: DeprecationWarning: wicked.atcontent.ironicwiki.IronicWiki.manage_afterClone is discouraged. You should use event subscribers instead.
  DeprecationWarning)
  Ran 23 tests with 0 failures and 0 errors in 5.039 seconds.
Running wicked.at.tests.test_scope.Scoped tests:
  Set up wicked.at.tests.test_scope.Scoped in 0.000 seconds.
  Ran 3 tests with 0 failures and 0 errors in 0.557 seconds.
Running wicked.plone.tests.SelectiveATCT tests:
  Tear down wicked.at.tests.test_scope.Scoped in 0.000 seconds.
  Tear down wicked.at.tests.wickedtestcase.WickedSite in 0.002 seconds.
  Set up wicked.plone.tests.SelectiveATCT in 0.003 seconds.
  Ran 22 tests with 0 failures and 0 errors in 5.262 seconds.
Running wicked.plone.tests.ZCMLLayer tests:
  Tear down wicked.plone.tests.SelectiveATCT in 0.004 seconds.
  Set up wicked.plone.tests.ZCMLLayer in 0.019 seconds.
  Ran 8 tests with 0 failures and 0 errors in 0.757 seconds.
Running zope.testing.testrunner.layer.UnitTests tests:
  Tear down wicked.plone.tests.ZCMLLayer in 0.424 seconds.
  Tear down Products.PloneTestCase.layer.PloneSite in 0.001 seconds.
  Tear down Products.PloneTestCase.layer.ZCML in 0.004 seconds.
  Tear down Testing.ZopeTestCase.layer.ZopeLite in 0.000 seconds.
  Set up zope.testing.testrunner.layer.UnitTests in 0.000 seconds.
  Ran 34 tests with 0 failures and 0 errors in 0.016 seconds.
Tearing down left over layers:
  Tear down zope.testing.testrunner.layer.UnitTests in 0.000 seconds.
Total: 106 tests, 0 failures, 0 errors in 21.722 seconds.
#### Running tests for group ATCT ####
#### Finished tests for group ATCT ####

#### Running tests for group Archetypes ####
#### Finished tests for group Archetypes ####

#### Running tests for group CMF ####
#### Finished tests for group CMF ####

#### Running tests for group CMFEditions ####
#### Finished tests for group CMFEditions ####

#### Running tests for group Plone ####
#### Finished tests for group Plone ####

#### Running tests for group PlonePAS ####
#### Finished tests for group PlonePAS ####

#### Running tests for group plone ####
#### Finished tests for group plone ####

#### Running tests for group portlets ####
#### Finished tests for group portlets ####

#### Running tests for Products.CMFPlacefulWorkflow ####
#### Finished tests for Products.CMFPlacefulWorkflow ####

#### Running tests for Products.CMFTestCase ####
#### Finished tests for Products.CMFTestCase ####

#### Running tests for Products.ExtendedPathIndex ####
#### Finished tests for Products.ExtendedPathIndex ####

#### Running tests for Products.PasswordResetTool ####
#### Finished tests for Products.PasswordResetTool ####

#### Running tests for Products.PloneTestCase ####
#### Finished tests for Products.PloneTestCase ####

#### Running tests for Products.ResourceRegistries ####
#### Finished tests for Products.ResourceRegistries ####

#### Running tests for Products.TinyMCE ####
#### Finished tests for Products.TinyMCE ####

#### Running tests for Products.ZopeVersionControl ####
#### Finished tests for Products.ZopeVersionControl ####

#### Running tests for Products.contentmigration ####
#### Finished tests for Products.contentmigration ####

#### Running tests for Products.i18ntestcase ####
#### Finished tests for Products.i18ntestcase ####

#### Running tests for Products.kupu ####
#### Finished tests for Products.kupu ####

#### Running tests for archetypes.referencebrowserwidget ####
#### Finished tests for archetypes.referencebrowserwidget ####

#### Running tests for archetypes.schemaextender ####
#### Finished tests for archetypes.schemaextender ####

#### Running tests for collective.monkeypatcher ####
#### Finished tests for collective.monkeypatcher ####

#### Running tests for five.customerize ####
#### Finished tests for five.customerize ####

#### Running tests for kss.core ####
#### Finished tests for kss.core ####

#### Running tests for plone.app.blob ####
#### Finished tests for plone.app.blob ####

#### Running tests for plone.app.folder ####
#### Finished tests for plone.app.folder ####

#### Running tests for plone.app.imaging ####
#### Finished tests for plone.app.imaging ####

#### Running tests for plone.app.jquerytools ####
#### Finished tests for plone.app.jquerytools ####

#### Running tests for plone.app.locales ####
#### Finished tests for plone.app.locales ####

#### Running tests for plone.app.openid ####
#### Finished tests for plone.app.openid ####

#### Running tests for plone.app.users ####
#### Finished tests for plone.app.users ####

#### Running tests for plone.folder ####
#### Finished tests for plone.folder ####

#### Running tests for plone.stringinterp ####
#### Finished tests for plone.stringinterp ####

#### Running tests for plonetheme.classic ####
#### Finished tests for plonetheme.classic ####

#### Running tests for plonetheme.sunburst ####
#### Finished tests for plonetheme.sunburst ####

#### Running tests for wicked ####
#### Finished tests for wicked ####

Packages with test failures:

Failing tests in group ATCT
Failing tests in group Plone
Failing tests in group plone
Failing tests in group portlets
Failing tests in Products.CMFPlacefulWorkflow
Failing tests in Products.kupu
Failing tests in archetypes.referencebrowserwidget
Failing tests in archetypes.schemaextender
Failing tests in plone.app.users

Total time elapsed: 1109.264 seconds

Grand total: 86 packages, 9 failures


FAILED (86 packages, 9 failures)




More information about the Testbot mailing list