[Testbot] FAILED (failures=1) : Plone[core]-3.3 Zope-2.10 Python-2.4.6

Plone Libraries Tests plone-tests at epy.co.at
Sat Nov 7 02:24:45 UTC 2009


Plone Libraries Tests : FAILED (failures=1) 
Plone[core]-3.3 Zope-2.10 Python-2.4.6

Running /usr/local/python2.4/bin/python ./bin/instance test -q --package plone --module !plone.recipe
/home/stefan/autotest/temp/python24-zope210-cmf21-plone33/src/plone.protect/plone/protect/tests/testAuthenticator.py:11: DeprecationWarning: AuthenticateForm: Please use the plone.protect.protect decorator
  from plone.protect.authenticator import AuthenticateForm
Running unit tests:
Generated checkid_setup request to http://www.myopenid.com/server with assocication {HMAC-SHA1}{4af4d591}{rnc/qw==}
Generated checkid_setup request to http://www.myopenid.com/server with assocication {HMAC-SHA1}{4af4d593}{DonClw==}
  Ran 416 tests with 0 failures and 0 errors in 6.586 seconds.
Running Products.PloneTestCase.layer.ZCML tests:
  Set up Products.PloneTestCase.layer.ZCML in 1.533 seconds.
Installing plone.portlet.static ... done (0.013s)
Installing plone.portlet.collection ... done (0.012s)
  Ran 17 tests with 0 failures and 0 errors in 0.036 seconds.
Running Products.PloneTestCase.layer.PloneSite tests:
  Set up Products.PloneTestCase.layer.PloneSite in 4.310 seconds.
  Ran 814 tests with 0 failures and 0 errors in 95.018 seconds.
Running plone.app.contentrules.tests.test_configuration.TestContentrulesGSLayer tests:
  Set up plone.app.contentrules.tests.test_configuration.TestContentrulesGSLayer in 0.002 seconds.
  Ran 6 tests with 0 failures and 0 errors in 3.460 seconds.
Running plone.app.customerize.tests.layer.PloneCustomerize tests:
  Tear down plone.app.contentrules.tests.test_configuration.TestContentrulesGSLayer in 0.000 seconds.
  Set up plone.app.customerize.tests.layer.PloneCustomerize in 0.000 seconds.
  Ran 27 tests with 0 failures and 0 errors in 37.665 seconds.
Running plone.app.kss.tests.kss_and_plone_layer.KSSAndPloneLayer tests:
  Tear down plone.app.customerize.tests.layer.PloneCustomerize in 0.000 seconds.
  Set up plone.app.kss.tests.kss_and_plone_layer.KSSAndPloneLayer in 0.004 seconds.
  Ran 13 tests with 0 failures and 0 errors in 1.125 seconds.
Running plone.app.linkintegrity.tests.layer.PloneLinkintegrity tests:
  Tear down plone.app.kss.tests.kss_and_plone_layer.KSSAndPloneLayer in 0.000 seconds.
  Set up plone.app.linkintegrity.tests.layer.PloneLinkintegrity in 2.059 seconds.


Failure in test /home/stefan/autotest/temp/python24-zope210-cmf21-plone33/src/plone.app.linkintegrity/plone/app/linkintegrity/docs/testUnreferencedFileRemoval.txt
Failed doctest test for testUnreferencedFileRemoval.txt
  File "/home/stefan/autotest/temp/python24-zope210-cmf21-plone33/src/plone.app.linkintegrity/plone/app/linkintegrity/docs/testUnreferencedFileRemoval.txt", line 0

----------------------------------------------------------------------
File "/home/stefan/autotest/temp/python24-zope210-cmf21-plone33/src/plone.app.linkintegrity/plone/app/linkintegrity/docs/testUnreferencedFileRemoval.txt", line 32, in testUnreferencedFileRemoval.txt
Failed example:
    latest['description'].endswith('Deleted http://nohost/plone/doc1')
Expected:
    True
Got:
    False

  Ran 118 tests with 1 failures and 0 errors in 28.563 seconds.
Running plone.app.portlets.tests.test_configuration.TestPortletZCMLLayer tests:
  Tear down plone.app.linkintegrity.tests.layer.PloneLinkintegrity in 0.081 seconds.
  Set up plone.app.portlets.tests.test_configuration.TestPortletZCMLLayer in 0.006 seconds.
  Ran 5 tests with 0 failures and 0 errors in 0.027 seconds.
Running plone.app.portlets.tests.test_configuration.TestPortletGSLayer tests:
  Set up plone.app.portlets.tests.test_configuration.TestPortletGSLayer in 1.441 seconds.
  Ran 12 tests with 0 failures and 0 errors in 4.078 seconds.
Running plone.app.viewletmanager.tests.test_exportimport.Layer tests:
  Tear down plone.app.portlets.tests.test_configuration.TestPortletGSLayer in 0.000 seconds.
  Tear down plone.app.portlets.tests.test_configuration.TestPortletZCMLLayer in 0.000 seconds.
  Tear down Products.PloneTestCase.layer.PloneSite in 0.288 seconds.
  Tear down Products.PloneTestCase.layer.ZCML in 0.006 seconds.
  Set up plone.app.viewletmanager.tests.test_exportimport.Layer in 0.000 seconds.
Installing plone.browserlayer ... NOT FOUND
  Ran 16 tests with 0 failures and 0 errors in 0.046 seconds.
Running plone.browserlayer.tests.test_doctest.PloneBrowserLayerLayer tests:
  Tear down plone.app.viewletmanager.tests.test_exportimport.Layer in 0.000 seconds.
  Set up Products.PloneTestCase.layer.ZCML in 1.460 seconds.
  Set up Products.PloneTestCase.layer.PloneSite in 4.164 seconds.
  Set up plone.browserlayer.tests.test_doctest.PloneBrowserLayerLayer in 0.004 seconds.
  Ran 9 tests with 0 failures and 0 errors in 0.706 seconds.
Running plone.theme.tests.test_doctest.PloneThemeLayer tests:
  Tear down plone.browserlayer.tests.test_doctest.PloneBrowserLayerLayer in 0.000 seconds.
  Set up plone.theme.tests.test_doctest.PloneThemeLayer in 0.004 seconds.
  Ran 5 tests with 0 failures and 0 errors in 0.069 seconds.
Tearing down left over layers:
  Tear down plone.theme.tests.test_doctest.PloneThemeLayer in 0.000 seconds.
  Tear down Products.PloneTestCase.layer.PloneSite in 0.274 seconds.
  Tear down Products.PloneTestCase.layer.ZCML in 0.004 seconds.
Total: 1458 tests, 1 failures, 0 errors

FAILED (failures=1) 




More information about the Testbot mailing list