[Testbot] FAILED (failures=1) : Plone[next]-3.2 Zope-2.10 Python-2.4.6

Plone Tests plone-tests at epy.co.at
Sat Jun 20 05:10:14 UTC 2009


Plone Tests : FAILED (failures=1) 
Plone[next]-3.2 Zope-2.10 Python-2.4.6

Running /usr/local/python2.4/bin/python ./bin/instance test -q --package Products.CMFPlone
Running unit tests:
/home/stefan/autotest/temp/python24-zope210-cmf21-plone32next/parts/zope2/lib/python/zope/configuration/xmlconfig.py:323: DeprecationWarning: zope.app.annotation has moved to zope.annotation. Import of zope.app.annotation will become unsupported in Zope 3.5
  __import__(arguments[0])
  Ran 178 tests with 0 failures and 0 errors in 2.011 seconds.
Running Products.PloneTestCase.layer.ZCML tests:
  Set up Products.PloneTestCase.layer.ZCML in 10.083 seconds.
/home/stefan/autotest/temp/python24-zope210-cmf21-plone32next/eggs/Products.PlonePAS-3.7-py2.4.egg/Products/PlonePAS/setuphandlers.py:39: DeprecationWarning: portal_groups.getGroupIds is deprecated and will be removed in Plone 4.0. Use PAS searchGroups instead
  existing = gtool.listGroupIds()
  Ran 12 tests with 0 failures and 0 errors in 0.040 seconds.
Running Products.PloneTestCase.layer.PloneSite tests:
  Set up Products.PloneTestCase.layer.PloneSite in 18.141 seconds.
/home/stefan/autotest/temp/python24-zope210-cmf21-plone32next/eggs/Products.PlonePAS-3.7-py2.4.egg/Products/PlonePAS/tools/groupdata.py:249: DeprecationWarning: portal_groups.getGroupMembers is deprecated and will be removed in Plone 4.0. Use PAS to get a group and check its members instead.
  for u_name in gtool.getGroupMembers(self.getId()):
/home/stefan/autotest/temp/python24-zope210-cmf21-plone32next/eggs/Plone-3.2.2-py2.4.egg/Products/CMFPlone/MembershipTool.py:211: DeprecationWarning: getUserIds is deprecated. Use the PAS methods instead
  return self.__getPUS().getUserIds()
/home/stefan/autotest/temp/python24-zope210-cmf21-plone32next/eggs/Plone-3.2.2-py2.4.egg/Products/CMFPlone/migrations/migration_util.py:90: DeprecationWarning: setupCurrentSkin should be called with 'REQUEST' as argument. The BBB code will be removed in CMF 2.3.
  portal.setupCurrentSkin()


Failure in test testEventsSubTopic (Products.CMFPlone.tests.testPortalCreation.TestPortalCreation)
Traceback (most recent call last):
  File "/home/stefan/autotest/temp/python24-zope210-cmf21-plone32next/parts/zope2/lib/python/Testing/ZopeTestCase/profiler.py", line 98, in __call__
    testMethod()
  File "/home/stefan/autotest/temp/python24-zope210-cmf21-plone32next/eggs/Plone-3.2.2-py2.4.egg/Products/CMFPlone/tests/testPortalCreation.py", line 338, in testEventsSubTopic
    self.failIf(query['start'])
  File "/usr/local/python2.4/lib/python2.4/unittest.py", line 305, in failIf
    if expr: raise self.failureException, msg
AssertionError

/home/stefan/autotest/temp/python24-zope210-cmf21-plone32next/eggs/Plone-3.2.2-py2.4.egg/Products/CMFPlone/skins/plone_prefs/prefs_user_group_search.py:9: DeprecationWarning: portal_groups.searchForGroups is deprecated and will be removed in Plone 4.0. Use PAS searchGroups instead
  ##
/home/stefan/autotest/temp/python24-zope210-cmf21-plone32next/eggs/Plone-3.2.2-py2.4.egg/Products/CMFPlone/skins/plone_prefs/prefs_user_group_search.py:9: DeprecationWarning: portal_groups.searchForGroups is deprecated and will be removed in Plone 4.0. Use PAS searchGroups instead
  ##
/home/stefan/autotest/temp/python24-zope210-cmf21-plone32next/eggs/Plone-3.2.2-py2.4.egg/Products/CMFPlone/skins/plone_prefs/prefs_user_group_search.py:7: DeprecationWarning: portal_membership.searchForMembers is deprecated and will be removed in Plone 4.0. Use PAS searchUsers instead
  ##parameters=searchstring, restrict, return_form=None, ignore=[]
/home/stefan/autotest/temp/python24-zope210-cmf21-plone32next/eggs/Plone-3.2.2-py2.4.egg/Products/CMFPlone/skins/plone_prefs/prefs_user_group_search.py:9: DeprecationWarning: portal_groups.searchForGroups is deprecated and will be removed in Plone 4.0. Use PAS searchGroups instead
  ##
/home/stefan/autotest/temp/python24-zope210-cmf21-plone32next/eggs/Plone-3.2.2-py2.4.egg/Products/CMFPlone/skins/plone_prefs/prefs_user_group_search.py:7: DeprecationWarning: portal_membership.searchForMembers is deprecated and will be removed in Plone 4.0. Use PAS searchUsers instead
  ##parameters=searchstring, restrict, return_form=None, ignore=[]
/home/stefan/autotest/temp/python24-zope210-cmf21-plone32next/eggs/Plone-3.2.2-py2.4.egg/Products/CMFPlone/skins/plone_prefs/prefs_user_group_search.py:9: DeprecationWarning: portal_groups.searchForGroups is deprecated and will be removed in Plone 4.0. Use PAS searchGroups instead
  ##
  Ran 1529 tests with 1 failures and 0 errors in 561.484 seconds.
Tearing down left over layers:
  Tear down Products.PloneTestCase.layer.PloneSite in 0.635 seconds.
  Tear down Products.PloneTestCase.layer.ZCML in 0.014 seconds.
Total: 1719 tests, 1 failures, 0 errors

FAILED (failures=1) 




More information about the Testbot mailing list