[Testbot] FAILED (91 packages, 1 failures) : Plone-4.0 Zope-2.12 Python-2.6.4

Plone Tests plone-tests at epy.co.at
Fri Dec 25 02:46:21 UTC 2009


Plone Tests : FAILED (91 packages, 1 failures)
Plone-4.0 Zope-2.12 Python-2.6.4

Running ./bin/alltests -q --no-color --no-progress
Running Products.CMFTestCase.layer.CMFSite tests:
  Set up Testing.ZopeTestCase.layer.ZopeLite in 1.161 seconds.
  Set up Products.CMFTestCase.layer.ZCML in 3.078 seconds.
  Set up Products.CMFTestCase.layer.CMFSite in 2.045 seconds.
  Ran 31 tests with 0 failures and 0 errors in 0.565 seconds.
Running Products.PloneTestCase.layer.PloneSite tests:
  Tear down Products.CMFTestCase.layer.CMFSite in 0.068 seconds.
  Tear down Products.CMFTestCase.layer.ZCML in 0.004 seconds.
  Set up Products.PloneTestCase.layer.ZCML in 1.706 seconds.
  Set up Products.PloneTestCase.layer.PloneSite in 3.952 seconds.
  Ran 709 tests with 0 failures and 0 errors in 1 minutes 10.448 seconds.
Tearing down left over layers:
  Tear down Products.PloneTestCase.layer.PloneSite in 0.369 seconds.
  Tear down Products.PloneTestCase.layer.ZCML in 0.010 seconds.
  Tear down Testing.ZopeTestCase.layer.ZopeLite in 0.000 seconds.
Total: 740 tests, 0 failures, 0 errors in 1 minutes 23.911 seconds.
Running Testing.ZopeTestCase.layer.ZopeLite tests:
  Set up Testing.ZopeTestCase.layer.ZopeLite in 0.841 seconds.
  Ran 36 tests with 0 failures and 0 errors in 0.081 seconds.
Running Products.Archetypes.tests.layer.ZCML tests:
  Set up Products.CMFCore.testing.FunctionalZCMLLayer in 0.193 seconds.
  Set up Products.Archetypes.tests.layer.ZCML in 0.199 seconds.
  Ran 59 tests with 0 failures and 0 errors in 1.191 seconds.
Running Products.Archetypes.tests.layer.ArchetypesSite tests:
  Set up Products.Archetypes.tests.layer.ArchetypesSite in 2.041 seconds.
/home/stefan/autotest/temp/python26-zope212-cmf22-plone40/eggs/Zope2-2.12.2-py2.6-linux-x86_64.egg/OFS/subscribers.py:73: DeprecationWarning: Products.Archetypes.tests.test_classgen.Dummy.manage_afterAdd is discouraged. You should use event subscribers instead.
  DeprecationWarning)
/home/stefan/autotest/temp/python26-zope212-cmf22-plone40/eggs/Zope2-2.12.2-py2.6-linux-x86_64.egg/OFS/subscribers.py:73: DeprecationWarning: Products.Archetypes.tests.test_annotation.AnnDummy.manage_afterAdd is discouraged. You should use event subscribers instead.
  DeprecationWarning)
/home/stefan/autotest/temp/python26-zope212-cmf22-plone40/eggs/Zope2-2.12.2-py2.6-linux-x86_64.egg/OFS/subscribers.py:73: DeprecationWarning: Products.Archetypes.tests.test_event.Dummy.manage_afterAdd is discouraged. You should use event subscribers instead.
  DeprecationWarning)
  Ran 513 tests with 0 failures and 0 errors in 36.331 seconds.
Running Products.PloneTestCase.layer.PloneSite tests:
  Tear down Products.Archetypes.tests.layer.ArchetypesSite in 0.070 seconds.
  Tear down Products.Archetypes.tests.layer.ZCML in 0.004 seconds.
  Tear down Products.CMFCore.testing.FunctionalZCMLLayer in 0.000 seconds.
  Set up Products.PloneTestCase.layer.ZCML in 2.343 seconds.
  Set up Products.PloneTestCase.layer.PloneSite in 3.921 seconds.
  Ran 9 tests with 0 failures and 0 errors in 1.078 seconds.
Running plone.app.kss.tests.kss_and_plone_layer.KSSAndPloneLayer tests:
  Set up plone.app.kss.tests.kss_and_plone_layer.KSSAndPloneLayer in 0.005 seconds.
  Ran 19 tests with 0 failures and 0 errors in 1.556 seconds.
Running zope.testing.testrunner.layer.UnitTests tests:
  Tear down plone.app.kss.tests.kss_and_plone_layer.KSSAndPloneLayer in 0.000 seconds.
  Tear down Products.PloneTestCase.layer.PloneSite in 0.356 seconds.
  Tear down Products.PloneTestCase.layer.ZCML in 0.005 seconds.
  Tear down Testing.ZopeTestCase.layer.ZopeLite in 0.000 seconds.
  Set up zope.testing.testrunner.layer.UnitTests in 0.000 seconds.
/home/stefan/autotest/temp/python26-zope212-cmf22-plone40/src/Products.Archetypes/Products/Archetypes/ClassGen.py:152: UserWarning: The method 'makeFoo' was already protected by a different permission than the one declared on the field. Assuming that the explicit permission declared is the correct one and has preference over the permission declared on the field.
  self.handle_mode(klass, generator, type, field, mode)
  Ran 28 tests with 0 failures and 0 errors in 0.146 seconds.
Tearing down left over layers:
  Tear down zope.testing.testrunner.layer.UnitTests in 0.000 seconds.
Total: 664 tests, 0 failures, 0 errors in 51.704 seconds.
Running Testing.ZopeTestCase.layer.ZopeLite tests:
  Set up Testing.ZopeTestCase.layer.ZopeLite in 0.121 seconds.
  Ran 418 tests with 0 failures and 0 errors in 2.310 seconds.
Running Products.CMFCore.testing.FunctionalZCMLLayer tests:
  Set up Products.CMFCore.testing.FunctionalZCMLLayer in 0.165 seconds.
  Ran 55 tests with 0 failures and 0 errors in 0.121 seconds.
Running Products.CMFCalendar.testing.FunctionalLayer tests:
  Set up Products.CMFCalendar.testing.FunctionalLayer in 0.323 seconds.
  Ran 24 tests with 0 failures and 0 errors in 1.519 seconds.
Running Products.CMFCore.testing.EventZCMLLayer tests:
  Tear down Products.CMFCalendar.testing.FunctionalLayer in 0.028 seconds.
  Tear down Products.CMFCore.testing.FunctionalZCMLLayer in 0.001 seconds.
  Set up Products.CMFCore.testing.EventZCMLLayer in 0.001 seconds.
  Ran 13 tests with 0 failures and 0 errors in 0.337 seconds.
Running Products.CMFCore.testing.ExportImportZCMLLayer tests:
  Tear down Products.CMFCore.testing.EventZCMLLayer in 0.000 seconds.
  Set up Products.CMFCore.testing.ExportImportZCMLLayer in 0.001 seconds.
  Ran 113 tests with 0 failures and 0 errors in 6.874 seconds.
Running Products.CMFCore.testing.TraversingEventZCMLLayer tests:
  Tear down Products.CMFCore.testing.ExportImportZCMLLayer in 0.000 seconds.
  Set up Products.CMFCore.testing.TraversingEventZCMLLayer in 0.001 seconds.
  Ran 15 tests with 0 failures and 0 errors in 0.481 seconds.
Running Products.CMFCore.testing.TraversingZCMLLayer tests:
  Tear down Products.CMFCore.testing.TraversingEventZCMLLayer in 0.000 seconds.
  Set up Products.CMFCore.testing.TraversingZCMLLayer in 0.001 seconds.
  Ran 69 tests with 0 failures and 0 errors in 1.623 seconds.
Running Products.CMFDefault.testing.FunctionalLayer tests:
  Tear down Products.CMFCore.testing.TraversingZCMLLayer in 0.000 seconds.
  Set up Products.CMFCore.testing.FunctionalZCMLLayer in 0.156 seconds.
  Set up Products.CMFDefault.testing.FunctionalLayer in 0.248 seconds.
  Ran 75 tests with 0 failures and 0 errors in 3.370 seconds.
Running Products.CMFUid.testing.UidEventZCMLLayer tests:
  Tear down Products.CMFDefault.testing.FunctionalLayer in 0.025 seconds.
  Tear down Products.CMFCore.testing.FunctionalZCMLLayer in 0.002 seconds.
  Set up Products.CMFUid.testing.UidEventZCMLLayer in 0.001 seconds.
  Ran 12 tests with 0 failures and 0 errors in 0.327 seconds.
Running Products.DCWorkflow.testing.ExportImportZCMLLayer tests:
  Tear down Products.CMFUid.testing.UidEventZCMLLayer in 0.000 seconds.
  Set up Products.DCWorkflow.testing.ExportImportZCMLLayer in 0.140 seconds.
  Ran 38 tests with 0 failures and 0 errors in 0.851 seconds.
Running Products.GenericSetup.testing.ExportImportZCMLLayer tests:
  Tear down Products.DCWorkflow.testing.ExportImportZCMLLayer in 0.000 seconds.
  Set up Products.GenericSetup.testing.ExportImportZCMLLayer in 0.048 seconds.
  Ran 186 tests with 0 failures and 0 errors in 0.737 seconds.
Running zope.testing.testrunner.layer.UnitTests tests:
  Tear down Products.GenericSetup.testing.ExportImportZCMLLayer in 0.000 seconds.
  Tear down Testing.ZopeTestCase.layer.ZopeLite in 0.000 seconds.
  Set up zope.testing.testrunner.layer.UnitTests in 0.000 seconds.
  Ran 577 tests with 0 failures and 0 errors in 1.300 seconds.
Tearing down left over layers:
  Tear down zope.testing.testrunner.layer.UnitTests in 0.000 seconds.
Total: 1595 tests, 0 failures, 0 errors in 22.704 seconds.
Running Testing.ZopeTestCase.layer.ZopeLite tests:
  Set up Testing.ZopeTestCase.layer.ZopeLite in 0.943 seconds.
  Ran 27 tests with 0 failures and 0 errors in 0.056 seconds.
Running Products.PloneTestCase.layer.PloneSite tests:
  Set up Products.PloneTestCase.layer.ZCML in 2.421 seconds.
  Set up Products.PloneTestCase.layer.PloneSite in 5.089 seconds.
/home/stefan/autotest/temp/python26-zope212-cmf22-plone40/eggs/Zope2-2.12.2-py2.6-linux-x86_64.egg/OFS/subscribers.py:73: DeprecationWarning: Products.FAQ.FAQ.FAQ.manage_afterAdd is discouraged. You should use event subscribers instead.
  DeprecationWarning)
/home/stefan/autotest/temp/python26-zope212-cmf22-plone40/eggs/Zope2-2.12.2-py2.6-linux-x86_64.egg/OFS/subscribers.py:73: DeprecationWarning: Products.FAQ.FAQQuestion.FAQQuestion.manage_afterAdd is discouraged. You should use event subscribers instead.
  DeprecationWarning)
  Ran 145 tests with 0 failures and 0 errors in 23.956 seconds.
Running Products.CMFDiffTool.tests.BaseTestCase.CMFDiffToolLayer tests:
  Set up Products.CMFDiffTool.tests.BaseTestCase.CMFDiffToolLayer in 0.013 seconds.
  Ran 2 tests with 0 failures and 0 errors in 0.222 seconds.
Running Products.CMFTestCase.layer.CMFSite tests:
  Tear down Products.CMFDiffTool.tests.BaseTestCase.CMFDiffToolLayer in 0.374 seconds.
  Tear down Products.PloneTestCase.layer.PloneSite in 0.006 seconds.
  Tear down Products.PloneTestCase.layer.ZCML in 0.004 seconds.
  Set up Products.CMFTestCase.layer.ZCML in 1.732 seconds.
  Set up Products.CMFTestCase.layer.CMFSite in 1.529 seconds.
  Ran 20 tests with 0 failures and 0 errors in 0.392 seconds.
Running zope.testing.testrunner.layer.UnitTests tests:
  Tear down Products.CMFTestCase.layer.CMFSite in 0.069 seconds.
  Tear down Products.CMFTestCase.layer.ZCML in 0.003 seconds.
  Tear down Testing.ZopeTestCase.layer.ZopeLite in 0.000 seconds.
  Set up zope.testing.testrunner.layer.UnitTests in 0.000 seconds.
  Ran 10 tests with 0 failures and 0 errors in 0.005 seconds.
Tearing down left over layers:
  Tear down zope.testing.testrunner.layer.UnitTests in 0.000 seconds.
Total: 204 tests, 0 failures, 0 errors in 37.789 seconds.
Running Testing.ZopeTestCase.layer.ZopeLite tests:
  Set up Testing.ZopeTestCase.layer.ZopeLite in 0.631 seconds.
  Ran 126 tests with 0 failures and 0 errors in 0.764 seconds.
Running Products.CMFTestCase.layer.CMFSite tests:
  Set up Products.CMFTestCase.layer.ZCML in 2.280 seconds.
  Set up Products.CMFTestCase.layer.CMFSite in 0.234 seconds.
  Ran 53 tests with 0 failures and 0 errors in 2.632 seconds.
Running Products.PloneTestCase.layer.ZCML tests:
  Tear down Products.CMFTestCase.layer.CMFSite in 0.044 seconds.
  Tear down Products.CMFTestCase.layer.ZCML in 0.003 seconds.
  Set up Products.PloneTestCase.layer.ZCML in 1.718 seconds.
  Ran 12 tests with 0 failures and 0 errors in 0.016 seconds.
Running Products.PloneTestCase.layer.PloneSite tests:
  Set up Products.PloneTestCase.layer.PloneSite in 4.207 seconds.
  Ran 1822 tests with 0 failures and 0 errors in 3 minutes 54.182 seconds.
Running plone.app.contentrules.tests.test_configuration.TestContentrulesGSLayer tests:
  Set up plone.app.contentrules.tests.test_configuration.TestContentrulesGSLayer in 0.002 seconds.
  Ran 6 tests with 0 failures and 0 errors in 3.748 seconds.
Running plone.app.customerize.tests.layer.PloneCustomerize tests:
  Tear down plone.app.contentrules.tests.test_configuration.TestContentrulesGSLayer in 0.000 seconds.
  Set up plone.app.customerize.tests.layer.PloneCustomerize in 0.000 seconds.
  Ran 27 tests with 0 failures and 0 errors in 2.806 seconds.
Running plone.app.kss.tests.kss_and_plone_layer.KSSAndPloneLayer tests:
  Tear down plone.app.customerize.tests.layer.PloneCustomerize in 0.000 seconds.
  Set up plone.app.kss.tests.kss_and_plone_layer.KSSAndPloneLayer in 0.004 seconds.
  Ran 13 tests with 0 failures and 0 errors in 1.189 seconds.
Running plone.app.linkintegrity.tests.layer.PloneLinkintegrity tests:
  Tear down plone.app.kss.tests.kss_and_plone_layer.KSSAndPloneLayer in 0.000 seconds.
  Set up plone.app.linkintegrity.tests.layer.PloneLinkintegrity in 0.452 seconds.


Failure in test /home/stefan/autotest/temp/python26-zope212-cmf22-plone40/src/plone.app.linkintegrity/plone/app/linkintegrity/docs/testReferenceInRestructuredText.txt
Failed doctest test for testReferenceInRestructuredText.txt
  File "/home/stefan/autotest/temp/python26-zope212-cmf22-plone40/src/plone.app.linkintegrity/plone/app/linkintegrity/docs/testReferenceInRestructuredText.txt", line 0

----------------------------------------------------------------------
File "/home/stefan/autotest/temp/python26-zope212-cmf22-plone40/src/plone.app.linkintegrity/plone/app/linkintegrity/docs/testReferenceInRestructuredText.txt", line 19, in testReferenceInRestructuredText.txt
Failed example:
    browser.contents
Expected:
    '...<a href="http://nohost/plone/doc2"...Test Page 2...
     ...This...Document...is referenced by the following items:...
     ...<li>...<a href="http://nohost/plone/doc1"...Test Page 1...</li>...
     ...Would you like to delete it anyway?...'
Got:
    '\n<!DOCTYPE html PUBLIC\n  "-//W3C//DTD XHTML 1.0 Transitional//EN"\n  "http://www.w3.org/TR/xhtml1/DTD/xhtml1-transitional.dtd">\n\n<html xmlns="http://www.w3.org/1999/xhtml" lang="en">\n\n\n    \n    \n    \n    \n    \n\n\n\n<head>\n    <meta http-equiv="Content-Type" content="text/html; charset=utf-8" />\n\n    <!-- Forces IE8+ into newest rendering engine even if on an intranet. This has to be defined before any script/style tags. -->\n    <meta http-equiv="X-UA-Compatible" content="IE=edge" /> \n    <!-- Enables iPhone web app use, fullscreen when added to home screen -->\n    <meta name="apple-mobile-web-app-capable" content="yes" />\n\n    \n        <base href="http://nohost/plone/" /><!--[if lt IE 7]></base><![endif]-->\n    \n\n    \n\n<link rel="kss-base-url" href="http://nohost/plone/" />\n\n  \n    <link rel="stylesheet" type="text/css" media="screen" href="http://nohost/plone/portal_css/Sunburst%20Theme/member-cachekey3853.css" />\n    <link rel="stylesheet" type="text/css" href="http://nohost/plone/portal_css/Sunburst%20Theme/base-cachekey3693.css" />\n        <!--[if lt IE 8]>    \n    \n    <link rel="stylesheet" type="text/css" media="screen" href="http://nohost/plone/portal_css/Sunburst%20Theme/IEFixes-cachekey9776.css" />\n        <![endif]-->\n    \n    <link rel="stylesheet" type="text/css" media="all" href="http://nohost/plone/portal_css/Sunburst%20Theme/ploneCustom-cachekey6895.css" />\n\n  \n    <link rel="kinetic-stylesheet" type="text/css" href="http://nohost/plone/portal_kss/Sunburst%20Theme/resourcetinymce.ksstinymce-cachekey5996.kss" />\n    <link rel="kinetic-stylesheet" type="text/css" href="http://nohost/plone/portal_kss/Sunburst%20Theme/at-cachekey1082.kss" />\n  \n    <script type="text/javascript" src="http://nohost/plone/portal_javascripts/Sunburst%20Theme/jquery-cachekey2040.js"></script>\n    <script type="text/javascript" src="http://nohost/plone/portal_javascripts/Sunburst%20Theme/sarissa-cachekey7947.js"></script>\n    <script type="text/javascript" src="http://nohost/plone/portal_javascripts/Sunburst%20Theme/dropdown-cachekey2902.js"></script>\n\n\na standard view\n<title>Plone site</title>\n    \n    <link rel="author" href="http://nohost/plone/author/" title="Author information" />\n\n\n\n    <link rel="shortcut icon" type="image/x-icon" href="http://nohost/plone/favicon.ico" />\n\n\n\n    <link rel="home" href="http://nohost/plone" title="Front page" />\n\n    <link rel="contents" href="http://nohost/plone/sitemap" title="Site Map" />\n\n\n\n\n\n\n    <link rel="search" href="http://nohost/plone/search_form" title="Search this site" />\n\n\na standard view\n\n    \n    \n        \n      \n    \n    \n    \n\n    <meta name="viewport" content="width=320; initial-scale=0.6666; maximum-scale=1.0; minimum-scale=0.6666" />\n    <meta name="generator" content="Plone - http://plone.org" />\n</head>\n\n<!-- TODO: Can we do this in the @@plone view? -->\n<body class=" template-folder_contents" dir="ltr">\n\n<div id="visual-portal-wrapper">\n\n        <div id="portal-top" class="row">\n<div class="cell width-full position-0"> <!-- TODO: Temporary, this one should be in the template that is inserted -->\n            <div id="portal-header">\n    <p class="hiddenStructure">\n  <a accesskey="2" href="http://nohost/plone/@@folder_contents#documentContent">Skip to content.</a> |\n\n  <a accesskey="6" href="http://nohost/plone/@@folder_contents#portlet-navigation-tree">Skip to navigation</a>\n</p>\n\n<div id="portal-searchbox">\n    <form name="searchform" action="http://nohost/plone/search">\n\n        <label for="searchGadget" class="hiddenStructure">Search Site</label>\n\n        <div class="LSBox">\n        <input name="SearchableText" type="text" size="18" title="Search Site" accesskey="4" class="inputLabel" id="searchGadget" />\n\n        <input class="searchButton" type="submit" value="Search" />\n    \n        <div class="searchSection">\n            <input id="searchbox_currentfolder_only" class="noborder" type="checkbox" name="path" value="/plone" />\n            <label for="searchbox_currentfolder_only" style="cursor: pointer">\n                only in current section\n            </label>\n        </div>\n\n        <div class="LSResult" id="LSResult" style=""><div class="LSShadow" id="LSShadow"></div></div>\n        </div>\n    </form>\n\n    <div id="portal-advanced-search" class="hiddenStructure">\n        <a href="http://nohost/plone/search_form" accesskey="5">\n            Advanced Search&hellip;\n        </a>\n    </div>\n\n</div>\n\n<a id="portal-logo" title="Home" accesskey="1" href="http://nohost/plone">\n    <img src="http://nohost/plone/logo.png" alt="" title="" height="56" width="215" /></a>\n\n\n    <h5 class="hiddenStructure">Sections</h5>\n\n    <ul id="portal-globalnav"><li id="portaltab-index_html" class="selected"><a href="http://nohost/plone" title="">Home</a></li><li id="portaltab-news" class="plain"><a href="http://nohost/plone/news" title="Site News">News</a></li><li id="portaltab-events" class="plain"><a href="http://nohost/plone/events" title="Site Events">Events</a></li><li id="portaltab-Members" class="plain"><a href="http://nohost/plone/Members" title="Container for users\' home directories">Users</a></li><li id="portaltab-doc1" class="plain"><a href="http://nohost/plone/doc1" title="">Test Page 1</a></li><li id="portaltab-image1" class="plain"><a href="http://nohost/plone/image1/view" title="">Test Image 1</a></li><li id="portaltab-image2" class="plain"><a href="http://nohost/plone/image2/view" title="">Test Image 2</a></li><li id="portaltab-image3" class="plain"><a href="http://nohost/plone/image3/view" title="">Test Image 3</a></li><li id="portaltab-file1" class="plain"><a href="http://nohost/plone/file1/view" title="">Test File 1</a></li><li\n    id="portaltab-folder1" class="plain"><a href="http://nohost/plone/folder1" title="">Test Folder 1</a></li></ul>\n\na standard view\n</div>\n\n<div id="portal-personaltools-wrapper">\n\n<h5 class="hiddenStructure">Personal tools</h5>\n\n<dl class="actionMenu" id="portal-personaltools">\n   <!-- TODO: Can we nest these in a better way? -->\n  <dt class="actionMenuHeader">\n    <!-- The following a-tag needs to be clicked to dropdown the menu -->\n    <a id="user-name" href="http://nohost/plone/dashboard">test_user_1_</a>\n  </dt>\n  <dd class="actionMenuContent">\n    <ul>\n        <li>\n            <a href="http://nohost/plone/dashboard">Dashboard</a>\n        </li>\n    </ul>\n    <ul>\n        <li>\n            <a href="http://nohost/plone/personalize_form">Preferences</a>\n        </li>\n    </ul>\n    <ul>\n        <li>\n            <a href="http://nohost/plone/plone_control_panel">Site Setup</a>\n        </li>\n    </ul>\n    <ul>\n        <li>\n            <a href="http://nohost/plone/logout">Log out</a>\n        </li>\n    </ul>\n  </dd>\n  \n</dl>\n\n\n\n</div>\n\n\n    \n\n\n<div id="portal-breadcrumbs">\n\n    <span id="breadcrumbs-you-are-here">You\nare here:</span>\n    <span id="breadcrumbs-home">\n        <a href="http://nohost/plone">Home</a>\n        \n    </span>\n\n</div>\n\na standard view\n</div>\n        </div>\n    <div id="portal-columns" class="row">\n\n        <!-- TODO: There is probably be a more elegant way to do this ;) -->\n        \n        \n        \n        <div id="portal-column-content" class="cell width-full position-0">\n\n            <div class="documentEditable">\n\n                <div id="edit-bar">\n\n    \n\n        <h5 class="hiddenStructure">Views</h5>\n\n        <ul class="contentViews" id="content-views">\n\n            \n              <li id="contentview-folderContents" class="plain">\n                <a href="http://nohost/plone/folder_contents">Contents</a>\n              </li>\n            \n            \n              <li id="contentview-view" class="selected">\n                <a href="http://nohost/plone">View</a>\n              </li>\n            \n            \n              <li id="contentview-contentrules" class="plain">\n                <a href="http://nohost/plone/@@manage-content-rules">Rules</a>\n              </li>\n            \n            \n              <li id="contentview-local_roles" class="plain">\n                <a href="http://nohost/plone/@@sharing">Sharing</a>\n              </li>\n            \n\n        </ul>\n        \n    \n\n\n<div class="contentActions">\n\n    \n\n        \n\n        \n\n        <ul id="contentActionMenus">\n\n    <li>\n\n        <dl class="actionMenu" id="plone-contentmenu-factories">\n          <dt class="actionMenuHeader label-">\n            <a href="http://nohost/plone/folder_factories" title="Add new items inside this item">\n               \n                  \n                  <span>Add new\xe2\x80\xa6</span>\n                  \n                  <span class="arrowDownAlternative">&#9660;</span>\n               \n            </a>\n          </dt>\n          <dd class="actionMenuContent">\n            <ul>\n                \n                  <li>\n                    <a href="http://nohost/plone/createObject?type_name=Topic" class="contenttype-topic" id="topic" title="An automatically updated stored search that can be used to display items matching criteria you specify.">\n                        <img width="16" height="16" alt="" src="http://nohost/plone/topic_icon.png" title="An automatically updated stored search that can be used to display items matching criteria you specify." />\n                        <span class="subMenuTitle">Collection</span>\n                    </a>\n                    \n                  </li>\n                \n                \n                  <li>\n                    <a href="http://nohost/plone/createObject?type_name=Event" class="contenttype-event" id="event" title="Information about an upcoming event, which can be displayed in the calendar.">\n                        <img width="16" height="16" alt="" src="http://nohost/plone/event_icon.png" title="Information about an upcoming event, which can be displayed in the calendar." />\n                        <span class="subMenuTitle">Event</span>\n                    </a>\n                    \n                  </li>\n                \n                \n                  <li>\n                    <a href="http://nohost/plone/createObject?type_name=File" class="contenttype-file" id="file" title="An external file uploaded to the site.">\n                        <img width="16" height="16" alt="" src="http://nohost/plone/file_icon.png" title="An external file uploaded to the site." />\n                        <span class="subMenuTitle">File</span>\n                    </a>\n                    \n                  </li>\n                \n                \n                  <li>\n                    <a href="http://nohost/plone/createObject?type_name=Folder" class="contenttype-folder" id="folder" title="A folder which can contain other items.">\n                        <img width="16" height="16" alt="" src="http://nohost/plone/folder_icon.png" title="A folder which can contain other items." />\n                        <span class="subMenuTitle">Folder</span>\n                    </a>\n                    \n                  </li>\n                \n                \n                  <li>\n                    <a href="http://nohost/plone/createObject?type_name=Image" class="contenttype-image" id="image" title="An image, which can be referenced in documents or displayed in an album.">\n                        <img width="16" height="16" alt="" src="http://nohost/plone/image_icon.png" title="An image, which can be referenced in documents or displayed in an album." />\n                        <span class="subMenuTitle">Image</span>\n                    </a>\n                    \n                  </li>\n                \n                \n                  <li>\n                    <a href="http://nohost/plone/createObject?type_name=Link" class="contenttype-link" id="link" title="A link to an internal or external resource.">\n                        <img width="16" height="16" alt="" src="http://nohost/plone/link_icon.png" title="A link to an internal or external resource." />\n                        <span class="subMenuTitle">Link</span>\n                    </a>\n                    \n                  </li>\n                \n                \n                  <li>\n                    <a href="http://nohost/plone/createObject?type_name=News+Item" class="contenttype-news-item" id="news-item" title="An announcement that will show up on the news portlet and in the news listing.">\n                        <img width="16" height="16" alt="" src="http://nohost/plone/newsitem_icon.png" title="An announcement that will show up on the news portlet and in the news listing." />\n                        <span class="subMenuTitle">News Item</span>\n                    </a>\n                    \n                  </li>\n                \n                \n                  <li>\n                    <a href="http://nohost/plone/createObject?type_name=Document" class="contenttype-document" id="document" title="A page in the site. Can contain rich text.">\n                        <img width="16" height="16" alt="" src="http://nohost/plone/document_icon.png" title="A page in the site. Can contain rich text." />\n                        <span class="subMenuTitle">Page</span>\n                    </a>\n                    \n                  </li>\n                \n            </ul>\n          </dd>\n        </dl>\n\n    </li>\n\n</ul>\n\n\n    \n\n</div>\na standard view</div>\n    \n                <div id="region-content" class="documentContent">\n\n                    <a name="documentContent"></a>\n\n                    \n\n    <dl class="portalMessage info" id="kssPortalMessage" style="display:none">\n        <dt>Info</dt>\n        <dd></dd>\n    </dl>\n\n    \n\n        <dl class="portalMessage info">\n            <dt>Info</dt>\n            <dd>Item(s) deleted.</dd>\n        </dl>\n\n    \n\n\n                    <div id="viewlet-above-content">a standard view</div>\n\n                    \n                        <div id="content">\n                                \n                            \n                            <div>\n      a standard view\n\n      <h1 class="documentFirstHeading"> \n          \n          \n              <img width="16" height="16" src="http://nohost/plone/site_icon.gif" alt="Plone site" /> \n              Plone site\n          \n      </h1>\n\n      <div class="documentByLine" id="plone-document-byline">\n  \n\n  \n\n  <span class="documentModified">\n    &mdash;\n    <span>\n      last modified\n    </span>\n    Dec 25, 2009 04:13 AM\n  </span>\n\n  \n\n  \n\n  \n\n</div>\n\n\na standard view\n\n      \n\n      \n\n      \n          \n      \n\n      <form name="folderContentsForm" method="post" action="http://nohost/plone" class="kssattr-serveraction-foldercontents_update_table">\n        <div id="folderlisting-main-table">\n  <input type="hidden" name="sort_on" value="getObjPositionInParent" />\n  <input type="hidden" name="pagenumber" value="1" />\n  <input type="hidden" name="show_all" value="False" />\n  <input type="hidden" name="orig_template" value="@@folder_contents" />\n  \n\n  <!-- <div metal:use-macro="context/document_actions/macros/document_actions">\n       Document actions (print, sendto etc)\n       </div> -->\n  \n\n  \n    \n    <div class="visualClear" id="clear-space-before-navigation"><!-- --></div>\n\n    <!-- Navigation -->\n\n\n    <table class="listing" id="listing-table" summary="Content listing">\n      <thead>\n        <tr>\n          <th colspan="6" class="nosort">Select: <a id="foldercontents-selectall" class="update-selection" href="http://nohost/plone/@@folder_contents?pagenumber=1&amp;select=screen">All</a></th>\n        </tr>\n        \n        \n\n        <tr>\n          <th class="nosort">&nbsp;</th>\n          <th class="nosort column" id="foldercontents-title-column">&nbsp;Title&nbsp;</th>\n          <th class="nosort column" id="foldercontents-size-column">&nbsp;Size&nbsp;</th>\n          <th class="nosort column" id="foldercontents-modified-column">&nbsp;Modified&nbsp;</th>\n          <th class="nosort column" id="foldercontents-status-column">&nbsp;State&nbsp;</th>\n          <th class="nosort column" id="foldercontents-order-column">\n          &nbsp;Order&nbsp;</th>\n        </tr>\n      </thead>\n\n      \n        <tbody>\n          \n            <tr class="draggable odd" id="folder-contents-item-front-page">\n\n              \n\n              <td class="notDraggable">\n                <input type="checkbox" class="noborder" name="paths:list" id="cb_front-page" value="/plone/front-page" alt="Select Welcome to Plone" title="Select Welcome to Plone" />\n                <input type="hidden" name="selected_obj_paths:list" value="/plone/front-page" />\n                <label class="hiddenStructure" for="cb_front-page">Welcome to Plone</label>\n              </td>\n              <td>\n                <span class="contenttype-document">\n                  <img width="16" height="16" src="http://nohost/plone/document_icon.png" alt="Page" />\n                  <a href="http://nohost/plone/front-page" class="state-published" title="Page: Congratulations! You have successfully installed Plone.">\n                    <strong>Welcome to Plone</strong>\n                  </a>\n                </span>\n\n                \n              </td>\n\n              <td>\n                \n                <span class="state-published">4.8 kB</span>\n              </td>\n              <td class="state-published">Dec 25, 2009 04:13 AM</td>\n              <td>\n                <span class="state-published">Published</span>\n                \n              </td>\n              <td class="draggable">\n                <a href="http://nohost/plone/folder_position?position=up&amp;id=front-page" title="Move item up">\n                  &#9650;\n                </a>\n                &nbsp;\n                <a href="http://nohost/plone/folder_position?position=down&amp;id=front-page" title="Move item down">\n                  &#9660;\n                </a>\n              </td>\n            </tr>\n          \n          \n            <tr class="draggable even" id="folder-contents-item-news">\n\n              \n\n              <td class="notDraggable">\n                <input type="checkbox" class="noborder" name="paths:list" id="cb_news" value="/plone/news" alt="Select News" title="Select News" />\n                <input type="hidden" name="selected_obj_paths:list" value="/plone/news" />\n                <label class="hiddenStructure" for="cb_news">News</label>\n              </td>\n              <td>\n                <span class="contenttype-folder">\n                  <img width="16" height="16" src="http://nohost/plone/folder_icon.png" alt="Folder" />\n                  <a href="http://nohost/plone/news/folder_contents" class="state-visible" title="Folder: Site News">\n                    News\n                  </a>\n                </span>\n\n                \n              </td>\n\n              <td>\n                \n                <span class="state-visible">1 kB</span>\n              </td>\n              <td class="state-visible">Dec 25, 2009 04:13 AM</td>\n              <td>\n                <span class="state-visible">Public draft</span>\n                \n              </td>\n              <td class="draggable">\n                <a href="http://nohost/plone/folder_position?position=up&amp;id=news" title="Move item up">\n                  &#9650;\n                </a>\n                &nbsp;\n                <a href="http://nohost/plone/folder_position?position=down&amp;id=news" title="Move item down">\n                  &#9660;\n                </a>\n              </td>\n            </tr>\n          \n          \n            <tr class="draggable odd" id="folder-contents-item-events">\n\n              \n\n              <td class="notDraggable">\n                <input type="checkbox" class="noborder" name="paths:list" id="cb_events" value="/plone/events" alt="Select Events" title="Select Events" />\n                <input type="hidden" name="selected_obj_paths:list" value="/plone/events" />\n                <label class="hiddenStructure" for="cb_events">Events</label>\n              </td>\n              <td>\n                <span class="contenttype-folder">\n                  <img width="16" height="16" src="http://nohost/plone/folder_icon.png" alt="Folder" />\n                  <a href="http://nohost/plone/events/folder_contents" class="state-visible" title="Folder: Site Events">\n                    Events\n                  </a>\n                </span>\n\n                \n              </td>\n\n              <td>\n                \n                <span class="state-visible">1 kB</span>\n              </td>\n              <td class="state-visible">Dec 25, 2009 04:13 AM</td>\n              <td>\n                <span class="state-visible">Public draft</span>\n                \n              </td>\n              <td class="draggable">\n                <a href="http://nohost/plone/folder_position?position=up&amp;id=events" title="Move item up">\n                  &#9650;\n                </a>\n                &nbsp;\n                <a href="http://nohost/plone/folder_position?position=down&amp;id=events" title="Move item down">\n                  &#9660;\n                </a>\n              </td>\n            </tr>\n          \n          \n            <tr class="draggable even" id="folder-contents-item-Members">\n\n              \n\n              <td class="notDraggable">\n                <input type="checkbox" class="noborder" name="paths:list" id="cb_Members" value="/plone/Members" alt="Select Users" title="Select Users" />\n                <input type="hidden" name="selected_obj_paths:list" value="/plone/Members" />\n                <label class="hiddenStructure" for="cb_Members">Users</label>\n              </td>\n              <td>\n                <span class="contenttype-folder">\n                  <img width="16" height="16" src="http://nohost/plone/folder_icon.png" alt="Folder" />\n                  <a href="http://nohost/plone/Members/folder_contents" class="state-visible" title="Folder: Container for users\' home directories">\n                    Users\n                  </a>\n                </span>\n\n                \n              </td>\n\n              <td>\n                \n                <span class="state-visible">1 kB</span>\n              </td>\n              <td class="state-visible">Dec 25, 2009 04:13 AM</td>\n              <td>\n                <span class="state-visible">Public draft</span>\n                \n              </td>\n              <td class="draggable">\n                <a href="http://nohost/plone/folder_position?position=up&amp;id=Members" title="Move item up">\n                  &#9650;\n                </a>\n                &nbsp;\n                <a href="http://nohost/plone/folder_position?position=down&amp;id=Members" title="Move item down">\n                  &#9660;\n                </a>\n              </td>\n            </tr>\n          \n          \n            <tr class="draggable odd" id="folder-contents-item-doc1">\n\n              \n\n              <td class="notDraggable">\n                <input type="checkbox" class="noborder" name="paths:list" id="cb_doc1" value="/plone/doc1" alt="Select Test Page 1" title="Select Test Page 1" />\n                <input type="hidden" name="selected_obj_paths:list" value="/plone/doc1" />\n                <label class="hiddenStructure" for="cb_doc1">Test Page 1</label>\n              </td>\n              <td>\n                <span class="contenttype-document">\n                  <img width="16" height="16" src="http://nohost/plone/document_icon.png" alt="Page" />\n                  <a href="http://nohost/plone/doc1" class="state-visible" title="Page: ">\n                    Test Page 1\n                  </a>\n                </span>\n\n                \n              </td>\n\n              <td>\n                \n                <span class="state-visible">1 kB</span>\n              </td>\n              <td class="state-visible">Dec 25, 2009 04:17 AM</td>\n              <td>\n                <span class="state-visible">Public draft</span>\n                \n              </td>\n              <td class="draggable">\n                <a href="http://nohost/plone/folder_position?position=up&amp;id=doc1" title="Move item up">\n                  &#9650;\n                </a>\n                &nbsp;\n                <a href="http://nohost/plone/folder_position?position=down&amp;id=doc1" title="Move item down">\n                  &#9660;\n                </a>\n              </td>\n            </tr>\n          \n          \n            <tr class="draggable even" id="folder-contents-item-image1">\n\n              \n\n              <td class="notDraggable">\n                <input type="checkbox" class="noborder" name="paths:list" id="cb_image1" value="/plone/image1" alt="Select Test Image 1" title="Select Test Image 1" />\n                <input type="hidden" name="selected_obj_paths:list" value="/plone/image1" />\n                <label class="hiddenStructure" for="cb_image1">Test Image 1</label>\n              </td>\n              <td>\n                <span class="contenttype-image">\n                  <img width="16" height="16" src="http://nohost/plone/application.png" alt="Image" />\n                  <a href="http://nohost/plone/image1/view" class="state-missing-value" title="Image: ">\n                    Test Image 1\n                  </a>\n                </span>\n\n                \n              </td>\n\n              <td>\n                \n                <span class="state-missing-value">1 kB</span>\n              </td>\n              <td class="state-missing-value">Dec 25, 2009 04:17 AM</td>\n              <td>\n                \n                <span>&nbsp;</span>\n              </td>\n              <td class="draggable">\n                <a href="http://nohost/plone/folder_position?position=up&amp;id=image1" title="Move item up">\n                  &#9650;\n                </a>\n                &nbsp;\n                <a href="http://nohost/plone/folder_position?position=down&amp;id=image1" title="Move item down">\n                  &#9660;\n                </a>\n              </td>\n            </tr>\n          \n          \n            <tr class="draggable odd" id="folder-contents-item-image2">\n\n              \n\n              <td class="notDraggable">\n                <input type="checkbox" class="noborder" name="paths:list" id="cb_image2" value="/plone/image2" alt="Select Test Image 2" title="Select Test Image 2" />\n                <input type="hidden" name="selected_obj_paths:list" value="/plone/image2" />\n                <label class="hiddenStructure" for="cb_image2">Test Image 2</label>\n              </td>\n              <td>\n                <span class="contenttype-image">\n                  <img width="16" height="16" src="http://nohost/plone/application.png" alt="Image" />\n                  <a href="http://nohost/plone/image2/view" class="state-missing-value" title="Image: ">\n                    Test Image 2\n                  </a>\n                </span>\n\n                \n              </td>\n\n              <td>\n                \n                <span class="state-missing-value">1 kB</span>\n              </td>\n              <td class="state-missing-value">Dec 25, 2009 04:17 AM</td>\n              <td>\n                \n                <span>&nbsp;</span>\n              </td>\n              <td class="draggable">\n                <a href="http://nohost/plone/folder_position?position=up&amp;id=image2" title="Move item up">\n                  &#9650;\n                </a>\n                &nbsp;\n                <a href="http://nohost/plone/folder_position?position=down&amp;id=image2" title="Move item down">\n                  &#9660;\n                </a>\n              </td>\n            </tr>\n          \n          \n            <tr class="draggable even" id="folder-contents-item-image3">\n\n              \n\n              <td class="notDraggable">\n                <input type="checkbox" class="noborder" name="paths:list" id="cb_image3" value="/plone/image3" alt="Select Test Image 3" title="Select Test Image 3" />\n                <input type="hidden" name="selected_obj_paths:list" value="/plone/image3" />\n                <label class="hiddenStructure" for="cb_image3">Test Image 3</label>\n              </td>\n              <td>\n                <span class="contenttype-image">\n                  <img width="16" height="16" src="http://nohost/plone/application.png" alt="Image" />\n                  <a href="http://nohost/plone/image3/view" class="state-missing-value" title="Image: ">\n                    Test Image 3\n                  </a>\n                </span>\n\n                \n              </td>\n\n              <td>\n                \n                <span class="state-missing-value">1 kB</span>\n              </td>\n              <td class="state-missing-value">Dec 25, 2009 04:17 AM</td>\n              <td>\n                \n                <span>&nbsp;</span>\n              </td>\n              <td class="draggable">\n                <a href="http://nohost/plone/folder_position?position=up&amp;id=image3" title="Move item up">\n                  &#9650;\n                </a>\n                &nbsp;\n                <a href="http://nohost/plone/folder_position?position=down&amp;id=image3" title="Move item down">\n                  &#9660;\n                </a>\n              </td>\n            </tr>\n          \n          \n            <tr class="draggable odd" id="folder-contents-item-file1">\n\n              \n\n              <td class="notDraggable">\n                <input type="checkbox" class="noborder" name="paths:list" id="cb_file1" value="/plone/file1" alt="Select Test File 1" title="Select Test File 1" />\n                <input type="hidden" name="selected_obj_paths:list" value="/plone/file1" />\n                <label class="hiddenStructure" for="cb_file1">Test File 1</label>\n              </td>\n              <td>\n                <span class="contenttype-file">\n                  <img width="16" height="16" src="http://nohost/plone/application.png" alt="File" />\n                  <a href="http://nohost/plone/file1/view" class="state-missing-value" title="File: ">\n                    Test File 1\n                  </a>\n                </span>\n\n                \n              </td>\n\n              <td>\n                \n                <span class="state-missing-value">1 kB</span>\n              </td>\n              <td class="state-missing-value">Dec 25, 2009 04:17 AM</td>\n              <td>\n                \n                <span>&nbsp;</span>\n              </td>\n              <td class="draggable">\n                <a href="http://nohost/plone/folder_position?position=up&amp;id=file1" title="Move item up">\n                  &#9650;\n                </a>\n                &nbsp;\n                <a href="http://nohost/plone/folder_position?position=down&amp;id=file1" title="Move item down">\n                  &#9660;\n                </a>\n              </td>\n            </tr>\n          \n          \n            <tr class="draggable even" id="folder-contents-item-folder1">\n\n              \n\n              <td class="notDraggable">\n                <input type="checkbox" class="noborder" name="paths:list" id="cb_folder1" value="/plone/folder1" alt="Select Test Folder 1" title="Select Test Folder 1" />\n                <input type="hidden" name="selected_obj_paths:list" value="/plone/folder1" />\n                <label class="hiddenStructure" for="cb_folder1">Test Folder 1</label>\n              </td>\n              <td>\n                <span class="contenttype-folder">\n                  <img width="16" height="16" src="http://nohost/plone/folder_icon.png" alt="Folder" />\n                  <a href="http://nohost/plone/folder1/folder_contents" class="state-visible" title="Folder: ">\n                    Test Folder 1\n                  </a>\n                </span>\n\n                \n              </td>\n\n              <td>\n                \n                <span class="state-visible">1 kB</span>\n              </td>\n              <td class="state-visible">Dec 25, 2009 04:17 AM</td>\n              <td>\n                <span class="state-visible">Public draft</span>\n                \n              </td>\n              <td class="draggable">\n                <a href="http://nohost/plone/folder_position?position=up&amp;id=folder1" title="Move item up">\n                  &#9650;\n                </a>\n                &nbsp;\n                <a href="http://nohost/plone/folder_position?position=down&amp;id=folder1" title="Move item down">\n                  &#9660;\n                </a>\n              </td>\n            </tr>\n          \n        </tbody>\n        \n      \n    </table>\n    <!-- Navigation -->\n\n\n    \n      <input class="context" type="submit" name="folder_copy:method" value="Copy" />\n    \n    \n      <input class="context" type="submit" name="folder_cut:method" value="Cut" />\n    \n    \n      <input class="context" type="submit" name="folder_rename_form:method" value="Rename" />\n    \n    \n      <input class="context" type="submit" name="folder_delete:method" value="Delete" />\n    \n    \n      <input class="context" type="submit" name="content_status_history:method" value="Change State" />\n    \n  \n</div>\n\n        <input type="hidden" name="_authenticator" value="92f1af0a1587bae37ffddc0579e9a93160d997b4"/>\n      </form>\n    </div>\n                        </div>\n                    \n\n                    \n                        \n\na standard view\n                    \n                </div>\n            </div>\n        \n        </div>\n\n        \n\n        \n    </div>\n\n<div class="visualClear"></div> <!-- TODO: Temporary workaround -->\n\n    \n<div class="row"> <!-- TODO: Also temporary, should be in the proper template -->\n    <div class="cell width-full position-0">\n        <div id="portal-footer">\n\n<p>\n    \n    The\n    <a href="http://plone.org">Plone<sup>&reg;</sup> CMS &mdash; Open Source Content Management System</a>\n    is\n    <acronym title="Copyright">&copy;</acronym>\n    2000-2009\n    by the\n    <a href="http://plone.org/foundation">Plone Foundation</a>\n    et al.\n    \n</p>\n\n<p>\n    \n    Plone<sup>&reg;</sup> and the Plone logo are registered trademarks of the\n        <a href="http://plone.org/foundation">Plone Foundation</a>.\n    \n\n    \n    Distributed under the\n        <a href="http://creativecommons.org/licenses/GPL/2.0/">GNU GPL license</a>.\n    \n</p>\n\n</div>\n\n<div id="portal-colophon">\n\n<div class="colophonWrapper">\n<ul>\n  <li>\n    <a href="http://plone.org" title="This site was built using Plone CMS, the Open Source Content Management System. Click for more information.">\n      Powered by Plone</a>\n  </li>\n</ul>\n</div>\n</div>\n\n<ul id="portal-siteactions">\n\n    <li id="siteaction-sitemap"><a href="http://nohost/plone/sitemap" accesskey="3" title="Site Map">Site Map</a></li>\n    <li id="siteaction-accessibility"><a href="http://nohost/plone/accessibility-info" accesskey="0" title="Accessibility">Accessibility</a></li>\n    <li id="siteaction-contact"><a href="http://nohost/plone/contact-info" accesskey="9" title="Contact">Contact</a></li>\n</ul>\n\n\na standard view\n    </div>\n</div>\n    \n\n</div>\n\n<!-- TODO: This needs to go away. -->\n<!-- <div id="kss-spinner"><img tal:attributes="src string:${portal_url}/spinner.png" alt="" /></div> -->\n\n</body>\n</html>\n\n\n'

  Ran 117 tests with 1 failures and 0 errors in 27.861 seconds.
Running plone.app.viewletmanager.tests.test_exportimport.Layer tests:
  Tear down plone.app.linkintegrity.tests.layer.PloneLinkintegrity in 0.051 seconds.
  Tear down Products.PloneTestCase.layer.PloneSite in 0.415 seconds.
  Tear down Products.PloneTestCase.layer.ZCML in 0.034 seconds.
  Tear down Testing.ZopeTestCase.layer.ZopeLite in 0.000 seconds.
  Set up plone.app.viewletmanager.tests.test_exportimport.Layer in 0.000 seconds.
  Ran 16 tests with 0 failures and 0 errors in 0.051 seconds.
Running zope.testing.testrunner.layer.UnitTests tests:
  Tear down plone.app.viewletmanager.tests.test_exportimport.Layer in 0.000 seconds.
  Set up zope.testing.testrunner.layer.UnitTests in 0.000 seconds.
  Ran 143 tests with 0 failures and 0 errors in 0.911 seconds.
Tearing down left over layers:
  Tear down zope.testing.testrunner.layer.UnitTests in 0.000 seconds.
Total: 2335 tests, 1 failures, 0 errors in 4 minutes 48.079 seconds.
Running Testing.ZopeTestCase.layer.ZopeLite tests:
  Set up Testing.ZopeTestCase.layer.ZopeLite in 1.506 seconds.
  Ran 165 tests with 0 failures and 0 errors in 0.612 seconds.
Running Products.PloneTestCase.layer.ZCML tests:
  Set up Products.PloneTestCase.layer.ZCML in 2.324 seconds.
  Ran 34 tests with 0 failures and 0 errors in 0.215 seconds.
Running Products.PlonePAS.tests.layer.PlonePASLayer tests:
  Set up Products.PloneTestCase.layer.PloneSite in 3.922 seconds.
  Set up Products.PlonePAS.tests.layer.PlonePASLayer in 0.000 seconds.
  Ran 152 tests with 0 failures and 0 errors in 1.846 seconds.
Running zope.testing.testrunner.layer.UnitTests tests:
  Tear down Products.PlonePAS.tests.layer.PlonePASLayer in 0.000 seconds.
  Tear down Products.PloneTestCase.layer.PloneSite in 0.357 seconds.
  Tear down Products.PloneTestCase.layer.ZCML in 0.004 seconds.
  Tear down Testing.ZopeTestCase.layer.ZopeLite in 0.000 seconds.
  Set up zope.testing.testrunner.layer.UnitTests in 0.000 seconds.
  Ran 371 tests with 0 failures and 0 errors in 0.796 seconds.
Tearing down left over layers:
  Tear down zope.testing.testrunner.layer.UnitTests in 0.000 seconds.
Total: 722 tests, 0 failures, 0 errors in 12.470 seconds.
Running Products.PloneTestCase.layer.PloneSite tests:
  Set up Testing.ZopeTestCase.layer.ZopeLite in 1.454 seconds.
  Set up Products.PloneTestCase.layer.ZCML in 2.388 seconds.
  Set up Products.PloneTestCase.layer.PloneSite in 4.199 seconds.
/home/stefan/autotest/temp/python26-zope212-cmf22-plone40/eggs/borg.localrole-3.0a1-py2.6.egg/borg/localrole/bbb/bbb.txt:1: DeprecationWarning: IWorkspace is deprecated. Please use borg.localrole.interfaces.ILocalRoleProvider instead
  =========
/home/stefan/autotest/temp/python26-zope212-cmf22-plone40/eggs/borg.localrole-3.0a1-py2.6.egg/borg/localrole/bbb/bbb.txt:1: DeprecationWarning: IGroupAwareWorkspace is deprecated. Please use borg.localrole.interfaces.ILocalRoleProvider instead
  =========
  Ran 36 tests with 0 failures and 0 errors in 0.137 seconds.
Running plone.browserlayer.tests.test_doctest.PloneBrowserLayerLayer tests:
  Set up plone.browserlayer.tests.test_doctest.PloneBrowserLayerLayer in 0.003 seconds.
  Ran 9 tests with 0 failures and 0 errors in 0.992 seconds.
Running plone.theme.tests.test_doctest.PloneThemeLayer tests:
  Tear down plone.browserlayer.tests.test_doctest.PloneBrowserLayerLayer in 0.000 seconds.
  Set up plone.theme.tests.test_doctest.PloneThemeLayer in 0.003 seconds.
  Ran 5 tests with 0 failures and 0 errors in 0.053 seconds.
Running zope.testing.testrunner.layer.UnitTests tests:
  Tear down plone.theme.tests.test_doctest.PloneThemeLayer in 0.000 seconds.
  Tear down Products.PloneTestCase.layer.PloneSite in 0.362 seconds.
  Tear down Products.PloneTestCase.layer.ZCML in 0.004 seconds.
  Tear down Testing.ZopeTestCase.layer.ZopeLite in 0.000 seconds.
  Set up zope.testing.testrunner.layer.UnitTests in 0.000 seconds.
/usr/local/python2.6/lib/python2.6/mhlib.py:83: DeprecationWarning: the multifile module has been deprecated since Python 2.5
  import multifile
  Ran 253 tests with 0 failures and 0 errors in 0.847 seconds.
Tearing down left over layers:
  Tear down zope.testing.testrunner.layer.UnitTests in 0.000 seconds.
Total: 303 tests, 0 failures, 0 errors in 11.326 seconds.
Running Products.PloneTestCase.layer.PloneSite tests:
  Set up Testing.ZopeTestCase.layer.ZopeLite in 0.931 seconds.
  Set up Products.PloneTestCase.layer.ZCML in 2.333 seconds.
  Set up Products.PloneTestCase.layer.PloneSite in 4.274 seconds.
/usr/local/python2.6/lib/python2.6/unittest.py:279: DeprecationWarning: The use of 'hide' has been deprecated and will be removed in plone.portlet.static 2.0. Instead, use the new generic built-in show/hide setting of plone.portlets.
  testMethod()
  Ran 165 tests with 0 failures and 0 errors in 15.705 seconds.
Running plone.app.portlets.tests.test_configuration.TestPortletZCMLLayer tests:
  Set up plone.app.portlets.tests.test_configuration.TestPortletZCMLLayer in 0.006 seconds.
  Ran 5 tests with 0 failures and 0 errors in 0.038 seconds.
Running plone.app.portlets.tests.test_configuration.TestPortletGSLayer tests:
  Set up plone.app.portlets.tests.test_configuration.TestPortletGSLayer in 1.571 seconds.
  Ran 12 tests with 0 failures and 0 errors in 4.144 seconds.
Running zope.testing.testrunner.layer.UnitTests tests:
  Tear down plone.app.portlets.tests.test_configuration.TestPortletGSLayer in 0.000 seconds.
  Tear down plone.app.portlets.tests.test_configuration.TestPortletZCMLLayer in 0.000 seconds.
  Tear down Products.PloneTestCase.layer.PloneSite in 0.363 seconds.
  Tear down Products.PloneTestCase.layer.ZCML in 0.005 seconds.
  Tear down Testing.ZopeTestCase.layer.ZopeLite in 0.000 seconds.
  Set up zope.testing.testrunner.layer.UnitTests in 0.000 seconds.
  Ran 54 tests with 0 failures and 0 errors in 0.149 seconds.
Tearing down left over layers:
  Tear down zope.testing.testrunner.layer.UnitTests in 0.000 seconds.
Total: 236 tests, 0 failures, 0 errors in 30.368 seconds.
Running zope.testing.testrunner.layer.UnitTests tests:
  Set up zope.testing.testrunner.layer.UnitTests in 0.000 seconds.
  Ran 3 tests with 0 failures and 0 errors in 12.351 seconds.
Tearing down left over layers:
  Tear down zope.testing.testrunner.layer.UnitTests in 0.000 seconds.
Total: 0 tests, 0 failures, 0 errors in 0.000 seconds.
Running Products.PloneTestCase.layer.PloneSite tests:
  Set up Testing.ZopeTestCase.layer.ZopeLite in 0.000 seconds.
  Set up Products.PloneTestCase.layer.ZCML in 1.869 seconds.
  Set up Products.PloneTestCase.layer.PloneSite in 5.453 seconds.
  Ran 23 tests with 0 failures and 0 errors in 3.586 seconds.
Running Products.CMFPlacefulWorkflow.tests.test_exportimport.ExportImportLayer tests:
  Set up Products.CMFPlacefulWorkflow.tests.test_exportimport.ExportImportLayer in 0.001 seconds.
  Ran 12 tests with 0 failures and 0 errors in 0.936 seconds.
Tearing down left over layers:
  Tear down Products.CMFPlacefulWorkflow.tests.test_exportimport.ExportImportLayer in 0.000 seconds.
  Tear down Products.PloneTestCase.layer.PloneSite in 0.366 seconds.
  Tear down Products.PloneTestCase.layer.ZCML in 0.004 seconds.
  Tear down Testing.ZopeTestCase.layer.ZopeLite in 0.000 seconds.
Total: 35 tests, 0 failures, 0 errors in 12.659 seconds.
Running Products.CMFTestCase.layer.CMFSite tests:
  Set up Testing.ZopeTestCase.layer.ZopeLite in 0.240 seconds.
  Set up Products.CMFTestCase.layer.ZCML in 0.368 seconds.
  Set up Products.CMFTestCase.layer.CMFSite in 0.212 seconds.
  Ran 58 tests with 0 failures and 0 errors in 0.231 seconds.
Tearing down left over layers:
  Tear down Products.CMFTestCase.layer.CMFSite in 0.027 seconds.
  Tear down Products.CMFTestCase.layer.ZCML in 0.001 seconds.
  Tear down Testing.ZopeTestCase.layer.ZopeLite in 0.000 seconds.
Running zope.testing.testrunner.layer.UnitTests tests:
  Set up zope.testing.testrunner.layer.UnitTests in 0.000 seconds.
  Ran 35 tests with 0 failures and 0 errors in 0.027 seconds.
Tearing down left over layers:
  Tear down zope.testing.testrunner.layer.UnitTests in 0.000 seconds.
Running Products.PloneTestCase.layer.PloneSite tests:
  Set up Testing.ZopeTestCase.layer.ZopeLite in 1.461 seconds.
  Set up Products.PloneTestCase.layer.ZCML in 2.484 seconds.
  Set up Products.PloneTestCase.layer.PloneSite in 4.147 seconds.
  Ran 38 tests with 0 failures and 0 errors in 4.435 seconds.
Tearing down left over layers:
  Tear down Products.PloneTestCase.layer.PloneSite in 0.371 seconds.
  Tear down Products.PloneTestCase.layer.ZCML in 0.006 seconds.
  Tear down Testing.ZopeTestCase.layer.ZopeLite in 0.000 seconds.
Running Products.PloneTestCase.layer.PloneSite tests:
  Set up Testing.ZopeTestCase.layer.ZopeLite in 1.494 seconds.
  Set up Products.PloneTestCase.layer.ZCML in 2.431 seconds.
  Set up Products.PloneTestCase.layer.PloneSite in 4.150 seconds.
/home/stefan/autotest/temp/python26-zope212-cmf22-plone40/src/Products.PlonePAS/Products/PlonePAS/tools/membership.py:555: DeprecationWarning: credentialsChanged should be called with 'REQUEST' as second argument. The BBB code will be removed in CMF 2.3.
  self.credentialsChanged(password, REQUEST=REQUEST)
  Ran 61 tests with 0 failures and 0 errors in 1.259 seconds.
Tearing down left over layers:
  Tear down Products.PloneTestCase.layer.PloneSite in 0.364 seconds.
  Tear down Products.PloneTestCase.layer.ZCML in 0.004 seconds.
  Tear down Testing.ZopeTestCase.layer.ZopeLite in 0.000 seconds.
Running Products.PloneTestCase.layer.PloneSite tests:
  Set up Testing.ZopeTestCase.layer.ZopeLite in 1.467 seconds.
  Set up Products.PloneTestCase.layer.ZCML in 2.394 seconds.
  Set up Products.PloneTestCase.layer.PloneSite in 4.270 seconds.
  Ran 239 tests with 0 failures and 0 errors in 18.288 seconds.
Running zope.testing.testrunner.layer.UnitTests tests:
  Tear down Products.PloneTestCase.layer.PloneSite in 0.375 seconds.
  Tear down Products.PloneTestCase.layer.ZCML in 0.005 seconds.
  Tear down Testing.ZopeTestCase.layer.ZopeLite in 0.000 seconds.
  Set up zope.testing.testrunner.layer.UnitTests in 0.000 seconds.
  Ran 59 tests with 0 failures and 0 errors in 0.013 seconds.
Tearing down left over layers:
  Tear down zope.testing.testrunner.layer.UnitTests in 0.000 seconds.
Total: 298 tests, 0 failures, 0 errors in 27.240 seconds.
Running Products.PloneTestCase.layer.PloneSite tests:
  Set up Testing.ZopeTestCase.layer.ZopeLite in 1.448 seconds.
  Set up Products.PloneTestCase.layer.ZCML in 2.404 seconds.
  Set up Products.PloneTestCase.layer.PloneSite in 4.123 seconds.
  Ran 78 tests with 0 failures and 0 errors in 3.023 seconds.
Tearing down left over layers:
  Tear down Products.PloneTestCase.layer.PloneSite in 0.368 seconds.
  Tear down Products.PloneTestCase.layer.ZCML in 0.007 seconds.
  Tear down Testing.ZopeTestCase.layer.ZopeLite in 0.000 seconds.
Running zope.testing.testrunner.layer.UnitTests tests:
  Set up zope.testing.testrunner.layer.UnitTests in 0.000 seconds.
  Ran 76 tests with 0 failures and 0 errors in 1.537 seconds.
Tearing down left over layers:
  Tear down zope.testing.testrunner.layer.UnitTests in 0.000 seconds.
Running Products.contentmigration.tests.layer.TestLayer tests:
  Set up Testing.ZopeTestCase.layer.ZopeLite in 1.440 seconds.
  Set up Products.PloneTestCase.layer.ZCML in 2.655 seconds.
  Set up Products.PloneTestCase.layer.PloneSite in 4.121 seconds.
  Set up Products.contentmigration.tests.layer.TestLayer in 0.002 seconds.
  Ran 18 tests with 0 failures and 0 errors in 5.450 seconds.
Tearing down left over layers:
  Tear down Products.contentmigration.tests.layer.TestLayer in 0.000 seconds.
  Tear down Products.PloneTestCase.layer.PloneSite in 0.365 seconds.
  Tear down Products.PloneTestCase.layer.ZCML in 0.004 seconds.
  Tear down Testing.ZopeTestCase.layer.ZopeLite in 0.000 seconds.
Total: 0 tests, 0 failures, 0 errors in 0.000 seconds.
Running archetypes.referencebrowserwidget.tests.base.layer tests:
  Set up Testing.ZopeTestCase.layer.ZopeLite in 0.000 seconds.
  Set up Products.PloneTestCase.layer.ZCML in 1.863 seconds.
  Set up Products.PloneTestCase.layer.PloneSite in 4.757 seconds.
  Set up archetypes.referencebrowserwidget.tests.base.layer in 0.000 seconds.
  Ran 43 tests with 0 failures and 0 errors in 7.927 seconds.
Running zope.testing.testrunner.layer.UnitTests tests:
  Tear down archetypes.referencebrowserwidget.tests.base.layer in 0.000 seconds.
  Tear down Products.PloneTestCase.layer.PloneSite in 0.367 seconds.
  Tear down Products.PloneTestCase.layer.ZCML in 0.007 seconds.
  Tear down Testing.ZopeTestCase.layer.ZopeLite in 0.000 seconds.
  Set up zope.testing.testrunner.layer.UnitTests in 0.000 seconds.
  Ran 4 tests with 0 failures and 0 errors in 0.001 seconds.
Tearing down left over layers:
  Tear down zope.testing.testrunner.layer.UnitTests in 0.000 seconds.
Total: 47 tests, 0 failures, 0 errors in 15.416 seconds.
Running archetypes.schemaextender.tests.testIntegration.layer tests:
  Set up Testing.ZopeTestCase.layer.ZopeLite in 1.456 seconds.
  Set up Products.PloneTestCase.layer.ZCML in 2.584 seconds.
  Set up Products.PloneTestCase.layer.PloneSite in 4.131 seconds.
  Set up archetypes.schemaextender.tests.testIntegration.layer in 0.000 seconds.
  Ran 17 tests with 0 failures and 0 errors in 3.244 seconds.
Running zope.testing.testrunner.layer.UnitTests tests:
  Tear down archetypes.schemaextender.tests.testIntegration.layer in 0.000 seconds.
  Tear down Products.PloneTestCase.layer.PloneSite in 0.375 seconds.
  Tear down Products.PloneTestCase.layer.ZCML in 0.007 seconds.
  Tear down Testing.ZopeTestCase.layer.ZopeLite in 0.000 seconds.
  Set up zope.testing.testrunner.layer.UnitTests in 0.000 seconds.
  Ran 19 tests with 0 failures and 0 errors in 0.007 seconds.
Tearing down left over layers:
  Tear down zope.testing.testrunner.layer.UnitTests in 0.000 seconds.
Total: 36 tests, 0 failures, 0 errors in 12.239 seconds.
Running zope.testing.testrunner.layer.UnitTests tests:
  Set up zope.testing.testrunner.layer.UnitTests in 0.000 seconds.
  Ran 4 tests with 0 failures and 0 errors in 0.040 seconds.
Tearing down left over layers:
  Tear down zope.testing.testrunner.layer.UnitTests in 0.000 seconds.
Running Testing.ZopeTestCase.layer.ZopeLite tests:
  Set up Testing.ZopeTestCase.layer.ZopeLite in 0.069 seconds.
  Ran 40 tests with 0 failures and 0 errors in 0.786 seconds.
Tearing down left over layers:
  Tear down Testing.ZopeTestCase.layer.ZopeLite in 0.000 seconds.
/home/stefan/autotest/temp/python26-zope212-cmf22-plone40/eggs/kss.core-1.6.0a1-py2.6.egg/kss/core/tests/test_kssview_core.py:165: UserWarning: The test_class you are using doesn't subclass from ZopeTestCase.Functional. Please fix that.
  tearDown=KSSViewTestCase.beforeTearDown.im_func))
Running Testing.ZopeTestCase.layer.ZopeLite tests:
  Set up Testing.ZopeTestCase.layer.ZopeLite in 0.048 seconds.
  Ran 1 tests with 0 failures and 0 errors in 0.261 seconds.
Running kss.core.tests.base.KSSLayer tests:
  Tear down Testing.ZopeTestCase.layer.ZopeLite in 0.000 seconds.
  Set up kss.core.tests.base.KSSCoreLayer in 0.033 seconds.
  Set up kss.core.tests.base.KSSLayer in 0.057 seconds.
  Ran 29 tests with 0 failures and 0 errors in 0.155 seconds.
Running kss.core.tests.test_ttwapi.layer tests:
  Set up kss.core.tests.test_ttwapi.layer in 0.001 seconds.
  Ran 3 tests with 0 failures and 0 errors in 0.026 seconds.
Running zope.testing.testrunner.layer.UnitTests tests:
  Tear down kss.core.tests.test_ttwapi.layer in 0.000 seconds.
  Tear down kss.core.tests.base.KSSLayer in 0.000 seconds.
  Tear down kss.core.tests.base.KSSCoreLayer in 0.000 seconds.
  Set up zope.testing.testrunner.layer.UnitTests in 0.000 seconds.
/home/stefan/autotest/temp/python26-zope212-cmf22-plone40/eggs/kss.core-1.6.0a1-py2.6.egg/kss/core/siteview.txt:1: DeprecationWarning: ISite is deprecated. Moved to zope.location.interfaces. Importing from here will stop working in Zope 3.6
  =========
  Ran 14 tests with 0 failures and 0 errors in 0.009 seconds.
Tearing down left over layers:
  Tear down zope.testing.testrunner.layer.UnitTests in 0.000 seconds.
Total: 47 tests, 0 failures, 0 errors in 0.901 seconds.
***********************************************
WARNING: LinguaPlone not found. Skipping tests.
***********************************************
***********************************************
WARNING: LinguaPlone not found. Skipping tests.
***********************************************
Running plone.app.blob.tests.layer.BlobLayer tests:
  Set up Testing.ZopeTestCase.layer.ZopeLite in 0.938 seconds.
  Set up Products.PloneTestCase.layer.ZCML in 2.356 seconds.
  Set up Products.PloneTestCase.layer.PloneSite in 4.105 seconds.
  Set up plone.app.blob.tests.layer.BlobLayer in 0.103 seconds.
/home/stefan/autotest/temp/python26-zope212-cmf22-plone40/src/Products.PortalTransforms/Products/PortalTransforms/libtransforms/commandtransform.py:97: DeprecationWarning: os.popen4 is deprecated.  Use the subprocess module.
  cin, couterr = os.popen4(command, 'b')
  Ran 29 tests with 0 failures and 0 errors in 8.147 seconds.
Running plone.app.blob.tests.layer.BlobReplacementLayer tests:
  Set up plone.app.blob.tests.layer.BlobReplacementLayer in 0.191 seconds.
  Ran 39 tests with 0 failures and 0 errors in 10.514 seconds.
Running zope.testing.testrunner.layer.UnitTests tests:
  Tear down plone.app.blob.tests.layer.BlobReplacementLayer in 0.000 seconds.
  Tear down plone.app.blob.tests.layer.BlobLayer in 0.000 seconds.
  Tear down Products.PloneTestCase.layer.PloneSite in 0.357 seconds.
  Tear down Products.PloneTestCase.layer.ZCML in 0.009 seconds.
  Tear down Testing.ZopeTestCase.layer.ZopeLite in 0.000 seconds.
  Set up zope.testing.testrunner.layer.UnitTests in 0.000 seconds.
  Ran 2 tests with 0 failures and 0 errors in 0.001 seconds.
Tearing down left over layers:
  Tear down zope.testing.testrunner.layer.UnitTests in 0.000 seconds.
Total: 70 tests, 0 failures, 0 errors in 27.444 seconds.
Running Testing.ZopeTestCase.layer.ZopeLite tests:
  Set up Testing.ZopeTestCase.layer.ZopeLite in 0.946 seconds.
  Ran 2 tests with 0 failures and 0 errors in 0.008 seconds.
Running plone.app.folder.tests.layer.IntegrationLayer tests:
  Set up Products.PloneTestCase.layer.ZCML in 2.393 seconds.
  Set up Products.PloneTestCase.layer.PloneSite in 3.979 seconds.
  Set up plone.app.folder.tests.layer.IntegrationLayer in 0.468 seconds.
  Ran 9 tests with 0 failures and 0 errors in 2.095 seconds.
Running plone.app.folder.tests.layer.PartialOrderingIntegrationLayer tests:
  Set up plone.app.folder.tests.layer.PartialOrderingIntegrationLayer in 0.000 seconds.
  Ran 3 tests with 0 failures and 0 errors in 0.315 seconds.
Tearing down left over layers:
  Tear down plone.app.folder.tests.layer.PartialOrderingIntegrationLayer in 0.000 seconds.
  Tear down plone.app.folder.tests.layer.IntegrationLayer in 0.000 seconds.
  Tear down Products.PloneTestCase.layer.PloneSite in 0.368 seconds.
  Tear down Products.PloneTestCase.layer.ZCML in 0.004 seconds.
  Tear down Testing.ZopeTestCase.layer.ZopeLite in 0.000 seconds.
Total: 14 tests, 0 failures, 0 errors in 11.144 seconds.
Running plone.app.imaging.tests.layer.ImagingLayer tests:
  Set up Testing.ZopeTestCase.layer.ZopeLite in 0.962 seconds.
  Set up Products.PloneTestCase.layer.ZCML in 2.376 seconds.
  Set up Products.PloneTestCase.layer.PloneSite in 4.114 seconds.
  Set up plone.app.imaging.tests.layer.ImagingLayer in 0.101 seconds.
  Ran 37 tests with 0 failures and 0 errors in 4.193 seconds.
Running zope.testing.testrunner.layer.UnitTests tests:
  Tear down plone.app.imaging.tests.layer.ImagingLayer in 0.000 seconds.
  Tear down Products.PloneTestCase.layer.PloneSite in 0.378 seconds.
  Tear down Products.PloneTestCase.layer.ZCML in 0.005 seconds.
  Tear down Testing.ZopeTestCase.layer.ZopeLite in 0.000 seconds.
  Set up zope.testing.testrunner.layer.UnitTests in 0.000 seconds.
  Ran 7 tests with 0 failures and 0 errors in 0.001 seconds.
Tearing down left over layers:
  Tear down zope.testing.testrunner.layer.UnitTests in 0.000 seconds.
Total: 44 tests, 0 failures, 0 errors in 12.569 seconds.
Running Products.PloneTestCase.layer.PloneSite tests:
  Set up Testing.ZopeTestCase.layer.ZopeLite in 1.484 seconds.
  Set up Products.PloneTestCase.layer.ZCML in 2.400 seconds.
  Set up Products.PloneTestCase.layer.PloneSite in 4.077 seconds.
  Ran 9 tests with 0 failures and 0 errors in 0.128 seconds.
Tearing down left over layers:
  Tear down Products.PloneTestCase.layer.PloneSite in 0.368 seconds.
  Tear down Products.PloneTestCase.layer.ZCML in 0.004 seconds.
  Tear down Testing.ZopeTestCase.layer.ZopeLite in 0.000 seconds.
Total: 0 tests, 0 failures, 0 errors in 0.000 seconds.
Running Products.PloneTestCase.layer.PloneSite tests:
  Set up Testing.ZopeTestCase.layer.ZopeLite in 1.455 seconds.
  Set up Products.PloneTestCase.layer.ZCML in 2.325 seconds.
  Set up Products.PloneTestCase.layer.PloneSite in 4.064 seconds.
  Ran 3 tests with 0 failures and 0 errors in 1.137 seconds.
Tearing down left over layers:
  Tear down Products.PloneTestCase.layer.PloneSite in 0.352 seconds.
  Tear down Products.PloneTestCase.layer.ZCML in 0.004 seconds.
  Tear down Testing.ZopeTestCase.layer.ZopeLite in 0.000 seconds.
Running Products.PloneTestCase.layer.PloneSite tests:
  Set up Testing.ZopeTestCase.layer.ZopeLite in 1.461 seconds.
  Set up Products.PloneTestCase.layer.ZCML in 2.380 seconds.
  Set up Products.PloneTestCase.layer.PloneSite in 4.073 seconds.
  Ran 8 tests with 0 failures and 0 errors in 4.263 seconds.
Tearing down left over layers:
  Tear down Products.PloneTestCase.layer.PloneSite in 0.367 seconds.
  Tear down Products.PloneTestCase.layer.ZCML in 0.006 seconds.
  Tear down Testing.ZopeTestCase.layer.ZopeLite in 0.000 seconds.
Running plone.folder.tests.layer.PartialOrderingLayer tests:
  Set up plone.folder.tests.layer.PartialOrderingLayer in 0.000 seconds.
  Ran 11 tests with 0 failures and 0 errors in 0.007 seconds.
Running plone.folder.tests.layer.PloneFolderLayer tests:
  Tear down plone.folder.tests.layer.PartialOrderingLayer in 0.000 seconds.
  Set up plone.folder.tests.layer.PloneFolderLayer in 0.000 seconds.
  Ran 45 tests with 0 failures and 0 errors in 0.031 seconds.
Tearing down left over layers:
  Tear down plone.folder.tests.layer.PloneFolderLayer in 0.000 seconds.
Total: 56 tests, 0 failures, 0 errors in 0.171 seconds.
Running Products.PloneTestCase.layer.PloneSite tests:
  Set up Testing.ZopeTestCase.layer.ZopeLite in 1.448 seconds.
  Set up Products.PloneTestCase.layer.ZCML in 2.377 seconds.
  Set up Products.PloneTestCase.layer.PloneSite in 4.333 seconds.
  Ran 41 tests with 0 failures and 0 errors in 0.365 seconds.
Tearing down left over layers:
  Tear down Products.PloneTestCase.layer.PloneSite in 0.362 seconds.
  Tear down Products.PloneTestCase.layer.ZCML in 0.004 seconds.
  Tear down Testing.ZopeTestCase.layer.ZopeLite in 0.000 seconds.
Total: 0 tests, 0 failures, 0 errors in 0.000 seconds.
Total: 0 tests, 0 failures, 0 errors in 0.000 seconds.
Running Products.PloneTestCase.layer.ZCML tests:
  Set up Testing.ZopeTestCase.layer.ZopeLite in 0.946 seconds.
  Set up Products.PloneTestCase.layer.ZCML in 2.508 seconds.
/home/stefan/autotest/temp/python26-zope212-cmf22-plone40/eggs/wicked-1.1.8alpha1-py2.6.egg/wicked/cache.py:34: DeprecationWarning: object.__init__() takes no parameters
  super(CacheStore, self).__init__(self)
  Ran 16 tests with 0 failures and 0 errors in 0.059 seconds.
Running wicked.at.tests.wickedtestcase.WickedSite tests:
  Set up Products.PloneTestCase.layer.PloneSite in 4.943 seconds.
  Set up wicked.at.tests.wickedtestcase.WickedSite in 0.002 seconds.
/home/stefan/autotest/temp/python26-zope212-cmf22-plone40/eggs/Zope2-2.12.2-py2.6-linux-x86_64.egg/OFS/subscribers.py:73: DeprecationWarning: wicked.atcontent.ironicwiki.IronicWiki.manage_afterAdd is discouraged. You should use event subscribers instead.
  DeprecationWarning)
/home/stefan/autotest/temp/python26-zope212-cmf22-plone40/eggs/Zope2-2.12.2-py2.6-linux-x86_64.egg/OFS/subscribers.py:73: DeprecationWarning: wicked.atcontent.ironicwiki.IronicWiki.manage_beforeDelete is discouraged. You should use event subscribers instead.
  DeprecationWarning)
/home/stefan/autotest/temp/python26-zope212-cmf22-plone40/eggs/Zope2-2.12.2-py2.6-linux-x86_64.egg/OFS/subscribers.py:73: DeprecationWarning: wicked.atcontent.ironicwiki.IronicWiki.manage_afterClone is discouraged. You should use event subscribers instead.
  DeprecationWarning)
  Ran 23 tests with 0 failures and 0 errors in 5.777 seconds.
Running wicked.at.tests.test_scope.Scoped tests:
  Set up wicked.at.tests.test_scope.Scoped in 0.000 seconds.
  Ran 3 tests with 0 failures and 0 errors in 0.629 seconds.
Running wicked.plone.tests.SelectiveATCT tests:
  Tear down wicked.at.tests.test_scope.Scoped in 0.000 seconds.
  Tear down wicked.at.tests.wickedtestcase.WickedSite in 0.002 seconds.
  Set up wicked.plone.tests.SelectiveATCT in 0.003 seconds.
  Ran 22 tests with 0 failures and 0 errors in 5.945 seconds.
Running wicked.plone.tests.ZCMLLayer tests:
  Tear down wicked.plone.tests.SelectiveATCT in 0.004 seconds.
  Set up wicked.plone.tests.ZCMLLayer in 0.019 seconds.
  Ran 8 tests with 0 failures and 0 errors in 0.743 seconds.
Running zope.testing.testrunner.layer.UnitTests tests:
  Tear down wicked.plone.tests.ZCMLLayer in 0.388 seconds.
  Tear down Products.PloneTestCase.layer.PloneSite in 0.001 seconds.
  Tear down Products.PloneTestCase.layer.ZCML in 0.004 seconds.
  Tear down Testing.ZopeTestCase.layer.ZopeLite in 0.000 seconds.
  Set up zope.testing.testrunner.layer.UnitTests in 0.000 seconds.
  Ran 34 tests with 0 failures and 0 errors in 0.016 seconds.
Tearing down left over layers:
  Tear down zope.testing.testrunner.layer.UnitTests in 0.000 seconds.
Total: 106 tests, 0 failures, 0 errors in 23.218 seconds.
#### Running tests for group ATCT ####
#### Finished tests for group ATCT ####

#### Running tests for group Archetypes ####
#### Finished tests for group Archetypes ####

#### Running tests for group CMF ####
#### Finished tests for group CMF ####

#### Running tests for group CMFEditions ####
#### Finished tests for group CMFEditions ####

#### Running tests for group Plone ####
#### Finished tests for group Plone ####

#### Running tests for group PlonePAS ####
#### Finished tests for group PlonePAS ####

#### Running tests for group plone ####
#### Finished tests for group plone ####

#### Running tests for group portlets ####
#### Finished tests for group portlets ####

#### Running tests for group z3c.autoinclude ####
#### Finished tests for group z3c.autoinclude ####

#### Running tests for PIL ####
#### Finished tests for PIL ####

#### Running tests for Products.CMFPlacefulWorkflow ####
#### Finished tests for Products.CMFPlacefulWorkflow ####

#### Running tests for Products.CMFTestCase ####
#### Finished tests for Products.CMFTestCase ####

#### Running tests for Products.ExtendedPathIndex ####
#### Finished tests for Products.ExtendedPathIndex ####

#### Running tests for Products.PasswordResetTool ####
#### Finished tests for Products.PasswordResetTool ####

#### Running tests for Products.PloneTestCase ####
#### Finished tests for Products.PloneTestCase ####

#### Running tests for Products.ResourceRegistries ####
#### Finished tests for Products.ResourceRegistries ####

#### Running tests for Products.TinyMCE ####
#### Finished tests for Products.TinyMCE ####

#### Running tests for Products.ZopeVersionControl ####
#### Finished tests for Products.ZopeVersionControl ####

#### Running tests for Products.contentmigration ####
#### Finished tests for Products.contentmigration ####

#### Running tests for Products.i18ntestcase ####
#### Finished tests for Products.i18ntestcase ####

#### Running tests for archetypes.referencebrowserwidget ####
#### Finished tests for archetypes.referencebrowserwidget ####

#### Running tests for archetypes.schemaextender ####
#### Finished tests for archetypes.schemaextender ####

#### Running tests for collective.monkeypatcher ####
#### Finished tests for collective.monkeypatcher ####

#### Running tests for five.customerize ####
#### Finished tests for five.customerize ####

#### Running tests for kss.core ####
#### Finished tests for kss.core ####

#### Running tests for plone.app.blob ####
#### Finished tests for plone.app.blob ####

#### Running tests for plone.app.folder ####
#### Finished tests for plone.app.folder ####

#### Running tests for plone.app.imaging ####
#### Finished tests for plone.app.imaging ####

#### Running tests for plone.app.jquerytools ####
#### Finished tests for plone.app.jquerytools ####

#### Running tests for plone.app.locales ####
#### Finished tests for plone.app.locales ####

#### Running tests for plone.app.openid ####
#### Finished tests for plone.app.openid ####

#### Running tests for plone.app.users ####
#### Finished tests for plone.app.users ####

#### Running tests for plone.folder ####
#### Finished tests for plone.folder ####

#### Running tests for plone.stringinterp ####
#### Finished tests for plone.stringinterp ####

#### Running tests for plonetheme.classic ####
#### Finished tests for plonetheme.classic ####

#### Running tests for plonetheme.sunburst ####
#### Finished tests for plonetheme.sunburst ####

#### Running tests for wicked ####
#### Finished tests for wicked ####

Packages with test failures:

Failing tests in group Plone

Total time elapsed: 888.010 seconds

Grand total: 91 packages, 1 failures


FAILED (91 packages, 1 failures)




More information about the Testbot mailing list