[Testbot] FAILED (failures=5) : Plone-3.1 Zope-2.10 Python-2.4.4

plone.* Tests plone-tests at epy.co.at
Tue May 27 04:04:43 UTC 2008


plone.* Tests : FAILED (failures=5)
Plone-3.1 Zope-2.10 Python-2.4.4

Running /usr/local/python2.4/bin/python /home/stefan/autotest/temp/python24-zope210/test.py -q -1 --config-file etc/zope.conf --package plone
Installing CMFCore ... done (0.508s)
Installing CMFDefault ... done (0.332s)
Installing CMFCalendar ... done (0.063s)
Installing CMFTopic ... done (0.028s)
Installing DCWorkflow ... done (0.071s)
Installing CMFActionIcons ... done (0.029s)
Installing CMFQuickInstallerTool ... done (0.095s)
Installing CMFFormController ... done (0.620s)
Installing GroupUserFolder ... done (0.596s)
Installing ZCTextIndex ... done (0.090s)
Installing CMFPlone ... done (3.104s)
Installing Archetypes ... done (0.148s)
Installing ATContentTypes ... done (0.056s)
Installing ATReferenceBrowserWidget ... done (0.018s)
Installing CMFDynamicViewFTI ... done (0.016s)
Installing ExternalEditor ... done (0.021s)
Installing ExtendedPathIndex ... done (0.020s)
Installing ResourceRegistries ... done (0.017s)
Installing SecureMailHost ... done (0.019s)
Installing CMFPlacefulWorkflow ... done (0.389s)
Installing PasswordResetTool ... done (0.025s)
Installing PluggableAuthService ... done (0.033s)
Installing PluginRegistry ... done (0.023s)
Installing PlonePAS ... done (0.028s)
Installing kupu ... done (0.367s)
Installing CMFEditions ... done (0.036s)
Installing CMFDiffTool ... done (0.028s)
Installing PloneLanguageTool ... done (0.029s)
/home/stefan/autotest/temp/python24-zope210/lib/python/zope/testing/testrunner.py:1251: DeprecationWarning: Non-ASCII character '\xc3' in file /home/stefan/autotest/temp/python24-zope210-cmf21-plone31/lib/python/plone/app/contentrules/tests/test_configuration.py on line 171, but no encoding declared; see http://www.python.org/peps/pep-0263.html for details
  __import__(name)
Parsing /home/stefan/autotest/temp/python24-zope210-cmf21-plone31/etc/zope.conf
Running unit tests:
/home/stefan/autotest/temp/python24-zope210/lib/python/zope/configuration/fields.py:417: UserWarning: You did not specify an i18n translation domain for the 'title' field in /home/stefan/autotest/temp/python24-zope210-cmf21-plone31/lib/python/kss/core/permission.zcml
  warnings.warn(
  Ran 369 tests with 0 failures and 0 errors in 7.897 seconds.
Running Products.PloneTestCase.layer.ZCML tests:
  Set up Products.PloneTestCase.layer.ZCML in 6.597 seconds.
Installing plone.app.form ... NOT FOUND
Installing plone.portlet.collection ... done (0.037s)
Installing plone.portlet.static ... done (0.033s)
  Ran 36 tests with 0 failures and 0 errors in 0.253 seconds.
Running Products.PloneTestCase.layer.PloneSite tests:
  Set up Products.PloneTestCase.layer.PloneSite in 10.326 seconds.


Failure in test test_notLogged (plone.app.kss.tests.test_kss_attributes.TestForKSSInlineEditing)
Failed doctest test for plone.app.kss.tests.test_kss_attributes.TestForKSSInlineEditing.test_notLogged
  File "/home/stefan/autotest/temp/python24-zope210-cmf21-plone31/lib/python/plone/app/kss/tests/test_kss_attributes.py", line 26, in test_notLogged

----------------------------------------------------------------------
File "/home/stefan/autotest/temp/python24-zope210-cmf21-plone31/lib/python/plone/app/kss/tests/test_kss_attributes.py", line 44, in plone.app.kss.tests.test_kss_attributes.TestForKSSInlineEditing.test_notLogged
Failed example:
    title is not None
Differences (ndiff with -expected +actual):
    - True
    + False
----------------------------------------------------------------------
File "/home/stefan/autotest/temp/python24-zope210-cmf21-plone31/lib/python/plone/app/kss/tests/test_kss_attributes.py", line 50, in plone.app.kss.tests.test_kss_attributes.TestForKSSInlineEditing.test_notLogged
Failed example:
    'kssattr-atfieldname-' in title['class']
Exception raised:
    Traceback (most recent call last):
      File "/home/stefan/autotest/temp/python24-zope210/lib/python/zope/testing/doctest.py", line 1348, in __run
        compileflags, 1) in test.globs
      File "<doctest plone.app.kss.tests.test_kss_attributes.TestForKSSInlineEditing.test_notLogged[8]>", line 1, in ?
        'kssattr-atfieldname-' in title['class']
    TypeError: unsubscriptable object
----------------------------------------------------------------------
File "/home/stefan/autotest/temp/python24-zope210-cmf21-plone31/lib/python/plone/app/kss/tests/test_kss_attributes.py", line 52, in plone.app.kss.tests.test_kss_attributes.TestForKSSInlineEditing.test_notLogged
Failed example:
    'kssattr-templateId-' in title['class']
Exception raised:
    Traceback (most recent call last):
      File "/home/stefan/autotest/temp/python24-zope210/lib/python/zope/testing/doctest.py", line 1348, in __run
        compileflags, 1) in test.globs
      File "<doctest plone.app.kss.tests.test_kss_attributes.TestForKSSInlineEditing.test_notLogged[9]>", line 1, in ?
        'kssattr-templateId-' in title['class']
    TypeError: unsubscriptable object
----------------------------------------------------------------------
File "/home/stefan/autotest/temp/python24-zope210-cmf21-plone31/lib/python/plone/app/kss/tests/test_kss_attributes.py", line 54, in plone.app.kss.tests.test_kss_attributes.TestForKSSInlineEditing.test_notLogged
Failed example:
    'kssattr-macro-' in title['class']
Exception raised:
    Traceback (most recent call last):
      File "/home/stefan/autotest/temp/python24-zope210/lib/python/zope/testing/doctest.py", line 1348, in __run
        compileflags, 1) in test.globs
      File "<doctest plone.app.kss.tests.test_kss_attributes.TestForKSSInlineEditing.test_notLogged[10]>", line 1, in ?
        'kssattr-macro-' in title['class']
    TypeError: unsubscriptable object
----------------------------------------------------------------------
File "/home/stefan/autotest/temp/python24-zope210-cmf21-plone31/lib/python/plone/app/kss/tests/test_kss_attributes.py", line 56, in plone.app.kss.tests.test_kss_attributes.TestForKSSInlineEditing.test_notLogged
Failed example:
    'inlineEditable' in title['class']
Exception raised:
    Traceback (most recent call last):
      File "/home/stefan/autotest/temp/python24-zope210/lib/python/zope/testing/doctest.py", line 1348, in __run
        compileflags, 1) in test.globs
      File "<doctest plone.app.kss.tests.test_kss_attributes.TestForKSSInlineEditing.test_notLogged[11]>", line 1, in ?
        'inlineEditable' in title['class']
    TypeError: unsubscriptable object



Failure in test test_initPortletNode_i18n (plone.app.portlets.tests.test_exportimport.TestImportPortlets)
Traceback (most recent call last):
  File "/home/stefan/autotest/temp/python24-zope210/lib/python/Testing/ZopeTestCase/profiler.py", line 98, in __call__
    testMethod()
  File "/home/stefan/autotest/temp/python24-zope210-cmf21-plone31/lib/python/plone/app/portlets/tests/test_exportimport.py", line 110, in test_initPortletNode_i18n
    "Portlet title should be a Message instance")
  File "/usr/local/python2.4/lib/python2.4/unittest.py", line 309, in failUnless
    if not expr: raise self.failureException, msg
AssertionError: Portlet title should be a Message instance



Failure in test /home/stefan/autotest/temp/python24-zope210-cmf21-plone31/lib/python/plone/app/workflow/tests/onestateworkflow.txt
Failed doctest test for onestateworkflow.txt
  File "/home/stefan/autotest/temp/python24-zope210-cmf21-plone31/lib/python/plone/app/workflow/tests/onestateworkflow.txt", line 0

----------------------------------------------------------------------
File "/home/stefan/autotest/temp/python24-zope210-cmf21-plone31/lib/python/plone/app/workflow/tests/onestateworkflow.txt", line 51, in onestateworkflow.txt
Failed example:
    browser.open('%s' % self.folder.absolute_url())
Exception raised:
    Traceback (most recent call last):
      File "/home/stefan/autotest/temp/python24-zope210/lib/python/zope/testing/doctest.py", line 1348, in __run
        compileflags, 1) in test.globs
      File "<doctest onestateworkflow.txt[14]>", line 1, in ?
        browser.open('%s' % self.folder.absolute_url())
      File "/home/stefan/autotest/temp/python24-zope210/lib/python/zope/testbrowser/browser.py", line 224, in open
        self.mech_browser.open(url, data)
      File "/home/stefan/autotest/temp/python24-zope210/lib/python/mechanize/_mechanize.py", line 177, in open
        return self._mech_open(url, data)
      File "/home/stefan/autotest/temp/python24-zope210/lib/python/mechanize/_mechanize.py", line 202, in _mech_open
        response = UserAgent.open(self, self.request, data)
      File "/home/stefan/autotest/temp/python24-zope210/lib/python/mechanize/_opener.py", line 234, in open
        response = urlopen(self, req, data)
      File "/usr/local/python2.4/lib/python2.4/urllib2.py", line 376, in _open
        '_open', req)
      File "/usr/local/python2.4/lib/python2.4/urllib2.py", line 337, in _call_chain
        result = func(*args)
      File "/home/stefan/autotest/temp/python24-zope210/lib/python/Products/Five/testbrowser.py", line 64, in http_open
        return self.do_open(PublisherConnection, req)
      File "/usr/local/python2.4/lib/python2.4/urllib2.py", line 993, in do_open
        h.request(req.get_method(), req.get_selector(), req.data, headers)
      File "/home/stefan/autotest/temp/python24-zope210/lib/python/zope/testbrowser/testing.py", line 80, in request
        self.response = self.caller(request_string, handle_errors)
      File "/home/stefan/autotest/temp/python24-zope210/lib/python/Testing/ZopeTestCase/functional.py", line 38, in wrapped_func
        return func(*args, **kw)
      File "/home/stefan/autotest/temp/python24-zope210/lib/python/Testing/ZopeTestCase/zopedoctest/functional.py", line 182, in http
        debug=not handle_errors,
      File "/home/stefan/autotest/temp/python24-zope210/lib/python/ZPublisher/Test.py", line 199, in publish_module
        response = publish(request, module_name, after_list, debug=debug)
      File "/home/stefan/autotest/temp/python24-zope210/lib/python/ZPublisher/Publish.py", line 150, in publish
        sys.exc_info()[2],
      File "/home/stefan/autotest/temp/python24-zope210/lib/python/Zope2/App/startup.py", line 221, in zpublisher_exception_hook
        f(client, REQUEST, t, v, traceback, error_log_url=error_log_url)
      File "/home/stefan/autotest/temp/python24-zope210/lib/python/ZPublisher/Publish.py", line 119, in publish
        request, bind=1)
      File "/home/stefan/autotest/temp/python24-zope210/lib/python/ZPublisher/mapply.py", line 88, in mapply
        if debug is not None: return debug(object,args,context)
      File "/home/stefan/autotest/temp/python24-zope210/lib/python/ZPublisher/Publish.py", line 42, in call_object
        result=apply(object,args) # Type s<cr> to step into published object.
      File "/home/stefan/autotest/temp/python24-zope210/lib/python/Shared/DC/Scripts/Bindings.py", line 313, in __call__
        return self._bindAndExec(args, kw, None)
      File "/home/stefan/autotest/temp/python24-zope210/lib/python/Shared/DC/Scripts/Bindings.py", line 350, in _bindAndExec
        return self._exec(bound_data, args, kw)
      File "/home/stefan/autotest/temp/python24-zope210-cmf21-plone31/Products/CMFCore/FSPageTemplate.py", line 216, in _exec
        result = self.pt_render(extra_context=bound_names)
      File "/home/stefan/autotest/temp/python24-zope210-cmf21-plone31/Products/CMFCore/FSPageTemplate.py", line 155, in pt_render
        result = FSPageTemplate.inheritedAttribute('pt_render')(
      File "/home/stefan/autotest/temp/python24-zope210/lib/python/Products/PageTemplates/PageTemplate.py", line 89, in pt_render
        return super(PageTemplate, self).pt_render(c, source=source)
      File "/home/stefan/autotest/temp/python24-zope210/lib/python/zope/pagetemplate/pagetemplate.py", line 117, in pt_render
        strictinsert=0, sourceAnnotations=sourceAnnotations)()
      File "/home/stefan/autotest/temp/python24-zope210/lib/python/zope/tal/talinterpreter.py", line 271, in __call__
        self.interpret(self.program)
      File "/home/stefan/autotest/temp/python24-zope210/lib/python/zope/tal/talinterpreter.py", line 346, in interpret
        handlers[opcode](self, args)
      File "/home/stefan/autotest/temp/python24-zope210/lib/python/zope/tal/talinterpreter.py", line 891, in do_useMacro
        self.interpret(macro)
      File "/home/stefan/autotest/temp/python24-zope210/lib/python/zope/tal/talinterpreter.py", line 346, in interpret
        handlers[opcode](self, args)
      File "/home/stefan/autotest/temp/python24-zope210/lib/python/zope/tal/talinterpreter.py", line 536, in do_optTag_tal
        self.do_optTag(stuff)
      File "/home/stefan/autotest/temp/python24-zope210/lib/python/zope/tal/talinterpreter.py", line 521, in do_optTag
        return self.no_tag(start, program)
      File "/home/stefan/autotest/temp/python24-zope210/lib/python/zope/tal/talinterpreter.py", line 516, in no_tag
        self.interpret(program)
      File "/home/stefan/autotest/temp/python24-zope210/lib/python/zope/tal/talinterpreter.py", line 346, in interpret
        handlers[opcode](self, args)
      File "/home/stefan/autotest/temp/python24-zope210/lib/python/zope/tal/talinterpreter.py", line 957, in do_defineSlot
        self.interpret(block)
      File "/home/stefan/autotest/temp/python24-zope210/lib/python/zope/tal/talinterpreter.py", line 346, in interpret
        handlers[opcode](self, args)
      File "/home/stefan/autotest/temp/python24-zope210/lib/python/zope/tal/talinterpreter.py", line 536, in do_optTag_tal
        self.do_optTag(stuff)
      File "/home/stefan/autotest/temp/python24-zope210/lib/python/zope/tal/talinterpreter.py", line 521, in do_optTag
        return self.no_tag(start, program)
      File "/home/stefan/autotest/temp/python24-zope210/lib/python/zope/tal/talinterpreter.py", line 516, in no_tag
        self.interpret(program)
      File "/home/stefan/autotest/temp/python24-zope210/lib/python/zope/tal/talinterpreter.py", line 346, in interpret
        handlers[opcode](self, args)
      File "/home/stefan/autotest/temp/python24-zope210/lib/python/zope/tal/talinterpreter.py", line 861, in do_defineMacro
        self.interpret(macro)
      File "/home/stefan/autotest/temp/python24-zope210/lib/python/zope/tal/talinterpreter.py", line 346, in interpret
        handlers[opcode](self, args)
      File "/home/stefan/autotest/temp/python24-zope210/lib/python/zope/tal/talinterpreter.py", line 957, in do_defineSlot
        self.interpret(block)
      File "/home/stefan/autotest/temp/python24-zope210/lib/python/zope/tal/talinterpreter.py", line 346, in interpret
        handlers[opcode](self, args)
      File "/home/stefan/autotest/temp/python24-zope210/lib/python/zope/tal/talinterpreter.py", line 536, in do_optTag_tal
        self.do_optTag(stuff)
      File "/home/stefan/autotest/temp/python24-zope210/lib/python/zope/tal/talinterpreter.py", line 521, in do_optTag
        return self.no_tag(start, program)
      File "/home/stefan/autotest/temp/python24-zope210/lib/python/zope/tal/talinterpreter.py", line 516, in no_tag
        self.interpret(program)
      File "/home/stefan/autotest/temp/python24-zope210/lib/python/zope/tal/talinterpreter.py", line 346, in interpret
        handlers[opcode](self, args)
      File "/home/stefan/autotest/temp/python24-zope210/lib/python/zope/tal/talinterpreter.py", line 536, in do_optTag_tal
        self.do_optTag(stuff)
      File "/home/stefan/autotest/temp/python24-zope210/lib/python/zope/tal/talinterpreter.py", line 525, in do_optTag
        self.interpret(program)
      File "/home/stefan/autotest/temp/python24-zope210/lib/python/zope/tal/talinterpreter.py", line 346, in interpret
        handlers[opcode](self, args)
      File "/home/stefan/autotest/temp/python24-zope210/lib/python/zope/tal/talinterpreter.py", line 949, in do_defineSlot
        self.interpret(slot)
      File "/home/stefan/autotest/temp/python24-zope210/lib/python/zope/tal/talinterpreter.py", line 346, in interpret
        handlers[opcode](self, args)
      File "/home/stefan/autotest/temp/python24-zope210/lib/python/zope/tal/talinterpreter.py", line 861, in do_defineMacro
        self.interpret(macro)
      File "/home/stefan/autotest/temp/python24-zope210/lib/python/zope/tal/talinterpreter.py", line 346, in interpret
        handlers[opcode](self, args)
      File "/home/stefan/autotest/temp/python24-zope210/lib/python/zope/tal/talinterpreter.py", line 536, in do_optTag_tal
        self.do_optTag(stuff)
      File "/home/stefan/autotest/temp/python24-zope210/lib/python/zope/tal/talinterpreter.py", line 521, in do_optTag
        return self.no_tag(start, program)
      File "/home/stefan/autotest/temp/python24-zope210/lib/python/zope/tal/talinterpreter.py", line 516, in no_tag
        self.interpret(program)
      File "/home/stefan/autotest/temp/python24-zope210/lib/python/zope/tal/talinterpreter.py", line 346, in interpret
        handlers[opcode](self, args)
      File "/home/stefan/autotest/temp/python24-zope210/lib/python/zope/tal/talinterpreter.py", line 534, in do_optTag_tal
        self.no_tag(stuff[-2], stuff[-1])
      File "/home/stefan/autotest/temp/python24-zope210/lib/python/zope/tal/talinterpreter.py", line 516, in no_tag
        self.interpret(program)
      File "/home/stefan/autotest/temp/python24-zope210/lib/python/zope/tal/talinterpreter.py", line 346, in interpret
        handlers[opcode](self, args)
      File "/home/stefan/autotest/temp/python24-zope210/lib/python/zope/tal/talinterpreter.py", line 745, in do_insertStructure_tal
        structure = self.engine.evaluateStructure(expr)
      File "/home/stefan/autotest/temp/python24-zope210/lib/python/Products/PageTemplates/Expressions.py", line 221, in evaluateStructure
        text = super(ZopeContext, self).evaluateStructure(expr)
      File "/home/stefan/autotest/temp/python24-zope210/lib/python/zope/tales/tales.py", line 696, in evaluate
        return expression(self)
      File "/home/stefan/autotest/temp/python24-zope210/lib/python/Products/Five/browser/providerexpression.py", line 37, in __call__
        return provider.render()
      File "/home/stefan/autotest/temp/python24-zope210-cmf21-plone31/lib/python/plone/app/viewletmanager/manager.py", line 151, in render
        return BaseOrderedViewletManager.render(self)
      File "/home/stefan/autotest/temp/python24-zope210-cmf21-plone31/lib/python/plone/app/viewletmanager/manager.py", line 80, in render
        return u'\n'.join([viewlet.render() for viewlet in self.viewlets])
      File "/home/stefan/autotest/temp/python24-zope210-cmf21-plone31/lib/python/plone/app/layout/viewlets/common.py", line 44, in render
        return self.index()
      File "/home/stefan/autotest/temp/python24-zope210/lib/python/Shared/DC/Scripts/Bindings.py", line 313, in __call__
        return self._bindAndExec(args, kw, None)
      File "/home/stefan/autotest/temp/python24-zope210/lib/python/Shared/DC/Scripts/Bindings.py", line 350, in _bindAndExec
        return self._exec(bound_data, args, kw)
      File "/home/stefan/autotest/temp/python24-zope210/lib/python/Products/PageTemplates/PageTemplateFile.py", line 129, in _exec
        return self.pt_render(extra_context=bound_names)
      File "/home/stefan/autotest/temp/python24-zope210/lib/python/Products/PageTemplates/PageTemplate.py", line 89, in pt_render
        return super(PageTemplate, self).pt_render(c, source=source)
      File "/home/stefan/autotest/temp/python24-zope210/lib/python/zope/pagetemplate/pagetemplate.py", line 117, in pt_render
        strictinsert=0, sourceAnnotations=sourceAnnotations)()
      File "/home/stefan/autotest/temp/python24-zope210/lib/python/zope/tal/talinterpreter.py", line 271, in __call__
        self.interpret(self.program)
      File "/home/stefan/autotest/temp/python24-zope210/lib/python/zope/tal/talinterpreter.py", line 346, in interpret
        handlers[opcode](self, args)
      File "/home/stefan/autotest/temp/python24-zope210/lib/python/zope/tal/talinterpreter.py", line 586, in do_setLocal_tal
        self.engine.setLocal(name, self.engine.evaluateValue(expr))
      File "/home/stefan/autotest/temp/python24-zope210/lib/python/zope/tales/tales.py", line 696, in evaluate
        return expression(self)
      File "/home/stefan/autotest/temp/python24-zope210/lib/python/zope/tales/expressions.py", line 217, in __call__
        return self._eval(econtext)
      File "/home/stefan/autotest/temp/python24-zope210/lib/python/Products/PageTemplates/Expressions.py", line 161, in _eval
        return render(ob, econtext.vars)
      File "/home/stefan/autotest/temp/python24-zope210/lib/python/Products/PageTemplates/Expressions.py", line 123, in render
        ob = ob()
      File "/home/stefan/autotest/temp/python24-zope210-cmf21-plone31/lib/python/plone/memoize/instance.py", line 45, in memogetter
        val=func(*args, **kwargs)
      File "/home/stefan/autotest/temp/python24-zope210-cmf21-plone31/lib/python/plone/app/layout/viewlets/content.py", line 196, in fullHistory
        history=self.workflowHistory() + self.revisionHistory()
      File "/home/stefan/autotest/temp/python24-zope210-cmf21-plone31/lib/python/plone/memoize/instance.py", line 45, in memogetter
        val=func(*args, **kwargs)
      File "/home/stefan/autotest/temp/python24-zope210-cmf21-plone31/lib/python/plone/app/layout/viewlets/content.py", line 175, in revisionHistory
        version_history=rt.getHistory(aq_inner(self.context), countPurged=False);
      File "/home/stefan/autotest/temp/python24-zope210-cmf21-plone31/Products/CMFEditions/CopyModifyMergeRepositoryTool.py", line 386, in getHistory
        self._assertAuthorized(obj, AccessPreviousVersions, 'getHistory')
      File "/home/stefan/autotest/temp/python24-zope210-cmf21-plone31/Products/CMFEditions/CopyModifyMergeRepositoryTool.py", line 408, in _assertAuthorized
        raise Unauthorized(name)
    Unauthorized: <!DOCTYPE html PUBLIC "-//W3C//DTD XHTML 1.0 Transitional//EN" "http://www.w3.org/TR/xhtml1/DTD/xhtml1-transitional.dtd">



    <html xmlns="http://www.w3.org/1999/xhtml" xml:lang="en"
          lang="en">

      
        
        
        
        
        

      

      <head>

        <meta http-equiv="Content-Type"
              content="text/html;charset=utf-8" />

        
          <base href="http://nohost/plone/Members/test_user_1_/" /><!--[if lt IE 7]></base><![endif]-->
        

        <meta name="generator" content="Plone - http://plone.org" />

        <link rel="kss-base-url" href="http://nohost/plone/Members/test_user_1_" />

      
      
        
          <script type="text/javascript"
                  src="http://nohost/plone/portal_javascripts/Plone%20Default/jquery-cachekey3459.js">
          </script>
        
        
      

      
        
          <script type="text/javascript"
                  src="http://nohost/plone/portal_javascripts/Plone%20Default/resourcebase2-dom-fp-cachekey7841.js">
          </script>
        
        
      

      
      
        
        
          <style type="text/css"><!-- @import url(http://nohost/plone/portal_css/Plone%20Default/base-cachekey7899.css); --></style>
        
        
      

      
      <link rel="kinetic-stylesheet" type="text/css"
            href="http://nohost/plone/portal_kss/Plone%20Default/at-cachekey8586.kss" />


    <title>test_user_1_ &mdash; Plone site</title>


        <!-- Internet Explorer CSS Fixes -->
        <!--[if IE]>
            <style type="text/css" media="all">@import url(http://nohost/plone/IEFixes.css);</style>
        <![endif]-->

        
        <link rel="author"
              href="http://nohost/plone/author/portal_owner"
              title="Author information" />



        <link rel="shortcut icon" type="image/x-icon"
              href="http://nohost/plone/favicon.ico" />



        <link rel="home" href="http://nohost/plone"
              title="Front page" />

        <link rel="contents" href="http://nohost/plone/sitemap"
              title="Site Map" />






        <link rel="search"
              href="http://nohost/plone/search_form"
              title="Search this site" />



        <!-- Disable IE6 image toolbar -->
        <meta http-equiv="imagetoolbar" content="no" />
        
        
        

        
        

        
        

        
        

      </head>

      <body class="section-Members template-default_error_message"
            dir="ltr">
        <div id="visual-portal-wrapper">

          <div id="portal-top">
            <div id="portal-header">
    <p class="hiddenStructure">
      <a accesskey="2"
         href="http://nohost/plone/Members/test_user_1_#documentContent">Skip to content.</a> |

      <a accesskey="6"
         href="http://nohost/plone/Members/test_user_1_#portlet-navigation-tree">Skip to navigation</a>
    </p>

    <ul id="portal-siteactions">

        <li id="siteaction-sitemap"><a
        href="http://nohost/plone/sitemap" accesskey="3"
        title="Site Map">Site Map</a></li>
        <li id="siteaction-accessibility"><a
        href="http://nohost/plone/accessibility-info"
        accesskey="0" title="Accessibility">Accessibility</a></li>
        <li id="siteaction-contact"><a
        href="http://nohost/plone/contact-info" accesskey="9"
        title="Contact">Contact</a></li>

    </ul>

    <div id="portal-searchbox">
        <form name="searchform"
              action="http://nohost/plone/search">

            <label for="searchGadget" class="hiddenStructure">Search Site</label>

            <div class="LSBox">
            <input name="SearchableText" type="text" size="18"
                   title="Search Site" accesskey="4"
                   class="inputLabel" id="searchGadget" />

            <input class="searchButton" type="submit"
                   value="Search" />
        
            <div class="searchSection">
                <input id="searchbox_currentfolder_only"
                       class="noborder" type="checkbox"
                       name="path"
                       value="/plone/Members/test_user_1_" />
                <label for="searchbox_currentfolder_only"
                       style="cursor: pointer">
                    only in current section
                </label>
            </div>

            <div class="LSResult" id="LSResult" style=""><div class="LSShadow" id="LSShadow"></div></div>
            </div>
        </form>

        <div id="portal-advanced-search" class="hiddenStructure">
            <a href="http://nohost/plone/search_form"
               accesskey="5">
                Advanced Search&hellip;
            </a>
        </div>

    </div>

    <a id="portal-logo" accesskey="1" href="http://nohost/plone">
        <img src="http://nohost/plone/logo.jpg" alt="" title="Plone" height="57" width="252" /></a>


        <h5 class="hiddenStructure">Sections</h5>

        <ul id="portal-globalnav">
            <li id="portaltab-index_html" class="plain">
                <a href="http://nohost/plone" title="">Home</a></li>
            <li id="portaltab-Members" class="selected">
                <a href="http://nohost/plone/Members"
                   title="Container for users' home directories">Users</a></li>
            <li id="portaltab-news" class="plain">
                <a href="http://nohost/plone/news"
                   title="Site News">News</a></li>
            <li id="portaltab-events" class="plain">
                <a href="http://nohost/plone/events"
                   title="Site Events">Events</a></li>
        </ul>

    </div>

    <div id="portal-personaltools-wrapper">

    <h5 class="hiddenStructure">Personal tools</h5>

    <ul id="portal-personaltools" class="visualInline">
       

        
            <li>
                <a href="http://nohost/plone/login_form">Log in</a>
            </li>
        

    </ul>
    </div>


        


    <div id="portal-breadcrumbs">

        <span id="breadcrumbs-you-are-here">You
    are here:</span>
        <a href="http://nohost/plone">Home</a>
        <span class="breadcrumbSeparator">
            &rarr;
            
        </span>
        <span dir="ltr">
            
                <a href="http://nohost/plone/Members">Users</a>
                <span class="breadcrumbSeparator">
                    &rarr;
                    
                </span>
                
             
        </span>
        <span dir="ltr">
            
                
                
                <span>test_user_1_</span>
             
        </span>

    </div>

          </div>

          <div class="visualClear" id="clear-space-before-wrapper-table"><!-- --></div>

          <table id="portal-columns">
            <tbody>
              <tr>
                
                
                

                
                <td id="portal-column-content">

                  
                    <div class="">

                      


                      <div id="region-content" class="documentContent">

                        <span id="contentTopLeft"></span>
                        <span id="contentTopRight"></span>
                        
                        <a name="documentContent"></a>

                        

        <dl class="portalMessage info" id="kssPortalMessage" style="display:none">
            <dt>Info</dt>
            <dd></dd>
        </dl>


                        
                        <div id="viewlet-above-content"></div>

                        
                        
                        <div id="content">
                          
                          <div>

            

            <div>

                <h1 class="documentFirstHeading">
                    We're sorry, but there seems to be an error&hellip;
                </h1>

                
                    <p>
                    The error has been logged as entry number 
                    <code>1211858408.960.710677445077</code>.
                    </p>
                    
                    <p>
                    If you need to report this to the 
                    <span> <a href="http://nohost/plone/contact-info">site administration</a></span>,
                    please include this entry number in your message.
                    </p>
                
                    

                

                

            </div>
            

    </div>
                        </div>
                        

                        
                        
                          
        




                        
                        

                        <span id="contentBottomLeft"></span>
                        <span id="contentBottomRight"></span>

                      </div>

                    </div>

                  
                </td>
                

                
                
                
              </tr>
            </tbody>
          </table>
          

          <div class="visualClear" id="clear-space-before-footer"><!-- --></div>
          
          

          

            <div id="portal-footer">

    <p>
        
        The
        <a href="http://plone.org">Plone<sup>&reg;</sup> CMS &mdash; Open Source Content Management System</a>
        is
        <acronym title="Copyright">&copy;</acronym>
        2000-2008
        by the
        <a href="http://plone.org/foundation">Plone Foundation</a>
        et al.
        
    </p>

    <p>
        
        Plone<sup>&reg;</sup> and the Plone logo are registered trademarks of the
            <a href="http://plone.org/foundation">Plone Foundation</a>.
        

        
        Distributed under the
            <a href="http://creativecommons.org/licenses/GPL/2.0/">GNU GPL license</a>.
        
    </p>

    </div>

      <div id="portal-colophon">
          

          

          <div class="colophonWrapper">
          <ul>
            <li>
              <a href="http://plone.org"
                 title="This site was built using Plone CMS, the Open Source Content Management System. Click for more information.">
                Powered by Plone</a>
            </li>
            <li>
              <a href="http://validator.w3.org/check/referer"
                 title="This site is valid XHTML.">
                Valid XHTML</a>
            </li>
            <li>
              <a href="http://jigsaw.w3.org/css-validator/check/referer&amp;warning=no&amp;profile=css3&amp;usermedium=all"
                 title="This site was built with valid CSS.">
                Valid CSS</a>
            </li>
            <li>
              <a href="http://www.section508.gov"
                 title="This site conforms to the US Government Section 508 Accessibility Guidelines.">
                Section 508</a>
            </li>
            <li>
              <a href="http://www.w3.org/WAI/WCAG1AA-Conformance"
                 title="This site conforms to the W3C-WAI Web Content Accessibility Guidelines.">
                WCAG</a>
            </li>
          </ul>
          </div>

        </div>



          

          <div class="visualClear"><!-- --></div>
        </div>
    <div id="kss-spinner"><img alt=""
                               src="http://nohost/plone/spinner.gif" /></div>
    </body>
    </html>





Failure in test /home/stefan/autotest/temp/python24-zope210-cmf21-plone31/lib/python/plone/app/workflow/tests/sharingpage.txt
Failed doctest test for sharingpage.txt
  File "/home/stefan/autotest/temp/python24-zope210-cmf21-plone31/lib/python/plone/app/workflow/tests/sharingpage.txt", line 0

----------------------------------------------------------------------
File "/home/stefan/autotest/temp/python24-zope210-cmf21-plone31/lib/python/plone/app/workflow/tests/sharingpage.txt", line 24, in sharingpage.txt
Failed example:
    browser.open('%s' % self.folder.absolute_url())
Exception raised:
    Traceback (most recent call last):
      File "/home/stefan/autotest/temp/python24-zope210/lib/python/zope/testing/doctest.py", line 1348, in __run
        compileflags, 1) in test.globs
      File "<doctest sharingpage.txt[6]>", line 1, in ?
        browser.open('%s' % self.folder.absolute_url())
      File "/home/stefan/autotest/temp/python24-zope210/lib/python/zope/testbrowser/browser.py", line 224, in open
        self.mech_browser.open(url, data)
      File "/home/stefan/autotest/temp/python24-zope210/lib/python/mechanize/_mechanize.py", line 177, in open
        return self._mech_open(url, data)
      File "/home/stefan/autotest/temp/python24-zope210/lib/python/mechanize/_mechanize.py", line 202, in _mech_open
        response = UserAgent.open(self, self.request, data)
      File "/home/stefan/autotest/temp/python24-zope210/lib/python/mechanize/_opener.py", line 234, in open
        response = urlopen(self, req, data)
      File "/usr/local/python2.4/lib/python2.4/urllib2.py", line 376, in _open
        '_open', req)
      File "/usr/local/python2.4/lib/python2.4/urllib2.py", line 337, in _call_chain
        result = func(*args)
      File "/home/stefan/autotest/temp/python24-zope210/lib/python/Products/Five/testbrowser.py", line 64, in http_open
        return self.do_open(PublisherConnection, req)
      File "/usr/local/python2.4/lib/python2.4/urllib2.py", line 993, in do_open
        h.request(req.get_method(), req.get_selector(), req.data, headers)
      File "/home/stefan/autotest/temp/python24-zope210/lib/python/zope/testbrowser/testing.py", line 80, in request
        self.response = self.caller(request_string, handle_errors)
      File "/home/stefan/autotest/temp/python24-zope210/lib/python/Testing/ZopeTestCase/functional.py", line 38, in wrapped_func
        return func(*args, **kw)
      File "/home/stefan/autotest/temp/python24-zope210/lib/python/Testing/ZopeTestCase/zopedoctest/functional.py", line 182, in http
        debug=not handle_errors,
      File "/home/stefan/autotest/temp/python24-zope210/lib/python/ZPublisher/Test.py", line 199, in publish_module
        response = publish(request, module_name, after_list, debug=debug)
      File "/home/stefan/autotest/temp/python24-zope210/lib/python/ZPublisher/Publish.py", line 150, in publish
        sys.exc_info()[2],
      File "/home/stefan/autotest/temp/python24-zope210/lib/python/Zope2/App/startup.py", line 221, in zpublisher_exception_hook
        f(client, REQUEST, t, v, traceback, error_log_url=error_log_url)
      File "/home/stefan/autotest/temp/python24-zope210/lib/python/ZPublisher/Publish.py", line 119, in publish
        request, bind=1)
      File "/home/stefan/autotest/temp/python24-zope210/lib/python/ZPublisher/mapply.py", line 88, in mapply
        if debug is not None: return debug(object,args,context)
      File "/home/stefan/autotest/temp/python24-zope210/lib/python/ZPublisher/Publish.py", line 42, in call_object
        result=apply(object,args) # Type s<cr> to step into published object.
      File "/home/stefan/autotest/temp/python24-zope210/lib/python/Shared/DC/Scripts/Bindings.py", line 313, in __call__
        return self._bindAndExec(args, kw, None)
      File "/home/stefan/autotest/temp/python24-zope210/lib/python/Shared/DC/Scripts/Bindings.py", line 350, in _bindAndExec
        return self._exec(bound_data, args, kw)
      File "/home/stefan/autotest/temp/python24-zope210-cmf21-plone31/Products/CMFCore/FSPageTemplate.py", line 216, in _exec
        result = self.pt_render(extra_context=bound_names)
      File "/home/stefan/autotest/temp/python24-zope210-cmf21-plone31/Products/CMFCore/FSPageTemplate.py", line 155, in pt_render
        result = FSPageTemplate.inheritedAttribute('pt_render')(
      File "/home/stefan/autotest/temp/python24-zope210/lib/python/Products/PageTemplates/PageTemplate.py", line 89, in pt_render
        return super(PageTemplate, self).pt_render(c, source=source)
      File "/home/stefan/autotest/temp/python24-zope210/lib/python/zope/pagetemplate/pagetemplate.py", line 117, in pt_render
        strictinsert=0, sourceAnnotations=sourceAnnotations)()
      File "/home/stefan/autotest/temp/python24-zope210/lib/python/zope/tal/talinterpreter.py", line 271, in __call__
        self.interpret(self.program)
      File "/home/stefan/autotest/temp/python24-zope210/lib/python/zope/tal/talinterpreter.py", line 346, in interpret
        handlers[opcode](self, args)
      File "/home/stefan/autotest/temp/python24-zope210/lib/python/zope/tal/talinterpreter.py", line 891, in do_useMacro
        self.interpret(macro)
      File "/home/stefan/autotest/temp/python24-zope210/lib/python/zope/tal/talinterpreter.py", line 346, in interpret
        handlers[opcode](self, args)
      File "/home/stefan/autotest/temp/python24-zope210/lib/python/zope/tal/talinterpreter.py", line 536, in do_optTag_tal
        self.do_optTag(stuff)
      File "/home/stefan/autotest/temp/python24-zope210/lib/python/zope/tal/talinterpreter.py", line 521, in do_optTag
        return self.no_tag(start, program)
      File "/home/stefan/autotest/temp/python24-zope210/lib/python/zope/tal/talinterpreter.py", line 516, in no_tag
        self.interpret(program)
      File "/home/stefan/autotest/temp/python24-zope210/lib/python/zope/tal/talinterpreter.py", line 346, in interpret
        handlers[opcode](self, args)
      File "/home/stefan/autotest/temp/python24-zope210/lib/python/zope/tal/talinterpreter.py", line 957, in do_defineSlot
        self.interpret(block)
      File "/home/stefan/autotest/temp/python24-zope210/lib/python/zope/tal/talinterpreter.py", line 346, in interpret
        handlers[opcode](self, args)
      File "/home/stefan/autotest/temp/python24-zope210/lib/python/zope/tal/talinterpreter.py", line 536, in do_optTag_tal
        self.do_optTag(stuff)
      File "/home/stefan/autotest/temp/python24-zope210/lib/python/zope/tal/talinterpreter.py", line 521, in do_optTag
        return self.no_tag(start, program)
      File "/home/stefan/autotest/temp/python24-zope210/lib/python/zope/tal/talinterpreter.py", line 516, in no_tag
        self.interpret(program)
      File "/home/stefan/autotest/temp/python24-zope210/lib/python/zope/tal/talinterpreter.py", line 346, in interpret
        handlers[opcode](self, args)
      File "/home/stefan/autotest/temp/python24-zope210/lib/python/zope/tal/talinterpreter.py", line 861, in do_defineMacro
        self.interpret(macro)
      File "/home/stefan/autotest/temp/python24-zope210/lib/python/zope/tal/talinterpreter.py", line 346, in interpret
        handlers[opcode](self, args)
      File "/home/stefan/autotest/temp/python24-zope210/lib/python/zope/tal/talinterpreter.py", line 957, in do_defineSlot
        self.interpret(block)
      File "/home/stefan/autotest/temp/python24-zope210/lib/python/zope/tal/talinterpreter.py", line 346, in interpret
        handlers[opcode](self, args)
      File "/home/stefan/autotest/temp/python24-zope210/lib/python/zope/tal/talinterpreter.py", line 536, in do_optTag_tal
        self.do_optTag(stuff)
      File "/home/stefan/autotest/temp/python24-zope210/lib/python/zope/tal/talinterpreter.py", line 521, in do_optTag
        return self.no_tag(start, program)
      File "/home/stefan/autotest/temp/python24-zope210/lib/python/zope/tal/talinterpreter.py", line 516, in no_tag
        self.interpret(program)
      File "/home/stefan/autotest/temp/python24-zope210/lib/python/zope/tal/talinterpreter.py", line 346, in interpret
        handlers[opcode](self, args)
      File "/home/stefan/autotest/temp/python24-zope210/lib/python/zope/tal/talinterpreter.py", line 536, in do_optTag_tal
        self.do_optTag(stuff)
      File "/home/stefan/autotest/temp/python24-zope210/lib/python/zope/tal/talinterpreter.py", line 525, in do_optTag
        self.interpret(program)
      File "/home/stefan/autotest/temp/python24-zope210/lib/python/zope/tal/talinterpreter.py", line 346, in interpret
        handlers[opcode](self, args)
      File "/home/stefan/autotest/temp/python24-zope210/lib/python/zope/tal/talinterpreter.py", line 949, in do_defineSlot
        self.interpret(slot)
      File "/home/stefan/autotest/temp/python24-zope210/lib/python/zope/tal/talinterpreter.py", line 346, in interpret
        handlers[opcode](self, args)
      File "/home/stefan/autotest/temp/python24-zope210/lib/python/zope/tal/talinterpreter.py", line 861, in do_defineMacro
        self.interpret(macro)
      File "/home/stefan/autotest/temp/python24-zope210/lib/python/zope/tal/talinterpreter.py", line 346, in interpret
        handlers[opcode](self, args)
      File "/home/stefan/autotest/temp/python24-zope210/lib/python/zope/tal/talinterpreter.py", line 536, in do_optTag_tal
        self.do_optTag(stuff)
      File "/home/stefan/autotest/temp/python24-zope210/lib/python/zope/tal/talinterpreter.py", line 521, in do_optTag
        return self.no_tag(start, program)
      File "/home/stefan/autotest/temp/python24-zope210/lib/python/zope/tal/talinterpreter.py", line 516, in no_tag
        self.interpret(program)
      File "/home/stefan/autotest/temp/python24-zope210/lib/python/zope/tal/talinterpreter.py", line 346, in interpret
        handlers[opcode](self, args)
      File "/home/stefan/autotest/temp/python24-zope210/lib/python/zope/tal/talinterpreter.py", line 534, in do_optTag_tal
        self.no_tag(stuff[-2], stuff[-1])
      File "/home/stefan/autotest/temp/python24-zope210/lib/python/zope/tal/talinterpreter.py", line 516, in no_tag
        self.interpret(program)
      File "/home/stefan/autotest/temp/python24-zope210/lib/python/zope/tal/talinterpreter.py", line 346, in interpret
        handlers[opcode](self, args)
      File "/home/stefan/autotest/temp/python24-zope210/lib/python/zope/tal/talinterpreter.py", line 745, in do_insertStructure_tal
        structure = self.engine.evaluateStructure(expr)
      File "/home/stefan/autotest/temp/python24-zope210/lib/python/Products/PageTemplates/Expressions.py", line 221, in evaluateStructure
        text = super(ZopeContext, self).evaluateStructure(expr)
      File "/home/stefan/autotest/temp/python24-zope210/lib/python/zope/tales/tales.py", line 696, in evaluate
        return expression(self)
      File "/home/stefan/autotest/temp/python24-zope210/lib/python/Products/Five/browser/providerexpression.py", line 37, in __call__
        return provider.render()
      File "/home/stefan/autotest/temp/python24-zope210-cmf21-plone31/lib/python/plone/app/viewletmanager/manager.py", line 151, in render
        return BaseOrderedViewletManager.render(self)
      File "/home/stefan/autotest/temp/python24-zope210-cmf21-plone31/lib/python/plone/app/viewletmanager/manager.py", line 80, in render
        return u'\n'.join([viewlet.render() for viewlet in self.viewlets])
      File "/home/stefan/autotest/temp/python24-zope210-cmf21-plone31/lib/python/plone/app/layout/viewlets/common.py", line 44, in render
        return self.index()
      File "/home/stefan/autotest/temp/python24-zope210/lib/python/Shared/DC/Scripts/Bindings.py", line 313, in __call__
        return self._bindAndExec(args, kw, None)
      File "/home/stefan/autotest/temp/python24-zope210/lib/python/Shared/DC/Scripts/Bindings.py", line 350, in _bindAndExec
        return self._exec(bound_data, args, kw)
      File "/home/stefan/autotest/temp/python24-zope210/lib/python/Products/PageTemplates/PageTemplateFile.py", line 129, in _exec
        return self.pt_render(extra_context=bound_names)
      File "/home/stefan/autotest/temp/python24-zope210/lib/python/Products/PageTemplates/PageTemplate.py", line 89, in pt_render
        return super(PageTemplate, self).pt_render(c, source=source)
      File "/home/stefan/autotest/temp/python24-zope210/lib/python/zope/pagetemplate/pagetemplate.py", line 117, in pt_render
        strictinsert=0, sourceAnnotations=sourceAnnotations)()
      File "/home/stefan/autotest/temp/python24-zope210/lib/python/zope/tal/talinterpreter.py", line 271, in __call__
        self.interpret(self.program)
      File "/home/stefan/autotest/temp/python24-zope210/lib/python/zope/tal/talinterpreter.py", line 346, in interpret
        handlers[opcode](self, args)
      File "/home/stefan/autotest/temp/python24-zope210/lib/python/zope/tal/talinterpreter.py", line 586, in do_setLocal_tal
        self.engine.setLocal(name, self.engine.evaluateValue(expr))
      File "/home/stefan/autotest/temp/python24-zope210/lib/python/zope/tales/tales.py", line 696, in evaluate
        return expression(self)
      File "/home/stefan/autotest/temp/python24-zope210/lib/python/zope/tales/expressions.py", line 217, in __call__
        return self._eval(econtext)
      File "/home/stefan/autotest/temp/python24-zope210/lib/python/Products/PageTemplates/Expressions.py", line 161, in _eval
        return render(ob, econtext.vars)
      File "/home/stefan/autotest/temp/python24-zope210/lib/python/Products/PageTemplates/Expressions.py", line 123, in render
        ob = ob()
      File "/home/stefan/autotest/temp/python24-zope210-cmf21-plone31/lib/python/plone/memoize/instance.py", line 45, in memogetter
        val=func(*args, **kwargs)
      File "/home/stefan/autotest/temp/python24-zope210-cmf21-plone31/lib/python/plone/app/layout/viewlets/content.py", line 196, in fullHistory
        history=self.workflowHistory() + self.revisionHistory()
      File "/home/stefan/autotest/temp/python24-zope210-cmf21-plone31/lib/python/plone/memoize/instance.py", line 45, in memogetter
        val=func(*args, **kwargs)
      File "/home/stefan/autotest/temp/python24-zope210-cmf21-plone31/lib/python/plone/app/layout/viewlets/content.py", line 175, in revisionHistory
        version_history=rt.getHistory(aq_inner(self.context), countPurged=False);
      File "/home/stefan/autotest/temp/python24-zope210-cmf21-plone31/Products/CMFEditions/CopyModifyMergeRepositoryTool.py", line 386, in getHistory
        self._assertAuthorized(obj, AccessPreviousVersions, 'getHistory')
      File "/home/stefan/autotest/temp/python24-zope210-cmf21-plone31/Products/CMFEditions/CopyModifyMergeRepositoryTool.py", line 408, in _assertAuthorized
        raise Unauthorized(name)
    Unauthorized: <!DOCTYPE html PUBLIC "-//W3C//DTD XHTML 1.0 Transitional//EN" "http://www.w3.org/TR/xhtml1/DTD/xhtml1-transitional.dtd">



    <html xmlns="http://www.w3.org/1999/xhtml" xml:lang="en"
          lang="en">

      
        
        
        
        
        

      

      <head>

        <meta http-equiv="Content-Type"
              content="text/html;charset=utf-8" />

        
          <base href="http://nohost/plone/Members/test_user_1_/" /><!--[if lt IE 7]></base><![endif]-->
        

        <meta name="generator" content="Plone - http://plone.org" />

        <link rel="kss-base-url" href="http://nohost/plone/Members/test_user_1_" />

      
      
        
          <script type="text/javascript"
                  src="http://nohost/plone/portal_javascripts/Plone%20Default/jquery-cachekey3459.js">
          </script>
        
        
      

      
        
          <script type="text/javascript"
                  src="http://nohost/plone/portal_javascripts/Plone%20Default/resourcebase2-dom-fp-cachekey7841.js">
          </script>
        
        
      

      
      
        
        
          <style type="text/css"><!-- @import url(http://nohost/plone/portal_css/Plone%20Default/base-cachekey7899.css); --></style>
        
        
      

      
      <link rel="kinetic-stylesheet" type="text/css"
            href="http://nohost/plone/portal_kss/Plone%20Default/at-cachekey8586.kss" />


    <title>test_user_1_ &mdash; Plone site</title>


        <!-- Internet Explorer CSS Fixes -->
        <!--[if IE]>
            <style type="text/css" media="all">@import url(http://nohost/plone/IEFixes.css);</style>
        <![endif]-->

        
        <link rel="author"
              href="http://nohost/plone/author/portal_owner"
              title="Author information" />



        <link rel="shortcut icon" type="image/x-icon"
              href="http://nohost/plone/favicon.ico" />



        <link rel="home" href="http://nohost/plone"
              title="Front page" />

        <link rel="contents" href="http://nohost/plone/sitemap"
              title="Site Map" />






        <link rel="search"
              href="http://nohost/plone/search_form"
              title="Search this site" />



        <!-- Disable IE6 image toolbar -->
        <meta http-equiv="imagetoolbar" content="no" />
        
        
        

        
        

        
        

        
        

      </head>

      <body class="section-Members template-default_error_message"
            dir="ltr">
        <div id="visual-portal-wrapper">

          <div id="portal-top">
            <div id="portal-header">
    <p class="hiddenStructure">
      <a accesskey="2"
         href="http://nohost/plone/Members/test_user_1_#documentContent">Skip to content.</a> |

      <a accesskey="6"
         href="http://nohost/plone/Members/test_user_1_#portlet-navigation-tree">Skip to navigation</a>
    </p>

    <ul id="portal-siteactions">

        <li id="siteaction-sitemap"><a
        href="http://nohost/plone/sitemap" accesskey="3"
        title="Site Map">Site Map</a></li>
        <li id="siteaction-accessibility"><a
        href="http://nohost/plone/accessibility-info"
        accesskey="0" title="Accessibility">Accessibility</a></li>
        <li id="siteaction-contact"><a
        href="http://nohost/plone/contact-info" accesskey="9"
        title="Contact">Contact</a></li>

    </ul>

    <div id="portal-searchbox">
        <form name="searchform"
              action="http://nohost/plone/search">

            <label for="searchGadget" class="hiddenStructure">Search Site</label>

            <div class="LSBox">
            <input name="SearchableText" type="text" size="18"
                   title="Search Site" accesskey="4"
                   class="inputLabel" id="searchGadget" />

            <input class="searchButton" type="submit"
                   value="Search" />
        
            <div class="searchSection">
                <input id="searchbox_currentfolder_only"
                       class="noborder" type="checkbox"
                       name="path"
                       value="/plone/Members/test_user_1_" />
                <label for="searchbox_currentfolder_only"
                       style="cursor: pointer">
                    only in current section
                </label>
            </div>

            <div class="LSResult" id="LSResult" style=""><div class="LSShadow" id="LSShadow"></div></div>
            </div>
        </form>

        <div id="portal-advanced-search" class="hiddenStructure">
            <a href="http://nohost/plone/search_form"
               accesskey="5">
                Advanced Search&hellip;
            </a>
        </div>

    </div>

    <a id="portal-logo" accesskey="1" href="http://nohost/plone">
        <img src="http://nohost/plone/logo.jpg" alt="" title="Plone" height="57" width="252" /></a>


        <h5 class="hiddenStructure">Sections</h5>

        <ul id="portal-globalnav">
            <li id="portaltab-index_html" class="plain">
                <a href="http://nohost/plone" title="">Home</a></li>
            <li id="portaltab-Members" class="selected">
                <a href="http://nohost/plone/Members"
                   title="Container for users' home directories">Users</a></li>
            <li id="portaltab-news" class="plain">
                <a href="http://nohost/plone/news"
                   title="Site News">News</a></li>
            <li id="portaltab-events" class="plain">
                <a href="http://nohost/plone/events"
                   title="Site Events">Events</a></li>
        </ul>

    </div>

    <div id="portal-personaltools-wrapper">

    <h5 class="hiddenStructure">Personal tools</h5>

    <ul id="portal-personaltools" class="visualInline">
       

        
            <li>
                <a href="http://nohost/plone/login_form">Log in</a>
            </li>
        

    </ul>
    </div>


        


    <div id="portal-breadcrumbs">

        <span id="breadcrumbs-you-are-here">You
    are here:</span>
        <a href="http://nohost/plone">Home</a>
        <span class="breadcrumbSeparator">
            &rarr;
            
        </span>
        <span dir="ltr">
            
                <a href="http://nohost/plone/Members">Users</a>
                <span class="breadcrumbSeparator">
                    &rarr;
                    
                </span>
                
             
        </span>
        <span dir="ltr">
            
                
                
                <span>test_user_1_</span>
             
        </span>

    </div>

          </div>

          <div class="visualClear" id="clear-space-before-wrapper-table"><!-- --></div>

          <table id="portal-columns">
            <tbody>
              <tr>
                
                
                

                
                <td id="portal-column-content">

                  
                    <div class="">

                      


                      <div id="region-content" class="documentContent">

                        <span id="contentTopLeft"></span>
                        <span id="contentTopRight"></span>
                        
                        <a name="documentContent"></a>

                        

        <dl class="portalMessage info" id="kssPortalMessage" style="display:none">
            <dt>Info</dt>
            <dd></dd>
        </dl>


                        
                        <div id="viewlet-above-content"></div>

                        
                        
                        <div id="content">
                          
                          <div>

            

            <div>

                <h1 class="documentFirstHeading">
                    We're sorry, but there seems to be an error&hellip;
                </h1>

                
                    <p>
                    The error has been logged as entry number 
                    <code>1211858414.710.378418077167</code>.
                    </p>
                    
                    <p>
                    If you need to report this to the 
                    <span> <a href="http://nohost/plone/contact-info">site administration</a></span>,
                    please include this entry number in your message.
                    </p>
                
                    

                

                

            </div>
            

    </div>
                        </div>
                        

                        
                        
                          
        




                        
                        

                        <span id="contentBottomLeft"></span>
                        <span id="contentBottomRight"></span>

                      </div>

                    </div>

                  
                </td>
                

                
                
                
              </tr>
            </tbody>
          </table>
          

          <div class="visualClear" id="clear-space-before-footer"><!-- --></div>
          
          

          

            <div id="portal-footer">

    <p>
        
        The
        <a href="http://plone.org">Plone<sup>&reg;</sup> CMS &mdash; Open Source Content Management System</a>
        is
        <acronym title="Copyright">&copy;</acronym>
        2000-2008
        by the
        <a href="http://plone.org/foundation">Plone Foundation</a>
        et al.
        
    </p>

    <p>
        
        Plone<sup>&reg;</sup> and the Plone logo are registered trademarks of the
            <a href="http://plone.org/foundation">Plone Foundation</a>.
        

        
        Distributed under the
            <a href="http://creativecommons.org/licenses/GPL/2.0/">GNU GPL license</a>.
        
    </p>

    </div>

      <div id="portal-colophon">
          

          

          <div class="colophonWrapper">
          <ul>
            <li>
              <a href="http://plone.org"
                 title="This site was built using Plone CMS, the Open Source Content Management System. Click for more information.">
                Powered by Plone</a>
            </li>
            <li>
              <a href="http://validator.w3.org/check/referer"
                 title="This site is valid XHTML.">
                Valid XHTML</a>
            </li>
            <li>
              <a href="http://jigsaw.w3.org/css-validator/check/referer&amp;warning=no&amp;profile=css3&amp;usermedium=all"
                 title="This site was built with valid CSS.">
                Valid CSS</a>
            </li>
            <li>
              <a href="http://www.section508.gov"
                 title="This site conforms to the US Government Section 508 Accessibility Guidelines.">
                Section 508</a>
            </li>
            <li>
              <a href="http://www.w3.org/WAI/WCAG1AA-Conformance"
                 title="This site conforms to the W3C-WAI Web Content Accessibility Guidelines.">
                WCAG</a>
            </li>
          </ul>
          </div>

        </div>



          

          <div class="visualClear"><!-- --></div>
        </div>
    <div id="kss-spinner"><img alt=""
                               src="http://nohost/plone/spinner.gif" /></div>
    </body>
    </html>



/home/stefan/autotest/temp/python24-zope210/lib/python/zope/configuration/fields.py:417: UserWarning: You did not specify an i18n translation domain for the 'description' field in <string>
  warnings.warn(
/home/stefan/autotest/temp/python24-zope210/lib/python/zope/configuration/fields.py:417: UserWarning: You did not specify an i18n translation domain for the 'title' field in <string>
  warnings.warn(
  Ran 749 tests with 4 failures and 0 errors in 256.815 seconds.
Running plone.app.contentrules.tests.test_configuration.TestContentrulesGSLayer tests:
  Set up plone.app.contentrules.tests.test_configuration.TestContentrulesGSLayer in 0.492 seconds.
  Ran 6 tests with 0 failures and 0 errors in 1.502 seconds.
Running plone.app.customerize.tests.layer.PloneCustomerize tests:
  Tear down plone.app.contentrules.tests.test_configuration.TestContentrulesGSLayer in 0.005 seconds.
  Set up plone.app.customerize.tests.layer.PloneCustomerize in 0.000 seconds.
  Ran 11 tests with 0 failures and 0 errors in 6.565 seconds.
Running plone.app.kss.tests.kss_and_plone_layer.KSSAndPloneLayer tests:
  Tear down plone.app.customerize.tests.layer.PloneCustomerize in 0.000 seconds.
  Set up plone.app.kss.tests.kss_and_plone_layer.KSSAndPloneLayer in 0.012 seconds.
  Ran 13 tests with 0 failures and 0 errors in 3.372 seconds.
Running plone.app.linkintegrity.tests.layer.PloneLinkintegrity tests:
  Tear down plone.app.kss.tests.kss_and_plone_layer.KSSAndPloneLayer in 0.000 seconds.
  Set up plone.app.linkintegrity.tests.layer.PloneLinkintegrity in 1.428 seconds.
  Ran 101 tests with 0 failures and 0 errors in 58.728 seconds.
Running plone.app.portlets.tests.test_configuration.TestPortletZCMLLayer tests:
  Tear down plone.app.linkintegrity.tests.layer.PloneLinkintegrity in 0.228 seconds.
  Set up plone.app.portlets.tests.test_configuration.TestPortletZCMLLayer in 0.016 seconds.
  Ran 5 tests with 0 failures and 0 errors in 0.058 seconds.
Running plone.app.portlets.tests.test_configuration.TestPortletGSLayer tests:
  Set up plone.app.portlets.tests.test_configuration.TestPortletGSLayer in 1.570 seconds.


Failure in test testPortletTypeRegistered (plone.app.portlets.tests.test_configuration.TestGenericSetup)
Traceback (most recent call last):
  File "/home/stefan/autotest/temp/python24-zope210/lib/python/Testing/ZopeTestCase/profiler.py", line 98, in __call__
    testMethod()
  File "/home/stefan/autotest/temp/python24-zope210-cmf21-plone31/lib/python/plone/app/portlets/tests/test_configuration.py", line 203, in testPortletTypeRegistered
    "Portlet title should be a Message instance")
  File "/usr/local/python2.4/lib/python2.4/unittest.py", line 309, in failUnless
    if not expr: raise self.failureException, msg
AssertionError: Portlet title should be a Message instance

  Ran 12 tests with 1 failures and 0 errors in 4.660 seconds.
Running plone.app.viewletmanager.tests.test_exportimport.Layer tests:
  Tear down plone.app.portlets.tests.test_configuration.TestPortletGSLayer in 0.000 seconds.
  Tear down plone.app.portlets.tests.test_configuration.TestPortletZCMLLayer in 0.000 seconds.
  Tear down Products.PloneTestCase.layer.PloneSite in 0.747 seconds.
  Tear down Products.PloneTestCase.layer.ZCML in 0.021 seconds.
  Set up plone.app.viewletmanager.tests.test_exportimport.Layer in 0.000 seconds.
Installing plone.app.form ... NOT FOUND
Installing plone.browserlayer ... NOT FOUND
  Ran 15 tests with 0 failures and 0 errors in 0.141 seconds.
Running plone.browserlayer.tests.test_doctest.PloneBrowserLayerLayer tests:
  Tear down plone.app.viewletmanager.tests.test_exportimport.Layer in 0.000 seconds.
  Set up Products.PloneTestCase.layer.ZCML in 4.433 seconds.
  Set up Products.PloneTestCase.layer.PloneSite in 9.819 seconds.
  Set up plone.browserlayer.tests.test_doctest.PloneBrowserLayerLayer in 0.010 seconds.
  Ran 9 tests with 0 failures and 0 errors in 1.405 seconds.
Running plone.theme.tests.test_doctest.PloneThemeLayer tests:
  Tear down plone.browserlayer.tests.test_doctest.PloneBrowserLayerLayer in 0.000 seconds.
  Set up plone.theme.tests.test_doctest.PloneThemeLayer in 0.012 seconds.
  Ran 5 tests with 0 failures and 0 errors in 0.180 seconds.
Tearing down left over layers:
  Tear down plone.theme.tests.test_doctest.PloneThemeLayer in 0.000 seconds.
  Tear down Products.PloneTestCase.layer.PloneSite in 0.713 seconds.
  Tear down Products.PloneTestCase.layer.ZCML in 0.013 seconds.
Total: 1331 tests, 5 failures, 0 errors

FAILED (failures=5)




More information about the Testbot mailing list