[Testbot] FAILED (failures=7) : Plone-trunk Zope-2.11 Python-2.4.4

CMFPlone Tests plone-tests at epy.co.at
Wed May 14 04:04:39 UTC 2008


CMFPlone Tests : FAILED (failures=7)
Plone-trunk Zope-2.11 Python-2.4.4

Running /usr/local/python2.4/bin/python /home/stefan/autotest/temp/python24-zope211/test.py -q -1 --config-file etc/zope.conf --package Products.CMFPlone
Parsing /home/stefan/autotest/temp/python24-zope211-cmf22-plone40/etc/zope.conf
Running unit tests:
  Ran 40 tests with 0 failures and 0 errors in 0.659 seconds.
Running Testing.ZopeTestCase.layer.ZopeLite tests:
  Set up Testing.ZopeTestCase.layer.ZopeLite in 1.622 seconds.
  Ran 130 tests with 0 failures and 0 errors in 1.844 seconds.
Running Products.PloneTestCase.layer.ZCML tests:
  Set up Products.PloneTestCase.layer.ZCML in 8.546 seconds.
  Ran 12 tests with 0 failures and 0 errors in 0.053 seconds.
Running Products.PloneTestCase.layer.PloneSite tests:
  Set up Products.PloneTestCase.layer.PloneSite/home/stefan/autotest/temp/python24-zope211-cmf22-plone40/lib/python/Products/PlonePAS/setuphandlers.py:43: DeprecationWarning: portal_groups.listGroups is deprecated and will be removed in Plone 3.5. Use PAS searchGroups instead
  existing = gtool.listGroupIds()
 in 14.476 seconds.
/home/stefan/autotest/temp/python24-zope211-cmf22-plone40/lib/python/Products/PlonePAS/tools/groupdata.py:249: DeprecationWarning: portal_groups.getGroupMembers is deprecated and will be removed in Plone 3.5. Use PAS to get a group and check its members instead.
  for u_name in gtool.getGroupMembers(self.getId()):


Failure in test testSetSessionCookie (Products.CMFPlone.tests.testCookieAuth.TestCookieAuth)
Traceback (most recent call last):
  File "/usr/local/python2.4/lib/python2.4/unittest.py", line 260, in run
    testMethod()
  File "/home/stefan/autotest/temp/python24-zope211-cmf22-plone40/lib/python/Products/CMFPlone/tests/testCookieAuth.py", line 51, in testSetSessionCookie
    self.assertEqual(response.getStatus(), 200)
  File "/usr/local/python2.4/lib/python2.4/unittest.py", line 333, in failUnlessEqual
    raise self.failureException, \
AssertionError: 500 != 200

/home/stefan/autotest/temp/python24-zope211-cmf22-plone40/lib/python/Products/CMFPlone/MembershipTool.py:201: DeprecationWarning: getUserIds is deprecated. Use the PAS methods instead
  return self.acl_users.getUserIds()


Failure in test testLegacyPortletsConverted (Products.CMFPlone.tests.testMigrations.TestMigrations_v2_5_x)
Traceback (most recent call last):
  File "/usr/local/python2.4/lib/python2.4/unittest.py", line 260, in run
    testMethod()
  File "/home/stefan/autotest/temp/python24-zope211-cmf22-plone40/lib/python/Products/CMFPlone/tests/testMigrations.py", line 603, in testLegacyPortletsConverted
    self.assertEquals(True, portletAssignments.getBlacklistStatus(CONTEXT_PORTLETS))
  File "/usr/local/python2.4/lib/python2.4/unittest.py", line 333, in failUnlessEqual
    raise self.failureException, \
AssertionError: True != None



Failure in test testLegacyPortletsConvertedBadSlots (Products.CMFPlone.tests.testMigrations.TestMigrations_v2_5_x)
Traceback (most recent call last):
  File "/usr/local/python2.4/lib/python2.4/unittest.py", line 260, in run
    testMethod()
  File "/home/stefan/autotest/temp/python24-zope211-cmf22-plone40/lib/python/Products/CMFPlone/tests/testMigrations.py", line 675, in testLegacyPortletsConvertedBadSlots
    self.assertEquals(True, portletAssignments.getBlacklistStatus(CONTEXT_PORTLETS))
  File "/usr/local/python2.4/lib/python2.4/unittest.py", line 333, in failUnlessEqual
    raise self.failureException, \
AssertionError: True != None



Failure in test testLegacyPortletsConvertedNoSlots (Products.CMFPlone.tests.testMigrations.TestMigrations_v2_5_x)
Traceback (most recent call last):
  File "/usr/local/python2.4/lib/python2.4/unittest.py", line 260, in run
    testMethod()
  File "/home/stefan/autotest/temp/python24-zope211-cmf22-plone40/lib/python/Products/CMFPlone/tests/testMigrations.py", line 638, in testLegacyPortletsConvertedNoSlots
    self.assertEquals(True, portletAssignments.getBlacklistStatus(CONTEXT_PORTLETS))
  File "/usr/local/python2.4/lib/python2.4/unittest.py", line 333, in failUnlessEqual
    raise self.failureException, \
AssertionError: True != None



Failure in test testPortletBlockingForMembersFolder (Products.CMFPlone.tests.testPortalCreation.TestPortalCreation)
Traceback (most recent call last):
  File "/usr/local/python2.4/lib/python2.4/unittest.py", line 260, in run
    testMethod()
  File "/home/stefan/autotest/temp/python24-zope211-cmf22-plone40/lib/python/Products/CMFPlone/tests/testPortalCreation.py", line 784, in testPortletBlockingForMembersFolder
    self.assertEquals(True, portletAssignments.getBlacklistStatus(CONTEXT_PORTLETS))
  File "/usr/local/python2.4/lib/python2.4/unittest.py", line 333, in failUnlessEqual
    raise self.failureException, \
AssertionError: True != None



Failure in test /home/stefan/autotest/temp/python24-zope211-cmf22-plone40/lib/python/Products/CMFPlone/tests/AddMoveAndDeleteDocument.txt
Failed doctest test for AddMoveAndDeleteDocument.txt
  File "/home/stefan/autotest/temp/python24-zope211-cmf22-plone40/lib/python/Products/CMFPlone/tests/AddMoveAndDeleteDocument.txt", line 0

----------------------------------------------------------------------
File "/home/stefan/autotest/temp/python24-zope211-cmf22-plone40/lib/python/Products/CMFPlone/tests/AddMoveAndDeleteDocument.txt", line 14, in AddMoveAndDeleteDocument.txt
Failed example:
    browser.getControl('Log in').click()
Exception raised:
    Traceback (most recent call last):
      File "/home/stefan/autotest/temp/python24-zope211/lib/python/zope/testing/doctest.py", line 1356, in __run
        compileflags, 1) in test.globs
      File "<doctest AddMoveAndDeleteDocument.txt[5]>", line 1, in ?
        browser.getControl('Log in').click()
      File "/home/stefan/autotest/temp/python24-zope211/lib/python/zope/testbrowser/browser.py", line 591, in click
        self.browser._clickSubmit(self.mech_form, self.mech_control, (1,1))
      File "/home/stefan/autotest/temp/python24-zope211/lib/python/zope/testbrowser/browser.py", line 380, in _clickSubmit
        self.mech_browser.open(form.click(
      File "/home/stefan/autotest/temp/python24-zope211/lib/python/mechanize/_mechanize.py", line 177, in open
        return self._mech_open(url, data)
      File "/home/stefan/autotest/temp/python24-zope211/lib/python/mechanize/_mechanize.py", line 219, in _mech_open
        raise error
    HTTPError: HTTP Error 500: Internal Server Error



Failure in test /home/stefan/autotest/temp/python24-zope211-cmf22-plone40/lib/python/Products/CMFPlone/tests/LoginAndLogout.txt
Failed doctest test for LoginAndLogout.txt
  File "/home/stefan/autotest/temp/python24-zope211-cmf22-plone40/lib/python/Products/CMFPlone/tests/LoginAndLogout.txt", line 0

----------------------------------------------------------------------
File "/home/stefan/autotest/temp/python24-zope211-cmf22-plone40/lib/python/Products/CMFPlone/tests/LoginAndLogout.txt", line 35, in LoginAndLogout.txt
Failed example:
    browser.getControl('Log in').click()
Exception raised:
    Traceback (most recent call last):
      File "/home/stefan/autotest/temp/python24-zope211/lib/python/zope/testing/doctest.py", line 1356, in __run
        compileflags, 1) in test.globs
      File "<doctest LoginAndLogout.txt[15]>", line 1, in ?
        browser.getControl('Log in').click()
      File "/home/stefan/autotest/temp/python24-zope211/lib/python/zope/testbrowser/browser.py", line 591, in click
        self.browser._clickSubmit(self.mech_form, self.mech_control, (1,1))
      File "/home/stefan/autotest/temp/python24-zope211/lib/python/zope/testbrowser/browser.py", line 380, in _clickSubmit
        self.mech_browser.open(form.click(
      File "/home/stefan/autotest/temp/python24-zope211/lib/python/mechanize/_mechanize.py", line 177, in open
        return self._mech_open(url, data)
      File "/home/stefan/autotest/temp/python24-zope211/lib/python/mechanize/_mechanize.py", line 219, in _mech_open
        raise error
    HTTPError: HTTP Error 500: Internal Server Error

  Ran 1247 tests with 7 failures and 0 errors in 9 minutes 2.325 seconds.
Tearing down left over layers:
  Tear down Products.PloneTestCase.layer.PloneSite in 0.735 seconds.
  Tear down Products.PloneTestCase.layer.ZCML in 0.044 seconds.
  Tear down Testing.ZopeTestCase.layer.ZopeLite in 0.000 seconds.
Total: 1429 tests, 7 failures, 0 errors in 9 minutes 32.027 seconds.

FAILED (failures=7)




More information about the Testbot mailing list