[Testbot] FAILED (failures=1) : ATCT-1.2 Plone-3.1 Zope-2.10 Python-2.4.4

ATContentTypes Tests plone-tests at epy.co.at
Fri May 9 06:43:00 UTC 2008


ATContentTypes Tests : FAILED (failures=1)
ATCT-1.2 Plone-3.1 Zope-2.10 Python-2.4.4

Running /usr/local/python2.4/bin/python /home/stefan/autotest/temp/python24-zope210/test.py -q -1 --config-file etc/zope.conf --package Products.ATContentTypes
Installing CMFCore ... done (0.118s)
Installing CMFDefault ... done (0.047s)
Installing CMFCalendar ... done (0.127s)
Installing CMFTopic ... done (0.064s)
Installing DCWorkflow ... done (0.123s)
Installing CMFActionIcons ... done (0.390s)
Installing CMFQuickInstallerTool ... done (0.161s)
Installing CMFFormController ... done (1.120s)
Installing GroupUserFolder ... done (0.931s)
Installing ZCTextIndex ... done (0.088s)
Installing CMFPlone ... done (5.625s)
Installing Archetypes ... done (0.190s)
Installing ATContentTypes ... done (0.075s)
Installing ATReferenceBrowserWidget ... done (0.027s)
Installing CMFDynamicViewFTI ... done (0.035s)
Installing ExternalEditor ... done (0.051s)
Installing ExtendedPathIndex ... done (0.142s)
Installing ResourceRegistries ... done (0.039s)
Installing SecureMailHost ... done (0.036s)
Installing CMFPlacefulWorkflow ... done (0.720s)
Installing PasswordResetTool ... done (0.056s)
Installing PluggableAuthService ... done (0.090s)
Installing PluginRegistry ... done (0.043s)
Installing PlonePAS ... done (0.029s)
Installing kupu ... done (0.619s)
Installing CMFEditions ... done (0.070s)
Installing CMFDiffTool ... done (0.039s)
Installing PloneLanguageTool ... done (0.045s)
Installing SiteAccess ... done (0.036s)
/home/stefan/autotest/temp/python24-zope210/lib/python/zope/configuration/xmlconfig.py:323: DeprecationWarning: zope.app.annotation has moved to zope.annotation. Import of zope.app.annotation will become unsupported in Zope 3.5
  __import__(arguments[0])
/home/stefan/autotest/temp/python24-zope210-cmf21-plone31/Products/PlonePAS/setuphandlers.py:39: DeprecationWarning: portal_groups.getGroupIds is deprecated and will be removed in Plone 3.5. Use PAS searchGroups instead
  existing = gtool.listGroupIds()
Parsing /home/stefan/autotest/temp/python24-zope210-cmf21-plone31/etc/zope.conf
Running Products.PloneTestCase.layer.PloneSite tests:
  Set up Products.PloneTestCase.layer.ZCML in 23.047 seconds.
  Set up Products.PloneTestCase.layer.PloneSite in 44.860 seconds.


Failure in test test_text_setEmptyText (Products.ATContentTypes.tests.test_atdocument.TestATDocumentFields)
Traceback (most recent call last):
  File "/home/stefan/autotest/temp/python24-zope210/lib/python/Testing/ZopeTestCase/profiler.py", line 98, in __call__
    testMethod()
  File "/home/stefan/autotest/temp/python24-zope210-cmf21-plone31/Products/ATContentTypes/tests/test_atdocument.py", line 254, in test_text_setEmptyText
    self.assertEquals(accessor(), '')
  File "/usr/local/python2.4/lib/python2.4/unittest.py", line 333, in failUnlessEqual
    raise self.failureException, \
AssertionError: '<p>Hello World!</p>' != ''

  Ran 802 tests with 1 failures and 0 errors in 631.110 seconds.
Tearing down left over layers:
  Tear down Products.PloneTestCase.layer.PloneSite in 0.728 seconds.
  Tear down Products.PloneTestCase.layer.ZCML in 0.022 seconds.

FAILED (failures=1)




More information about the Testbot mailing list