[Testbot] FAILED (failures=22) : ATCT-1.2 Plone-3.1 Zope-2.10 Python-2.4.4

ATContentTypes Tests plone-tests at epy.co.at
Thu May 8 06:43:08 UTC 2008


ATContentTypes Tests : FAILED (failures=22)
ATCT-1.2 Plone-3.1 Zope-2.10 Python-2.4.4

Running /usr/local/python2.4/bin/python /home/stefan/autotest/temp/python24-zope210/test.py -q -1 --config-file etc/zope.conf --package Products.ATContentTypes
Installing CMFCore ... done (0.136s)
Installing CMFDefault ... done (0.053s)
Installing CMFCalendar ... done (0.223s)
Installing CMFTopic ... done (0.174s)
Installing DCWorkflow ... done (0.196s)
Installing CMFActionIcons ... done (0.092s)
Installing CMFQuickInstallerTool ... done (0.232s)
Installing CMFFormController ... done (0.894s)
Installing GroupUserFolder ... done (0.820s)
Installing ZCTextIndex ... done (0.085s)
Installing CMFPlone ... done (3.475s)
Installing Archetypes ... done (0.231s)
Installing ATContentTypes ... done (0.074s)
Installing ATReferenceBrowserWidget ... done (0.047s)
Installing CMFDynamicViewFTI ... done (0.038s)
Installing ExternalEditor ... done (0.061s)
Installing ExtendedPathIndex ... done (0.054s)
Installing ResourceRegistries ... done (0.046s)
Installing SecureMailHost ... done (0.039s)
Installing CMFPlacefulWorkflow ... done (0.612s)
Installing PasswordResetTool ... done (0.074s)
Installing PluggableAuthService ... done (0.100s)
Installing PluginRegistry ... done (0.066s)
Installing PlonePAS ... done (0.077s)
Installing kupu ... done (0.544s)
Installing CMFEditions ... done (0.101s)
Installing CMFDiffTool ... done (0.271s)
Installing PloneLanguageTool ... done (0.076s)
Installing SiteAccess ... done (0.036s)
/home/stefan/autotest/temp/python24-zope210/lib/python/zope/configuration/xmlconfig.py:323: DeprecationWarning: zope.app.annotation has moved to zope.annotation. Import of zope.app.annotation will become unsupported in Zope 3.5
  __import__(arguments[0])
/home/stefan/autotest/temp/python24-zope210-cmf21-plone31/Products/PlonePAS/setuphandlers.py:39: DeprecationWarning: portal_groups.getGroupIds is deprecated and will be removed in Plone 3.5. Use PAS searchGroups instead
  existing = gtool.listGroupIds()
Parsing /home/stefan/autotest/temp/python24-zope210-cmf21-plone31/etc/zope.conf
Running Products.PloneTestCase.layer.PloneSite tests:
  Set up Products.PloneTestCase.layer.ZCML in 18.329 seconds.
  Set up Products.PloneTestCase.layer.PloneSite in 26.258 seconds.


Failure in test test_text_setEmptyText (Products.ATContentTypes.tests.test_atdocument.TestATDocumentFields)
Traceback (most recent call last):
  File "/home/stefan/autotest/temp/python24-zope210/lib/python/Testing/ZopeTestCase/profiler.py", line 98, in __call__
    testMethod()
  File "/home/stefan/autotest/temp/python24-zope210-cmf21-plone31/Products/ATContentTypes/tests/test_atdocument.py", line 254, in test_text_setEmptyText
    self.assertEquals(accessor(), '')
  File "/usr/local/python2.4/lib/python2.4/unittest.py", line 333, in failUnlessEqual
    raise self.failureException, \
AssertionError: '<p>Hello World!</p>' != ''



Failure in test test_local_sharing_view (Products.ATContentTypes.tests.test_atdocument.TestATDocumentFunctional)
Traceback (most recent call last):
  File "/home/stefan/autotest/temp/python24-zope210/lib/python/Testing/ZopeTestCase/profiler.py", line 98, in __call__
    testMethod()
  File "/home/stefan/autotest/temp/python24-zope210-cmf21-plone31/Products/ATContentTypes/tests/atctftestcase.py", line 152, in test_local_sharing_view
    self.assertStatusEqual(response.getStatus(), 200) # OK
  File "/home/stefan/autotest/temp/python24-zope210-cmf21-plone31/Products/ATContentTypes/tests/atctftestcase.py", line 83, in assertStatusEqual
    self.failUnlessEqual(a, b, msg)
  File "/usr/local/python2.4/lib/python2.4/unittest.py", line 333, in failUnlessEqual
    raise self.failureException, \
AssertionError: Traceback (innermost last):
  Module ZPublisher.Publish, line 119, in publish
  Module ZPublisher.mapply, line 88, in mapply
  Module ZPublisher.Publish, line 42, in call_object
  Module plone.app.workflow.browser.sharing, line 74, in __call__
  Module Shared.DC.Scripts.Bindings, line 313, in __call__
  Module Shared.DC.Scripts.Bindings, line 350, in _bindAndExec
  Module Products.PageTemplates.PageTemplateFile, line 129, in _exec
  Module Products.PageTemplates.PageTemplate, line 89, in pt_render
  Module zope.pagetemplate.pagetemplate, line 117, in pt_render
  Module zope.tal.talinterpreter, line 271, in __call__
  Module zope.tal.talinterpreter, line 346, in interpret
  Module zope.tal.talinterpreter, line 891, in do_useMacro
  Module zope.tal.talinterpreter, line 346, in interpret
  Module zope.tal.talinterpreter, line 536, in do_optTag_tal
  Module zope.tal.talinterpreter, line 521, in do_optTag
  Module zope.tal.talinterpreter, line 516, in no_tag
  Module zope.tal.talinterpreter, line 346, in interpret
  Module zope.tal.talinterpreter, line 891, in do_useMacro
  Module zope.tal.talinterpreter, line 346, in interpret
  Module zope.tal.talinterpreter, line 536, in do_optTag_tal
  Module zope.tal.talinterpreter, line 521, in do_optTag
  Module zope.tal.talinterpreter, line 516, in no_tag
  Module zope.tal.talinterpreter, line 346, in interpret
  Module zope.tal.talinterpreter, line 957, in do_defineSlot
  Module zope.tal.talinterpreter, line 346, in interpret
  Module zope.tal.talinterpreter, line 536, in do_optTag_tal
  Module zope.tal.talinterpreter, line 521, in do_optTag
  Module zope.tal.talinterpreter, line 516, in no_tag
  Module zope.tal.talinterpreter, line 346, in interpret
  Module zope.tal.talinterpreter, line 861, in do_defineMacro
  Module zope.tal.talinterpreter, line 346, in interpret
  Module zope.tal.talinterpreter, line 949, in do_defineSlot
  Module zope.tal.talinterpreter, line 346, in interpret
  Module zope.tal.talinterpreter, line 536, in do_optTag_tal
  Module zope.tal.talinterpreter, line 521, in do_optTag
  Module zope.tal.talinterpreter, line 516, in no_tag
  Module zope.tal.talinterpreter, line 346, in interpret
  Module zope.tal.talinterpreter, line 949, in do_defineSlot
  Module zope.tal.talinterpreter, line 346, in interpret
  Module zope.tal.talinterpreter, line 534, in do_optTag_tal
  Module zope.tal.talinterpreter, line 516, in no_tag
  Module zope.tal.talinterpreter, line 346, in interpret
  Module zope.tal.talinterpreter, line 745, in do_insertStructure_tal
  Module Products.PageTemplates.Expressions, line 221, in evaluateStructure
  Module zope.tales.tales, line 696, in evaluate
   - URL: sharing
   - Line 153, Column 4
   - Expression: <PathExpr standard:'context/@@authenticator/authenticator'>
   - Names:
      {'container': <ATDocument at /plone/Members/test_user_1_/test_object>,
       'context': <ATDocument at /plone/Members/test_user_1_/test_object>,
       'default': <object object at 0x402be560>,
       'here': <ATDocument at /plone/Members/test_user_1_/test_object>,
       'loop': {},
       'nothing': None,
       'options': {'args': ()},
       'repeat': <Products.PageTemplates.Expressions.SafeMapping object at 0x437d0e4c>,
       'request': <HTTPRequest, URL=http://nohost/plone/Members/test_user_1_/test_object/@@sharing>,
       'root': <Application at >,
       'template': <ImplicitAcquirerWrapper object at 0x437e1c0c>,
       'traverse_subpath': [],
       'user': <PloneUser 'test_user_1_'>,
       'view': <Products.Five.metaclass.SharingView object at 0x436f50ac>,
       'views': <zope.app.pagetemplate.viewpagetemplatefile.ViewMapper object at 0x42b6490c>}
  Module zope.tales.expressions, line 217, in __call__
  Module Products.PageTemplates.Expressions, line 161, in _eval
  Module Products.PageTemplates.Expressions, line 123, in render
  Module plone.protect.authenticator, line 45, in authenticator
  Module zope.component._api, line 207, in getUtility
ComponentLookupError: (<InterfaceClass plone.keyring.interfaces.IKeyManager>, '')




Failure in test test_workflow_view (Products.ATContentTypes.tests.test_atdocument.TestATDocumentFunctional)
Traceback (most recent call last):
  File "/home/stefan/autotest/temp/python24-zope210/lib/python/Testing/ZopeTestCase/profiler.py", line 98, in __call__
    testMethod()
  File "/home/stefan/autotest/temp/python24-zope210-cmf21-plone31/Products/ATContentTypes/tests/atctftestcase.py", line 157, in test_workflow_view
    self.assertStatusEqual(response.getStatus(), 200) # OK
  File "/home/stefan/autotest/temp/python24-zope210-cmf21-plone31/Products/ATContentTypes/tests/atctftestcase.py", line 83, in assertStatusEqual
    self.failUnlessEqual(a, b, msg)
  File "/usr/local/python2.4/lib/python2.4/unittest.py", line 333, in failUnlessEqual
    raise self.failureException, \
AssertionError: Traceback (innermost last):
  Module ZPublisher.Publish, line 119, in publish
  Module ZPublisher.mapply, line 88, in mapply
  Module ZPublisher.Publish, line 42, in call_object
  Module Products.CMFFormController.FSControllerPageTemplate, line 90, in __call__
  Module Products.CMFFormController.BaseControllerPageTemplate, line 31, in _call
  Module Shared.DC.Scripts.Bindings, line 313, in __call__
  Module Shared.DC.Scripts.Bindings, line 350, in _bindAndExec
  Module Products.CMFCore.FSPageTemplate, line 216, in _exec
  Module Products.CMFCore.FSPageTemplate, line 155, in pt_render
  Module Products.PageTemplates.PageTemplate, line 89, in pt_render
  Module zope.pagetemplate.pagetemplate, line 117, in pt_render
  Module zope.tal.talinterpreter, line 271, in __call__
  Module zope.tal.talinterpreter, line 346, in interpret
  Module zope.tal.talinterpreter, line 891, in do_useMacro
  Module zope.tal.talinterpreter, line 346, in interpret
  Module zope.tal.talinterpreter, line 536, in do_optTag_tal
  Module zope.tal.talinterpreter, line 521, in do_optTag
  Module zope.tal.talinterpreter, line 516, in no_tag
  Module zope.tal.talinterpreter, line 346, in interpret
  Module zope.tal.talinterpreter, line 957, in do_defineSlot
  Module zope.tal.talinterpreter, line 346, in interpret
  Module zope.tal.talinterpreter, line 536, in do_optTag_tal
  Module zope.tal.talinterpreter, line 521, in do_optTag
  Module zope.tal.talinterpreter, line 516, in no_tag
  Module zope.tal.talinterpreter, line 346, in interpret
  Module zope.tal.talinterpreter, line 861, in do_defineMacro
  Module zope.tal.talinterpreter, line 346, in interpret
  Module zope.tal.talinterpreter, line 957, in do_defineSlot
  Module zope.tal.talinterpreter, line 346, in interpret
  Module zope.tal.talinterpreter, line 536, in do_optTag_tal
  Module zope.tal.talinterpreter, line 521, in do_optTag
  Module zope.tal.talinterpreter, line 516, in no_tag
  Module zope.tal.talinterpreter, line 346, in interpret
  Module zope.tal.talinterpreter, line 534, in do_optTag_tal
  Module zope.tal.talinterpreter, line 516, in no_tag
  Module zope.tal.talinterpreter, line 346, in interpret
  Module zope.tal.talinterpreter, line 949, in do_defineSlot
  Module zope.tal.talinterpreter, line 346, in interpret
  Module zope.tal.talinterpreter, line 855, in do_condition
  Module zope.tal.talinterpreter, line 346, in interpret
  Module zope.tal.talinterpreter, line 534, in do_optTag_tal
  Module zope.tal.talinterpreter, line 516, in no_tag
  Module zope.tal.talinterpreter, line 346, in interpret
  Module zope.tal.talinterpreter, line 745, in do_insertStructure_tal
  Module Products.PageTemplates.Expressions, line 221, in evaluateStructure
  Module zope.tales.tales, line 696, in evaluate
   - URL: file:/home/stefan/autotest/temp/python24-zope210-cmf21-plone31/Products/CMFPlone/skins/plone_forms/content_status_history.cpt
   - Line 257, Column 10
   - Expression: <PathExpr standard:u'context/@@authenticator/authenticator'>
   - Names:
      {'container': <PloneSite at /plone>,
       'context': <ATDocument at /plone/Members/test_user_1_/test_object>,
       'default': <object object at 0x402be560>,
       'here': <ATDocument at /plone/Members/test_user_1_/test_object>,
       'loop': {},
       'nothing': None,
       'options': {'args': (),
                   'state': <Products.CMFFormController.ControllerState.ControllerState object at 0x437bd24c>},
       'repeat': <Products.PageTemplates.Expressions.SafeMapping object at 0x42bb0c0c>,
       'request': <HTTPRequest, URL=http://nohost/plone/Members/test_user_1_/test_object/content_status_history>,
       'root': <Application at >,
       'template': <FSControllerPageTemplate at /plone/content_status_history used for /plone/Members/test_user_1_/test_object>,
       'traverse_subpath': [],
       'user': <PloneUser 'test_user_1_'>}
  Module zope.tales.expressions, line 217, in __call__
  Module Products.PageTemplates.Expressions, line 161, in _eval
  Module Products.PageTemplates.Expressions, line 123, in render
  Module plone.protect.authenticator, line 45, in authenticator
  Module zope.component._api, line 207, in getUtility
ComponentLookupError: (<InterfaceClass plone.keyring.interfaces.IKeyManager>, '')




Failure in test test_local_sharing_view (Products.ATContentTypes.tests.test_atevent.TestATEventFunctional)
Traceback (most recent call last):
  File "/home/stefan/autotest/temp/python24-zope210/lib/python/Testing/ZopeTestCase/profiler.py", line 98, in __call__
    testMethod()
  File "/home/stefan/autotest/temp/python24-zope210-cmf21-plone31/Products/ATContentTypes/tests/atctftestcase.py", line 152, in test_local_sharing_view
    self.assertStatusEqual(response.getStatus(), 200) # OK
  File "/home/stefan/autotest/temp/python24-zope210-cmf21-plone31/Products/ATContentTypes/tests/atctftestcase.py", line 83, in assertStatusEqual
    self.failUnlessEqual(a, b, msg)
  File "/usr/local/python2.4/lib/python2.4/unittest.py", line 333, in failUnlessEqual
    raise self.failureException, \
AssertionError: Traceback (innermost last):
  Module ZPublisher.Publish, line 119, in publish
  Module ZPublisher.mapply, line 88, in mapply
  Module ZPublisher.Publish, line 42, in call_object
  Module plone.app.workflow.browser.sharing, line 74, in __call__
  Module Shared.DC.Scripts.Bindings, line 313, in __call__
  Module Shared.DC.Scripts.Bindings, line 350, in _bindAndExec
  Module Products.PageTemplates.PageTemplateFile, line 129, in _exec
  Module Products.PageTemplates.PageTemplate, line 89, in pt_render
  Module zope.pagetemplate.pagetemplate, line 117, in pt_render
  Module zope.tal.talinterpreter, line 271, in __call__
  Module zope.tal.talinterpreter, line 346, in interpret
  Module zope.tal.talinterpreter, line 891, in do_useMacro
  Module zope.tal.talinterpreter, line 346, in interpret
  Module zope.tal.talinterpreter, line 536, in do_optTag_tal
  Module zope.tal.talinterpreter, line 521, in do_optTag
  Module zope.tal.talinterpreter, line 516, in no_tag
  Module zope.tal.talinterpreter, line 346, in interpret
  Module zope.tal.talinterpreter, line 891, in do_useMacro
  Module zope.tal.talinterpreter, line 346, in interpret
  Module zope.tal.talinterpreter, line 536, in do_optTag_tal
  Module zope.tal.talinterpreter, line 521, in do_optTag
  Module zope.tal.talinterpreter, line 516, in no_tag
  Module zope.tal.talinterpreter, line 346, in interpret
  Module zope.tal.talinterpreter, line 957, in do_defineSlot
  Module zope.tal.talinterpreter, line 346, in interpret
  Module zope.tal.talinterpreter, line 536, in do_optTag_tal
  Module zope.tal.talinterpreter, line 521, in do_optTag
  Module zope.tal.talinterpreter, line 516, in no_tag
  Module zope.tal.talinterpreter, line 346, in interpret
  Module zope.tal.talinterpreter, line 861, in do_defineMacro
  Module zope.tal.talinterpreter, line 346, in interpret
  Module zope.tal.talinterpreter, line 949, in do_defineSlot
  Module zope.tal.talinterpreter, line 346, in interpret
  Module zope.tal.talinterpreter, line 536, in do_optTag_tal
  Module zope.tal.talinterpreter, line 521, in do_optTag
  Module zope.tal.talinterpreter, line 516, in no_tag
  Module zope.tal.talinterpreter, line 346, in interpret
  Module zope.tal.talinterpreter, line 949, in do_defineSlot
  Module zope.tal.talinterpreter, line 346, in interpret
  Module zope.tal.talinterpreter, line 534, in do_optTag_tal
  Module zope.tal.talinterpreter, line 516, in no_tag
  Module zope.tal.talinterpreter, line 346, in interpret
  Module zope.tal.talinterpreter, line 745, in do_insertStructure_tal
  Module Products.PageTemplates.Expressions, line 221, in evaluateStructure
  Module zope.tales.tales, line 696, in evaluate
   - URL: sharing
   - Line 153, Column 4
   - Expression: <PathExpr standard:'context/@@authenticator/authenticator'>
   - Names:
      {'container': <ATEvent at /plone/Members/test_user_1_/test_object>,
       'context': <ATEvent at /plone/Members/test_user_1_/test_object>,
       'default': <object object at 0x402be560>,
       'here': <ATEvent at /plone/Members/test_user_1_/test_object>,
       'loop': {},
       'nothing': None,
       'options': {'args': ()},
       'repeat': <Products.PageTemplates.Expressions.SafeMapping object at 0x431bd50c>,
       'request': <HTTPRequest, URL=http://nohost/plone/Members/test_user_1_/test_object/@@sharing>,
       'root': <Application at >,
       'template': <ImplicitAcquirerWrapper object at 0x431891ac>,
       'traverse_subpath': [],
       'user': <PloneUser 'test_user_1_'>,
       'view': <Products.Five.metaclass.SharingView object at 0x431f378c>,
       'views': <zope.app.pagetemplate.viewpagetemplatefile.ViewMapper object at 0x431e6fec>}
  Module zope.tales.expressions, line 217, in __call__
  Module Products.PageTemplates.Expressions, line 161, in _eval
  Module Products.PageTemplates.Expressions, line 123, in render
  Module plone.protect.authenticator, line 45, in authenticator
  Module zope.component._api, line 207, in getUtility
ComponentLookupError: (<InterfaceClass plone.keyring.interfaces.IKeyManager>, '')




Failure in test test_workflow_view (Products.ATContentTypes.tests.test_atevent.TestATEventFunctional)
Traceback (most recent call last):
  File "/home/stefan/autotest/temp/python24-zope210/lib/python/Testing/ZopeTestCase/profiler.py", line 98, in __call__
    testMethod()
  File "/home/stefan/autotest/temp/python24-zope210-cmf21-plone31/Products/ATContentTypes/tests/atctftestcase.py", line 157, in test_workflow_view
    self.assertStatusEqual(response.getStatus(), 200) # OK
  File "/home/stefan/autotest/temp/python24-zope210-cmf21-plone31/Products/ATContentTypes/tests/atctftestcase.py", line 83, in assertStatusEqual
    self.failUnlessEqual(a, b, msg)
  File "/usr/local/python2.4/lib/python2.4/unittest.py", line 333, in failUnlessEqual
    raise self.failureException, \
AssertionError: Traceback (innermost last):
  Module ZPublisher.Publish, line 119, in publish
  Module ZPublisher.mapply, line 88, in mapply
  Module ZPublisher.Publish, line 42, in call_object
  Module Products.CMFFormController.FSControllerPageTemplate, line 90, in __call__
  Module Products.CMFFormController.BaseControllerPageTemplate, line 31, in _call
  Module Shared.DC.Scripts.Bindings, line 313, in __call__
  Module Shared.DC.Scripts.Bindings, line 350, in _bindAndExec
  Module Products.CMFCore.FSPageTemplate, line 216, in _exec
  Module Products.CMFCore.FSPageTemplate, line 155, in pt_render
  Module Products.PageTemplates.PageTemplate, line 89, in pt_render
  Module zope.pagetemplate.pagetemplate, line 117, in pt_render
  Module zope.tal.talinterpreter, line 271, in __call__
  Module zope.tal.talinterpreter, line 346, in interpret
  Module zope.tal.talinterpreter, line 891, in do_useMacro
  Module zope.tal.talinterpreter, line 346, in interpret
  Module zope.tal.talinterpreter, line 536, in do_optTag_tal
  Module zope.tal.talinterpreter, line 521, in do_optTag
  Module zope.tal.talinterpreter, line 516, in no_tag
  Module zope.tal.talinterpreter, line 346, in interpret
  Module zope.tal.talinterpreter, line 957, in do_defineSlot
  Module zope.tal.talinterpreter, line 346, in interpret
  Module zope.tal.talinterpreter, line 536, in do_optTag_tal
  Module zope.tal.talinterpreter, line 521, in do_optTag
  Module zope.tal.talinterpreter, line 516, in no_tag
  Module zope.tal.talinterpreter, line 346, in interpret
  Module zope.tal.talinterpreter, line 861, in do_defineMacro
  Module zope.tal.talinterpreter, line 346, in interpret
  Module zope.tal.talinterpreter, line 957, in do_defineSlot
  Module zope.tal.talinterpreter, line 346, in interpret
  Module zope.tal.talinterpreter, line 536, in do_optTag_tal
  Module zope.tal.talinterpreter, line 521, in do_optTag
  Module zope.tal.talinterpreter, line 516, in no_tag
  Module zope.tal.talinterpreter, line 346, in interpret
  Module zope.tal.talinterpreter, line 534, in do_optTag_tal
  Module zope.tal.talinterpreter, line 516, in no_tag
  Module zope.tal.talinterpreter, line 346, in interpret
  Module zope.tal.talinterpreter, line 949, in do_defineSlot
  Module zope.tal.talinterpreter, line 346, in interpret
  Module zope.tal.talinterpreter, line 855, in do_condition
  Module zope.tal.talinterpreter, line 346, in interpret
  Module zope.tal.talinterpreter, line 534, in do_optTag_tal
  Module zope.tal.talinterpreter, line 516, in no_tag
  Module zope.tal.talinterpreter, line 346, in interpret
  Module zope.tal.talinterpreter, line 745, in do_insertStructure_tal
  Module Products.PageTemplates.Expressions, line 221, in evaluateStructure
  Module zope.tales.tales, line 696, in evaluate
   - URL: file:/home/stefan/autotest/temp/python24-zope210-cmf21-plone31/Products/CMFPlone/skins/plone_forms/content_status_history.cpt
   - Line 257, Column 10
   - Expression: <PathExpr standard:u'context/@@authenticator/authenticator'>
   - Names:
      {'container': <PloneSite at /plone>,
       'context': <ATEvent at /plone/Members/test_user_1_/test_object>,
       'default': <object object at 0x402be560>,
       'here': <ATEvent at /plone/Members/test_user_1_/test_object>,
       'loop': {},
       'nothing': None,
       'options': {'args': (),
                   'state': <Products.CMFFormController.ControllerState.ControllerState object at 0x4266b2ec>},
       'repeat': <Products.PageTemplates.Expressions.SafeMapping object at 0x431de96c>,
       'request': <HTTPRequest, URL=http://nohost/plone/Members/test_user_1_/test_object/content_status_history>,
       'root': <Application at >,
       'template': <FSControllerPageTemplate at /plone/content_status_history used for /plone/Members/test_user_1_/test_object>,
       'traverse_subpath': [],
       'user': <PloneUser 'test_user_1_'>}
  Module zope.tales.expressions, line 217, in __call__
  Module Products.PageTemplates.Expressions, line 161, in _eval
  Module Products.PageTemplates.Expressions, line 123, in render
  Module plone.protect.authenticator, line 45, in authenticator
  Module zope.component._api, line 207, in getUtility
ComponentLookupError: (<InterfaceClass plone.keyring.interfaces.IKeyManager>, '')




Failure in test test_local_sharing_view (Products.ATContentTypes.tests.test_atfavorite.TestATFavoriteFunctional)
Traceback (most recent call last):
  File "/home/stefan/autotest/temp/python24-zope210/lib/python/Testing/ZopeTestCase/profiler.py", line 98, in __call__
    testMethod()
  File "/home/stefan/autotest/temp/python24-zope210-cmf21-plone31/Products/ATContentTypes/tests/atctftestcase.py", line 152, in test_local_sharing_view
    self.assertStatusEqual(response.getStatus(), 200) # OK
  File "/home/stefan/autotest/temp/python24-zope210-cmf21-plone31/Products/ATContentTypes/tests/atctftestcase.py", line 83, in assertStatusEqual
    self.failUnlessEqual(a, b, msg)
  File "/usr/local/python2.4/lib/python2.4/unittest.py", line 333, in failUnlessEqual
    raise self.failureException, \
AssertionError: Traceback (innermost last):
  Module ZPublisher.Publish, line 119, in publish
  Module ZPublisher.mapply, line 88, in mapply
  Module ZPublisher.Publish, line 42, in call_object
  Module plone.app.workflow.browser.sharing, line 74, in __call__
  Module Shared.DC.Scripts.Bindings, line 313, in __call__
  Module Shared.DC.Scripts.Bindings, line 350, in _bindAndExec
  Module Products.PageTemplates.PageTemplateFile, line 129, in _exec
  Module Products.PageTemplates.PageTemplate, line 89, in pt_render
  Module zope.pagetemplate.pagetemplate, line 117, in pt_render
  Module zope.tal.talinterpreter, line 271, in __call__
  Module zope.tal.talinterpreter, line 346, in interpret
  Module zope.tal.talinterpreter, line 891, in do_useMacro
  Module zope.tal.talinterpreter, line 346, in interpret
  Module zope.tal.talinterpreter, line 536, in do_optTag_tal
  Module zope.tal.talinterpreter, line 521, in do_optTag
  Module zope.tal.talinterpreter, line 516, in no_tag
  Module zope.tal.talinterpreter, line 346, in interpret
  Module zope.tal.talinterpreter, line 891, in do_useMacro
  Module zope.tal.talinterpreter, line 346, in interpret
  Module zope.tal.talinterpreter, line 536, in do_optTag_tal
  Module zope.tal.talinterpreter, line 521, in do_optTag
  Module zope.tal.talinterpreter, line 516, in no_tag
  Module zope.tal.talinterpreter, line 346, in interpret
  Module zope.tal.talinterpreter, line 957, in do_defineSlot
  Module zope.tal.talinterpreter, line 346, in interpret
  Module zope.tal.talinterpreter, line 536, in do_optTag_tal
  Module zope.tal.talinterpreter, line 521, in do_optTag
  Module zope.tal.talinterpreter, line 516, in no_tag
  Module zope.tal.talinterpreter, line 346, in interpret
  Module zope.tal.talinterpreter, line 861, in do_defineMacro
  Module zope.tal.talinterpreter, line 346, in interpret
  Module zope.tal.talinterpreter, line 949, in do_defineSlot
  Module zope.tal.talinterpreter, line 346, in interpret
  Module zope.tal.talinterpreter, line 536, in do_optTag_tal
  Module zope.tal.talinterpreter, line 521, in do_optTag
  Module zope.tal.talinterpreter, line 516, in no_tag
  Module zope.tal.talinterpreter, line 346, in interpret
  Module zope.tal.talinterpreter, line 949, in do_defineSlot
  Module zope.tal.talinterpreter, line 346, in interpret
  Module zope.tal.talinterpreter, line 534, in do_optTag_tal
  Module zope.tal.talinterpreter, line 516, in no_tag
  Module zope.tal.talinterpreter, line 346, in interpret
  Module zope.tal.talinterpreter, line 745, in do_insertStructure_tal
  Module Products.PageTemplates.Expressions, line 221, in evaluateStructure
  Module zope.tales.tales, line 696, in evaluate
   - URL: sharing
   - Line 153, Column 4
   - Expression: <PathExpr standard:'context/@@authenticator/authenticator'>
   - Names:
      {'container': <ATFavorite at /plone/Members/test_user_1_/test_object>,
       'context': <ATFavorite at /plone/Members/test_user_1_/test_object>,
       'default': <object object at 0x402be560>,
       'here': <ATFavorite at /plone/Members/test_user_1_/test_object>,
       'loop': {},
       'nothing': None,
       'options': {'args': ()},
       'repeat': <Products.PageTemplates.Expressions.SafeMapping object at 0x439eebec>,
       'request': <HTTPRequest, URL=http://nohost/plone/Members/test_user_1_/test_object/@@sharing>,
       'root': <Application at >,
       'template': <ImplicitAcquirerWrapper object at 0x43b8a3ac>,
       'traverse_subpath': [],
       'user': <PloneUser 'test_user_1_'>,
       'view': <Products.Five.metaclass.SharingView object at 0x43a8ec6c>,
       'views': <zope.app.pagetemplate.viewpagetemplatefile.ViewMapper object at 0x43a8ecec>}
  Module zope.tales.expressions, line 217, in __call__
  Module Products.PageTemplates.Expressions, line 161, in _eval
  Module Products.PageTemplates.Expressions, line 123, in render
  Module plone.protect.authenticator, line 45, in authenticator
  Module zope.component._api, line 207, in getUtility
ComponentLookupError: (<InterfaceClass plone.keyring.interfaces.IKeyManager>, '')




Failure in test test_workflow_view (Products.ATContentTypes.tests.test_atfavorite.TestATFavoriteFunctional)
Traceback (most recent call last):
  File "/home/stefan/autotest/temp/python24-zope210/lib/python/Testing/ZopeTestCase/profiler.py", line 98, in __call__
    testMethod()
  File "/home/stefan/autotest/temp/python24-zope210-cmf21-plone31/Products/ATContentTypes/tests/atctftestcase.py", line 157, in test_workflow_view
    self.assertStatusEqual(response.getStatus(), 200) # OK
  File "/home/stefan/autotest/temp/python24-zope210-cmf21-plone31/Products/ATContentTypes/tests/atctftestcase.py", line 83, in assertStatusEqual
    self.failUnlessEqual(a, b, msg)
  File "/usr/local/python2.4/lib/python2.4/unittest.py", line 333, in failUnlessEqual
    raise self.failureException, \
AssertionError: Traceback (innermost last):
  Module ZPublisher.Publish, line 119, in publish
  Module ZPublisher.mapply, line 88, in mapply
  Module ZPublisher.Publish, line 42, in call_object
  Module Products.CMFFormController.FSControllerPageTemplate, line 90, in __call__
  Module Products.CMFFormController.BaseControllerPageTemplate, line 31, in _call
  Module Shared.DC.Scripts.Bindings, line 313, in __call__
  Module Shared.DC.Scripts.Bindings, line 350, in _bindAndExec
  Module Products.CMFCore.FSPageTemplate, line 216, in _exec
  Module Products.CMFCore.FSPageTemplate, line 155, in pt_render
  Module Products.PageTemplates.PageTemplate, line 89, in pt_render
  Module zope.pagetemplate.pagetemplate, line 117, in pt_render
  Module zope.tal.talinterpreter, line 271, in __call__
  Module zope.tal.talinterpreter, line 346, in interpret
  Module zope.tal.talinterpreter, line 891, in do_useMacro
  Module zope.tal.talinterpreter, line 346, in interpret
  Module zope.tal.talinterpreter, line 536, in do_optTag_tal
  Module zope.tal.talinterpreter, line 521, in do_optTag
  Module zope.tal.talinterpreter, line 516, in no_tag
  Module zope.tal.talinterpreter, line 346, in interpret
  Module zope.tal.talinterpreter, line 957, in do_defineSlot
  Module zope.tal.talinterpreter, line 346, in interpret
  Module zope.tal.talinterpreter, line 536, in do_optTag_tal
  Module zope.tal.talinterpreter, line 521, in do_optTag
  Module zope.tal.talinterpreter, line 516, in no_tag
  Module zope.tal.talinterpreter, line 346, in interpret
  Module zope.tal.talinterpreter, line 861, in do_defineMacro
  Module zope.tal.talinterpreter, line 346, in interpret
  Module zope.tal.talinterpreter, line 957, in do_defineSlot
  Module zope.tal.talinterpreter, line 346, in interpret
  Module zope.tal.talinterpreter, line 536, in do_optTag_tal
  Module zope.tal.talinterpreter, line 521, in do_optTag
  Module zope.tal.talinterpreter, line 516, in no_tag
  Module zope.tal.talinterpreter, line 346, in interpret
  Module zope.tal.talinterpreter, line 534, in do_optTag_tal
  Module zope.tal.talinterpreter, line 516, in no_tag
  Module zope.tal.talinterpreter, line 346, in interpret
  Module zope.tal.talinterpreter, line 949, in do_defineSlot
  Module zope.tal.talinterpreter, line 346, in interpret
  Module zope.tal.talinterpreter, line 855, in do_condition
  Module zope.tal.talinterpreter, line 346, in interpret
  Module zope.tal.talinterpreter, line 534, in do_optTag_tal
  Module zope.tal.talinterpreter, line 516, in no_tag
  Module zope.tal.talinterpreter, line 346, in interpret
  Module zope.tal.talinterpreter, line 745, in do_insertStructure_tal
  Module Products.PageTemplates.Expressions, line 221, in evaluateStructure
  Module zope.tales.tales, line 696, in evaluate
   - URL: file:/home/stefan/autotest/temp/python24-zope210-cmf21-plone31/Products/CMFPlone/skins/plone_forms/content_status_history.cpt
   - Line 257, Column 10
   - Expression: <PathExpr standard:u'context/@@authenticator/authenticator'>
   - Names:
      {'container': <PloneSite at /plone>,
       'context': <ATFavorite at /plone/Members/test_user_1_/test_object>,
       'default': <object object at 0x402be560>,
       'here': <ATFavorite at /plone/Members/test_user_1_/test_object>,
       'loop': {},
       'nothing': None,
       'options': {'args': (),
                   'state': <Products.CMFFormController.ControllerState.ControllerState object at 0x43414a2c>},
       'repeat': <Products.PageTemplates.Expressions.SafeMapping object at 0x437806ac>,
       'request': <HTTPRequest, URL=http://nohost/plone/Members/test_user_1_/test_object/content_status_history>,
       'root': <Application at >,
       'template': <FSControllerPageTemplate at /plone/content_status_history used for /plone/Members/test_user_1_/test_object>,
       'traverse_subpath': [],
       'user': <PloneUser 'test_user_1_'>}
  Module zope.tales.expressions, line 217, in __call__
  Module Products.PageTemplates.Expressions, line 161, in _eval
  Module Products.PageTemplates.Expressions, line 123, in render
  Module plone.protect.authenticator, line 45, in authenticator
  Module zope.component._api, line 207, in getUtility
ComponentLookupError: (<InterfaceClass plone.keyring.interfaces.IKeyManager>, '')




Failure in test test_local_sharing_view (Products.ATContentTypes.tests.test_atfile.TestATFileFunctional)
Traceback (most recent call last):
  File "/home/stefan/autotest/temp/python24-zope210/lib/python/Testing/ZopeTestCase/profiler.py", line 98, in __call__
    testMethod()
  File "/home/stefan/autotest/temp/python24-zope210-cmf21-plone31/Products/ATContentTypes/tests/atctftestcase.py", line 152, in test_local_sharing_view
    self.assertStatusEqual(response.getStatus(), 200) # OK
  File "/home/stefan/autotest/temp/python24-zope210-cmf21-plone31/Products/ATContentTypes/tests/atctftestcase.py", line 83, in assertStatusEqual
    self.failUnlessEqual(a, b, msg)
  File "/usr/local/python2.4/lib/python2.4/unittest.py", line 333, in failUnlessEqual
    raise self.failureException, \
AssertionError: Traceback (innermost last):
  Module ZPublisher.Publish, line 119, in publish
  Module ZPublisher.mapply, line 88, in mapply
  Module ZPublisher.Publish, line 42, in call_object
  Module plone.app.workflow.browser.sharing, line 74, in __call__
  Module Shared.DC.Scripts.Bindings, line 313, in __call__
  Module Shared.DC.Scripts.Bindings, line 350, in _bindAndExec
  Module Products.PageTemplates.PageTemplateFile, line 129, in _exec
  Module Products.PageTemplates.PageTemplate, line 89, in pt_render
  Module zope.pagetemplate.pagetemplate, line 117, in pt_render
  Module zope.tal.talinterpreter, line 271, in __call__
  Module zope.tal.talinterpreter, line 346, in interpret
  Module zope.tal.talinterpreter, line 891, in do_useMacro
  Module zope.tal.talinterpreter, line 346, in interpret
  Module zope.tal.talinterpreter, line 536, in do_optTag_tal
  Module zope.tal.talinterpreter, line 521, in do_optTag
  Module zope.tal.talinterpreter, line 516, in no_tag
  Module zope.tal.talinterpreter, line 346, in interpret
  Module zope.tal.talinterpreter, line 891, in do_useMacro
  Module zope.tal.talinterpreter, line 346, in interpret
  Module zope.tal.talinterpreter, line 536, in do_optTag_tal
  Module zope.tal.talinterpreter, line 521, in do_optTag
  Module zope.tal.talinterpreter, line 516, in no_tag
  Module zope.tal.talinterpreter, line 346, in interpret
  Module zope.tal.talinterpreter, line 957, in do_defineSlot
  Module zope.tal.talinterpreter, line 346, in interpret
  Module zope.tal.talinterpreter, line 536, in do_optTag_tal
  Module zope.tal.talinterpreter, line 521, in do_optTag
  Module zope.tal.talinterpreter, line 516, in no_tag
  Module zope.tal.talinterpreter, line 346, in interpret
  Module zope.tal.talinterpreter, line 861, in do_defineMacro
  Module zope.tal.talinterpreter, line 346, in interpret
  Module zope.tal.talinterpreter, line 949, in do_defineSlot
  Module zope.tal.talinterpreter, line 346, in interpret
  Module zope.tal.talinterpreter, line 536, in do_optTag_tal
  Module zope.tal.talinterpreter, line 521, in do_optTag
  Module zope.tal.talinterpreter, line 516, in no_tag
  Module zope.tal.talinterpreter, line 346, in interpret
  Module zope.tal.talinterpreter, line 949, in do_defineSlot
  Module zope.tal.talinterpreter, line 346, in interpret
  Module zope.tal.talinterpreter, line 534, in do_optTag_tal
  Module zope.tal.talinterpreter, line 516, in no_tag
  Module zope.tal.talinterpreter, line 346, in interpret
  Module zope.tal.talinterpreter, line 745, in do_insertStructure_tal
  Module Products.PageTemplates.Expressions, line 221, in evaluateStructure
  Module zope.tales.tales, line 696, in evaluate
   - URL: sharing
   - Line 153, Column 4
   - Expression: <PathExpr standard:'context/@@authenticator/authenticator'>
   - Names:
      {'container': <ATFile at /plone/Members/test_user_1_/test_object>,
       'context': <ATFile at /plone/Members/test_user_1_/test_object>,
       'default': <object object at 0x402be560>,
       'here': <ATFile at /plone/Members/test_user_1_/test_object>,
       'loop': {},
       'nothing': None,
       'options': {'args': ()},
       'repeat': <Products.PageTemplates.Expressions.SafeMapping object at 0x4318e90c>,
       'request': <HTTPRequest, URL=http://nohost/plone/Members/test_user_1_/test_object/@@sharing>,
       'root': <Application at >,
       'template': <ImplicitAcquirerWrapper object at 0x4327bfcc>,
       'traverse_subpath': [],
       'user': <PloneUser 'test_user_1_'>,
       'view': <Products.Five.metaclass.SharingView object at 0x435cf2ac>,
       'views': <zope.app.pagetemplate.viewpagetemplatefile.ViewMapper object at 0x4303cb0c>}
  Module zope.tales.expressions, line 217, in __call__
  Module Products.PageTemplates.Expressions, line 161, in _eval
  Module Products.PageTemplates.Expressions, line 123, in render
  Module plone.protect.authenticator, line 45, in authenticator
  Module zope.component._api, line 207, in getUtility
ComponentLookupError: (<InterfaceClass plone.keyring.interfaces.IKeyManager>, '')




Failure in test test_workflow_view (Products.ATContentTypes.tests.test_atfile.TestATFileFunctional)
Traceback (most recent call last):
  File "/home/stefan/autotest/temp/python24-zope210/lib/python/Testing/ZopeTestCase/profiler.py", line 98, in __call__
    testMethod()
  File "/home/stefan/autotest/temp/python24-zope210-cmf21-plone31/Products/ATContentTypes/tests/atctftestcase.py", line 157, in test_workflow_view
    self.assertStatusEqual(response.getStatus(), 200) # OK
  File "/home/stefan/autotest/temp/python24-zope210-cmf21-plone31/Products/ATContentTypes/tests/atctftestcase.py", line 83, in assertStatusEqual
    self.failUnlessEqual(a, b, msg)
  File "/usr/local/python2.4/lib/python2.4/unittest.py", line 333, in failUnlessEqual
    raise self.failureException, \
AssertionError: Traceback (innermost last):
  Module ZPublisher.Publish, line 119, in publish
  Module ZPublisher.mapply, line 88, in mapply
  Module ZPublisher.Publish, line 42, in call_object
  Module Products.CMFFormController.FSControllerPageTemplate, line 90, in __call__
  Module Products.CMFFormController.BaseControllerPageTemplate, line 31, in _call
  Module Shared.DC.Scripts.Bindings, line 313, in __call__
  Module Shared.DC.Scripts.Bindings, line 350, in _bindAndExec
  Module Products.CMFCore.FSPageTemplate, line 216, in _exec
  Module Products.CMFCore.FSPageTemplate, line 155, in pt_render
  Module Products.PageTemplates.PageTemplate, line 89, in pt_render
  Module zope.pagetemplate.pagetemplate, line 117, in pt_render
  Module zope.tal.talinterpreter, line 271, in __call__
  Module zope.tal.talinterpreter, line 346, in interpret
  Module zope.tal.talinterpreter, line 891, in do_useMacro
  Module zope.tal.talinterpreter, line 346, in interpret
  Module zope.tal.talinterpreter, line 536, in do_optTag_tal
  Module zope.tal.talinterpreter, line 521, in do_optTag
  Module zope.tal.talinterpreter, line 516, in no_tag
  Module zope.tal.talinterpreter, line 346, in interpret
  Module zope.tal.talinterpreter, line 957, in do_defineSlot
  Module zope.tal.talinterpreter, line 346, in interpret
  Module zope.tal.talinterpreter, line 536, in do_optTag_tal
  Module zope.tal.talinterpreter, line 521, in do_optTag
  Module zope.tal.talinterpreter, line 516, in no_tag
  Module zope.tal.talinterpreter, line 346, in interpret
  Module zope.tal.talinterpreter, line 861, in do_defineMacro
  Module zope.tal.talinterpreter, line 346, in interpret
  Module zope.tal.talinterpreter, line 957, in do_defineSlot
  Module zope.tal.talinterpreter, line 346, in interpret
  Module zope.tal.talinterpreter, line 536, in do_optTag_tal
  Module zope.tal.talinterpreter, line 521, in do_optTag
  Module zope.tal.talinterpreter, line 516, in no_tag
  Module zope.tal.talinterpreter, line 346, in interpret
  Module zope.tal.talinterpreter, line 534, in do_optTag_tal
  Module zope.tal.talinterpreter, line 516, in no_tag
  Module zope.tal.talinterpreter, line 346, in interpret
  Module zope.tal.talinterpreter, line 949, in do_defineSlot
  Module zope.tal.talinterpreter, line 346, in interpret
  Module zope.tal.talinterpreter, line 855, in do_condition
  Module zope.tal.talinterpreter, line 346, in interpret
  Module zope.tal.talinterpreter, line 534, in do_optTag_tal
  Module zope.tal.talinterpreter, line 516, in no_tag
  Module zope.tal.talinterpreter, line 346, in interpret
  Module zope.tal.talinterpreter, line 745, in do_insertStructure_tal
  Module Products.PageTemplates.Expressions, line 221, in evaluateStructure
  Module zope.tales.tales, line 696, in evaluate
   - URL: file:/home/stefan/autotest/temp/python24-zope210-cmf21-plone31/Products/CMFPlone/skins/plone_forms/content_status_history.cpt
   - Line 257, Column 10
   - Expression: <PathExpr standard:u'context/@@authenticator/authenticator'>
   - Names:
      {'container': <PloneSite at /plone>,
       'context': <ATFile at /plone/Members/test_user_1_/test_object>,
       'default': <object object at 0x402be560>,
       'here': <ATFile at /plone/Members/test_user_1_/test_object>,
       'loop': {},
       'nothing': None,
       'options': {'args': (),
                   'state': <Products.CMFFormController.ControllerState.ControllerState object at 0x437ee28c>},
       'repeat': <Products.PageTemplates.Expressions.SafeMapping object at 0x43501fec>,
       'request': <HTTPRequest, URL=http://nohost/plone/Members/test_user_1_/test_object/content_status_history>,
       'root': <Application at >,
       'template': <FSControllerPageTemplate at /plone/content_status_history used for /plone/Members/test_user_1_/test_object>,
       'traverse_subpath': [],
       'user': <PloneUser 'test_user_1_'>}
  Module zope.tales.expressions, line 217, in __call__
  Module Products.PageTemplates.Expressions, line 161, in _eval
  Module Products.PageTemplates.Expressions, line 123, in render
  Module plone.protect.authenticator, line 45, in authenticator
  Module zope.component._api, line 207, in getUtility
ComponentLookupError: (<InterfaceClass plone.keyring.interfaces.IKeyManager>, '')




Failure in test test_local_sharing_view (Products.ATContentTypes.tests.test_atfolder.TestATFolderFunctional)
Traceback (most recent call last):
  File "/home/stefan/autotest/temp/python24-zope210/lib/python/Testing/ZopeTestCase/profiler.py", line 98, in __call__
    testMethod()
  File "/home/stefan/autotest/temp/python24-zope210-cmf21-plone31/Products/ATContentTypes/tests/atctftestcase.py", line 152, in test_local_sharing_view
    self.assertStatusEqual(response.getStatus(), 200) # OK
  File "/home/stefan/autotest/temp/python24-zope210-cmf21-plone31/Products/ATContentTypes/tests/atctftestcase.py", line 83, in assertStatusEqual
    self.failUnlessEqual(a, b, msg)
  File "/usr/local/python2.4/lib/python2.4/unittest.py", line 333, in failUnlessEqual
    raise self.failureException, \
AssertionError: Traceback (innermost last):
  Module ZPublisher.Publish, line 119, in publish
  Module ZPublisher.mapply, line 88, in mapply
  Module ZPublisher.Publish, line 42, in call_object
  Module plone.app.workflow.browser.sharing, line 74, in __call__
  Module Shared.DC.Scripts.Bindings, line 313, in __call__
  Module Shared.DC.Scripts.Bindings, line 350, in _bindAndExec
  Module Products.PageTemplates.PageTemplateFile, line 129, in _exec
  Module Products.PageTemplates.PageTemplate, line 89, in pt_render
  Module zope.pagetemplate.pagetemplate, line 117, in pt_render
  Module zope.tal.talinterpreter, line 271, in __call__
  Module zope.tal.talinterpreter, line 346, in interpret
  Module zope.tal.talinterpreter, line 891, in do_useMacro
  Module zope.tal.talinterpreter, line 346, in interpret
  Module zope.tal.talinterpreter, line 536, in do_optTag_tal
  Module zope.tal.talinterpreter, line 521, in do_optTag
  Module zope.tal.talinterpreter, line 516, in no_tag
  Module zope.tal.talinterpreter, line 346, in interpret
  Module zope.tal.talinterpreter, line 891, in do_useMacro
  Module zope.tal.talinterpreter, line 346, in interpret
  Module zope.tal.talinterpreter, line 536, in do_optTag_tal
  Module zope.tal.talinterpreter, line 521, in do_optTag
  Module zope.tal.talinterpreter, line 516, in no_tag
  Module zope.tal.talinterpreter, line 346, in interpret
  Module zope.tal.talinterpreter, line 957, in do_defineSlot
  Module zope.tal.talinterpreter, line 346, in interpret
  Module zope.tal.talinterpreter, line 536, in do_optTag_tal
  Module zope.tal.talinterpreter, line 521, in do_optTag
  Module zope.tal.talinterpreter, line 516, in no_tag
  Module zope.tal.talinterpreter, line 346, in interpret
  Module zope.tal.talinterpreter, line 861, in do_defineMacro
  Module zope.tal.talinterpreter, line 346, in interpret
  Module zope.tal.talinterpreter, line 949, in do_defineSlot
  Module zope.tal.talinterpreter, line 346, in interpret
  Module zope.tal.talinterpreter, line 536, in do_optTag_tal
  Module zope.tal.talinterpreter, line 521, in do_optTag
  Module zope.tal.talinterpreter, line 516, in no_tag
  Module zope.tal.talinterpreter, line 346, in interpret
  Module zope.tal.talinterpreter, line 949, in do_defineSlot
  Module zope.tal.talinterpreter, line 346, in interpret
  Module zope.tal.talinterpreter, line 534, in do_optTag_tal
  Module zope.tal.talinterpreter, line 516, in no_tag
  Module zope.tal.talinterpreter, line 346, in interpret
  Module zope.tal.talinterpreter, line 745, in do_insertStructure_tal
  Module Products.PageTemplates.Expressions, line 221, in evaluateStructure
  Module zope.tales.tales, line 696, in evaluate
   - URL: sharing
   - Line 153, Column 4
   - Expression: <PathExpr standard:'context/@@authenticator/authenticator'>
   - Names:
      {'container': <ATFolder at /plone/Members/test_user_1_/test_object>,
       'context': <ATFolder at /plone/Members/test_user_1_/test_object>,
       'default': <object object at 0x402be560>,
       'here': <ATFolder at /plone/Members/test_user_1_/test_object>,
       'loop': {},
       'nothing': None,
       'options': {'args': ()},
       'repeat': <Products.PageTemplates.Expressions.SafeMapping object at 0x439170ac>,
       'request': <HTTPRequest, URL=http://nohost/plone/Members/test_user_1_/test_object/@@sharing>,
       'root': <Application at >,
       'template': <ImplicitAcquirerWrapper object at 0x438964ec>,
       'traverse_subpath': [],
       'user': <PloneUser 'test_user_1_'>,
       'view': <Products.Five.metaclass.SharingView object at 0x437cc8ec>,
       'views': <zope.app.pagetemplate.viewpagetemplatefile.ViewMapper object at 0x43602bac>}
  Module zope.tales.expressions, line 217, in __call__
  Module Products.PageTemplates.Expressions, line 161, in _eval
  Module Products.PageTemplates.Expressions, line 123, in render
  Module plone.protect.authenticator, line 45, in authenticator
  Module zope.component._api, line 207, in getUtility
ComponentLookupError: (<InterfaceClass plone.keyring.interfaces.IKeyManager>, '')




Failure in test test_workflow_view (Products.ATContentTypes.tests.test_atfolder.TestATFolderFunctional)
Traceback (most recent call last):
  File "/home/stefan/autotest/temp/python24-zope210/lib/python/Testing/ZopeTestCase/profiler.py", line 98, in __call__
    testMethod()
  File "/home/stefan/autotest/temp/python24-zope210-cmf21-plone31/Products/ATContentTypes/tests/atctftestcase.py", line 157, in test_workflow_view
    self.assertStatusEqual(response.getStatus(), 200) # OK
  File "/home/stefan/autotest/temp/python24-zope210-cmf21-plone31/Products/ATContentTypes/tests/atctftestcase.py", line 83, in assertStatusEqual
    self.failUnlessEqual(a, b, msg)
  File "/usr/local/python2.4/lib/python2.4/unittest.py", line 333, in failUnlessEqual
    raise self.failureException, \
AssertionError: Traceback (innermost last):
  Module ZPublisher.Publish, line 119, in publish
  Module ZPublisher.mapply, line 88, in mapply
  Module ZPublisher.Publish, line 42, in call_object
  Module Products.CMFFormController.FSControllerPageTemplate, line 90, in __call__
  Module Products.CMFFormController.BaseControllerPageTemplate, line 31, in _call
  Module Shared.DC.Scripts.Bindings, line 313, in __call__
  Module Shared.DC.Scripts.Bindings, line 350, in _bindAndExec
  Module Products.CMFCore.FSPageTemplate, line 216, in _exec
  Module Products.CMFCore.FSPageTemplate, line 155, in pt_render
  Module Products.PageTemplates.PageTemplate, line 89, in pt_render
  Module zope.pagetemplate.pagetemplate, line 117, in pt_render
  Module zope.tal.talinterpreter, line 271, in __call__
  Module zope.tal.talinterpreter, line 346, in interpret
  Module zope.tal.talinterpreter, line 891, in do_useMacro
  Module zope.tal.talinterpreter, line 346, in interpret
  Module zope.tal.talinterpreter, line 536, in do_optTag_tal
  Module zope.tal.talinterpreter, line 521, in do_optTag
  Module zope.tal.talinterpreter, line 516, in no_tag
  Module zope.tal.talinterpreter, line 346, in interpret
  Module zope.tal.talinterpreter, line 957, in do_defineSlot
  Module zope.tal.talinterpreter, line 346, in interpret
  Module zope.tal.talinterpreter, line 536, in do_optTag_tal
  Module zope.tal.talinterpreter, line 521, in do_optTag
  Module zope.tal.talinterpreter, line 516, in no_tag
  Module zope.tal.talinterpreter, line 346, in interpret
  Module zope.tal.talinterpreter, line 861, in do_defineMacro
  Module zope.tal.talinterpreter, line 346, in interpret
  Module zope.tal.talinterpreter, line 957, in do_defineSlot
  Module zope.tal.talinterpreter, line 346, in interpret
  Module zope.tal.talinterpreter, line 536, in do_optTag_tal
  Module zope.tal.talinterpreter, line 521, in do_optTag
  Module zope.tal.talinterpreter, line 516, in no_tag
  Module zope.tal.talinterpreter, line 346, in interpret
  Module zope.tal.talinterpreter, line 534, in do_optTag_tal
  Module zope.tal.talinterpreter, line 516, in no_tag
  Module zope.tal.talinterpreter, line 346, in interpret
  Module zope.tal.talinterpreter, line 949, in do_defineSlot
  Module zope.tal.talinterpreter, line 346, in interpret
  Module zope.tal.talinterpreter, line 855, in do_condition
  Module zope.tal.talinterpreter, line 346, in interpret
  Module zope.tal.talinterpreter, line 534, in do_optTag_tal
  Module zope.tal.talinterpreter, line 516, in no_tag
  Module zope.tal.talinterpreter, line 346, in interpret
  Module zope.tal.talinterpreter, line 745, in do_insertStructure_tal
  Module Products.PageTemplates.Expressions, line 221, in evaluateStructure
  Module zope.tales.tales, line 696, in evaluate
   - URL: file:/home/stefan/autotest/temp/python24-zope210-cmf21-plone31/Products/CMFPlone/skins/plone_forms/content_status_history.cpt
   - Line 257, Column 10
   - Expression: <PathExpr standard:u'context/@@authenticator/authenticator'>
   - Names:
      {'container': <PloneSite at /plone>,
       'context': <ATFolder at /plone/Members/test_user_1_/test_object>,
       'default': <object object at 0x402be560>,
       'here': <ATFolder at /plone/Members/test_user_1_/test_object>,
       'loop': {},
       'nothing': None,
       'options': {'args': (),
                   'state': <Products.CMFFormController.ControllerState.ControllerState object at 0x438d5dec>},
       'repeat': <Products.PageTemplates.Expressions.SafeMapping object at 0x438d566c>,
       'request': <HTTPRequest, URL=http://nohost/plone/Members/test_user_1_/test_object/content_status_history>,
       'root': <Application at >,
       'template': <FSControllerPageTemplate at /plone/content_status_history used for /plone/Members/test_user_1_/test_object>,
       'traverse_subpath': [],
       'user': <PloneUser 'test_user_1_'>}
  Module zope.tales.expressions, line 217, in __call__
  Module Products.PageTemplates.Expressions, line 161, in _eval
  Module Products.PageTemplates.Expressions, line 123, in render
  Module plone.protect.authenticator, line 45, in authenticator
  Module zope.component._api, line 207, in getUtility
ComponentLookupError: (<InterfaceClass plone.keyring.interfaces.IKeyManager>, '')




Failure in test test_local_sharing_view (Products.ATContentTypes.tests.test_atfolder.TestATBTreeFolderFunctional)
Traceback (most recent call last):
  File "/home/stefan/autotest/temp/python24-zope210/lib/python/Testing/ZopeTestCase/profiler.py", line 98, in __call__
    testMethod()
  File "/home/stefan/autotest/temp/python24-zope210-cmf21-plone31/Products/ATContentTypes/tests/atctftestcase.py", line 152, in test_local_sharing_view
    self.assertStatusEqual(response.getStatus(), 200) # OK
  File "/home/stefan/autotest/temp/python24-zope210-cmf21-plone31/Products/ATContentTypes/tests/atctftestcase.py", line 83, in assertStatusEqual
    self.failUnlessEqual(a, b, msg)
  File "/usr/local/python2.4/lib/python2.4/unittest.py", line 333, in failUnlessEqual
    raise self.failureException, \
AssertionError: Traceback (innermost last):
  Module ZPublisher.Publish, line 119, in publish
  Module ZPublisher.mapply, line 88, in mapply
  Module ZPublisher.Publish, line 42, in call_object
  Module plone.app.workflow.browser.sharing, line 74, in __call__
  Module Shared.DC.Scripts.Bindings, line 313, in __call__
  Module Shared.DC.Scripts.Bindings, line 350, in _bindAndExec
  Module Products.PageTemplates.PageTemplateFile, line 129, in _exec
  Module Products.PageTemplates.PageTemplate, line 89, in pt_render
  Module zope.pagetemplate.pagetemplate, line 117, in pt_render
  Module zope.tal.talinterpreter, line 271, in __call__
  Module zope.tal.talinterpreter, line 346, in interpret
  Module zope.tal.talinterpreter, line 891, in do_useMacro
  Module zope.tal.talinterpreter, line 346, in interpret
  Module zope.tal.talinterpreter, line 536, in do_optTag_tal
  Module zope.tal.talinterpreter, line 521, in do_optTag
  Module zope.tal.talinterpreter, line 516, in no_tag
  Module zope.tal.talinterpreter, line 346, in interpret
  Module zope.tal.talinterpreter, line 891, in do_useMacro
  Module zope.tal.talinterpreter, line 346, in interpret
  Module zope.tal.talinterpreter, line 536, in do_optTag_tal
  Module zope.tal.talinterpreter, line 521, in do_optTag
  Module zope.tal.talinterpreter, line 516, in no_tag
  Module zope.tal.talinterpreter, line 346, in interpret
  Module zope.tal.talinterpreter, line 957, in do_defineSlot
  Module zope.tal.talinterpreter, line 346, in interpret
  Module zope.tal.talinterpreter, line 536, in do_optTag_tal
  Module zope.tal.talinterpreter, line 521, in do_optTag
  Module zope.tal.talinterpreter, line 516, in no_tag
  Module zope.tal.talinterpreter, line 346, in interpret
  Module zope.tal.talinterpreter, line 861, in do_defineMacro
  Module zope.tal.talinterpreter, line 346, in interpret
  Module zope.tal.talinterpreter, line 949, in do_defineSlot
  Module zope.tal.talinterpreter, line 346, in interpret
  Module zope.tal.talinterpreter, line 536, in do_optTag_tal
  Module zope.tal.talinterpreter, line 521, in do_optTag
  Module zope.tal.talinterpreter, line 516, in no_tag
  Module zope.tal.talinterpreter, line 346, in interpret
  Module zope.tal.talinterpreter, line 949, in do_defineSlot
  Module zope.tal.talinterpreter, line 346, in interpret
  Module zope.tal.talinterpreter, line 534, in do_optTag_tal
  Module zope.tal.talinterpreter, line 516, in no_tag
  Module zope.tal.talinterpreter, line 346, in interpret
  Module zope.tal.talinterpreter, line 745, in do_insertStructure_tal
  Module Products.PageTemplates.Expressions, line 221, in evaluateStructure
  Module zope.tales.tales, line 696, in evaluate
   - URL: sharing
   - Line 153, Column 4
   - Expression: <PathExpr standard:'context/@@authenticator/authenticator'>
   - Names:
      {'container': <ATBTreeFolder at /plone/Members/test_user_1_/test_object>,
       'context': <ATBTreeFolder at /plone/Members/test_user_1_/test_object>,
       'default': <object object at 0x402be560>,
       'here': <ATBTreeFolder at /plone/Members/test_user_1_/test_object>,
       'loop': {},
       'nothing': None,
       'options': {'args': ()},
       'repeat': <Products.PageTemplates.Expressions.SafeMapping object at 0x432c7e4c>,
       'request': <HTTPRequest, URL=http://nohost/plone/Members/test_user_1_/test_object/@@sharing>,
       'root': <Application at >,
       'template': <ImplicitAcquirerWrapper object at 0x4314bf2c>,
       'traverse_subpath': [],
       'user': <PloneUser 'test_user_1_'>,
       'view': <Products.Five.metaclass.SharingView object at 0x434a1acc>,
       'views': <zope.app.pagetemplate.viewpagetemplatefile.ViewMapper object at 0x433115ec>}
  Module zope.tales.expressions, line 217, in __call__
  Module Products.PageTemplates.Expressions, line 161, in _eval
  Module Products.PageTemplates.Expressions, line 123, in render
  Module plone.protect.authenticator, line 45, in authenticator
  Module zope.component._api, line 207, in getUtility
ComponentLookupError: (<InterfaceClass plone.keyring.interfaces.IKeyManager>, '')




Failure in test test_workflow_view (Products.ATContentTypes.tests.test_atfolder.TestATBTreeFolderFunctional)
Traceback (most recent call last):
  File "/home/stefan/autotest/temp/python24-zope210/lib/python/Testing/ZopeTestCase/profiler.py", line 98, in __call__
    testMethod()
  File "/home/stefan/autotest/temp/python24-zope210-cmf21-plone31/Products/ATContentTypes/tests/atctftestcase.py", line 157, in test_workflow_view
    self.assertStatusEqual(response.getStatus(), 200) # OK
  File "/home/stefan/autotest/temp/python24-zope210-cmf21-plone31/Products/ATContentTypes/tests/atctftestcase.py", line 83, in assertStatusEqual
    self.failUnlessEqual(a, b, msg)
  File "/usr/local/python2.4/lib/python2.4/unittest.py", line 333, in failUnlessEqual
    raise self.failureException, \
AssertionError: Traceback (innermost last):
  Module ZPublisher.Publish, line 119, in publish
  Module ZPublisher.mapply, line 88, in mapply
  Module ZPublisher.Publish, line 42, in call_object
  Module Products.CMFFormController.FSControllerPageTemplate, line 90, in __call__
  Module Products.CMFFormController.BaseControllerPageTemplate, line 31, in _call
  Module Shared.DC.Scripts.Bindings, line 313, in __call__
  Module Shared.DC.Scripts.Bindings, line 350, in _bindAndExec
  Module Products.CMFCore.FSPageTemplate, line 216, in _exec
  Module Products.CMFCore.FSPageTemplate, line 155, in pt_render
  Module Products.PageTemplates.PageTemplate, line 89, in pt_render
  Module zope.pagetemplate.pagetemplate, line 117, in pt_render
  Module zope.tal.talinterpreter, line 271, in __call__
  Module zope.tal.talinterpreter, line 346, in interpret
  Module zope.tal.talinterpreter, line 891, in do_useMacro
  Module zope.tal.talinterpreter, line 346, in interpret
  Module zope.tal.talinterpreter, line 536, in do_optTag_tal
  Module zope.tal.talinterpreter, line 521, in do_optTag
  Module zope.tal.talinterpreter, line 516, in no_tag
  Module zope.tal.talinterpreter, line 346, in interpret
  Module zope.tal.talinterpreter, line 957, in do_defineSlot
  Module zope.tal.talinterpreter, line 346, in interpret
  Module zope.tal.talinterpreter, line 536, in do_optTag_tal
  Module zope.tal.talinterpreter, line 521, in do_optTag
  Module zope.tal.talinterpreter, line 516, in no_tag
  Module zope.tal.talinterpreter, line 346, in interpret
  Module zope.tal.talinterpreter, line 861, in do_defineMacro
  Module zope.tal.talinterpreter, line 346, in interpret
  Module zope.tal.talinterpreter, line 957, in do_defineSlot
  Module zope.tal.talinterpreter, line 346, in interpret
  Module zope.tal.talinterpreter, line 536, in do_optTag_tal
  Module zope.tal.talinterpreter, line 521, in do_optTag
  Module zope.tal.talinterpreter, line 516, in no_tag
  Module zope.tal.talinterpreter, line 346, in interpret
  Module zope.tal.talinterpreter, line 534, in do_optTag_tal
  Module zope.tal.talinterpreter, line 516, in no_tag
  Module zope.tal.talinterpreter, line 346, in interpret
  Module zope.tal.talinterpreter, line 949, in do_defineSlot
  Module zope.tal.talinterpreter, line 346, in interpret
  Module zope.tal.talinterpreter, line 855, in do_condition
  Module zope.tal.talinterpreter, line 346, in interpret
  Module zope.tal.talinterpreter, line 534, in do_optTag_tal
  Module zope.tal.talinterpreter, line 516, in no_tag
  Module zope.tal.talinterpreter, line 346, in interpret
  Module zope.tal.talinterpreter, line 745, in do_insertStructure_tal
  Module Products.PageTemplates.Expressions, line 221, in evaluateStructure
  Module zope.tales.tales, line 696, in evaluate
   - URL: file:/home/stefan/autotest/temp/python24-zope210-cmf21-plone31/Products/CMFPlone/skins/plone_forms/content_status_history.cpt
   - Line 257, Column 10
   - Expression: <PathExpr standard:u'context/@@authenticator/authenticator'>
   - Names:
      {'container': <PloneSite at /plone>,
       'context': <ATBTreeFolder at /plone/Members/test_user_1_/test_object>,
       'default': <object object at 0x402be560>,
       'here': <ATBTreeFolder at /plone/Members/test_user_1_/test_object>,
       'loop': {},
       'nothing': None,
       'options': {'args': (),
                   'state': <Products.CMFFormController.ControllerState.ControllerState object at 0x436de7cc>},
       'repeat': <Products.PageTemplates.Expressions.SafeMapping object at 0x43bdb14c>,
       'request': <HTTPRequest, URL=http://nohost/plone/Members/test_user_1_/test_object/content_status_history>,
       'root': <Application at >,
       'template': <FSControllerPageTemplate at /plone/content_status_history used for /plone/Members/test_user_1_/test_object>,
       'traverse_subpath': [],
       'user': <PloneUser 'test_user_1_'>}
  Module zope.tales.expressions, line 217, in __call__
  Module Products.PageTemplates.Expressions, line 161, in _eval
  Module Products.PageTemplates.Expressions, line 123, in render
  Module plone.protect.authenticator, line 45, in authenticator
  Module zope.component._api, line 207, in getUtility
ComponentLookupError: (<InterfaceClass plone.keyring.interfaces.IKeyManager>, '')




Failure in test test_local_sharing_view (Products.ATContentTypes.tests.test_atimage.TestATImageFunctional)
Traceback (most recent call last):
  File "/home/stefan/autotest/temp/python24-zope210/lib/python/Testing/ZopeTestCase/profiler.py", line 98, in __call__
    testMethod()
  File "/home/stefan/autotest/temp/python24-zope210-cmf21-plone31/Products/ATContentTypes/tests/atctftestcase.py", line 152, in test_local_sharing_view
    self.assertStatusEqual(response.getStatus(), 200) # OK
  File "/home/stefan/autotest/temp/python24-zope210-cmf21-plone31/Products/ATContentTypes/tests/atctftestcase.py", line 83, in assertStatusEqual
    self.failUnlessEqual(a, b, msg)
  File "/usr/local/python2.4/lib/python2.4/unittest.py", line 333, in failUnlessEqual
    raise self.failureException, \
AssertionError: Traceback (innermost last):
  Module ZPublisher.Publish, line 119, in publish
  Module ZPublisher.mapply, line 88, in mapply
  Module ZPublisher.Publish, line 42, in call_object
  Module plone.app.workflow.browser.sharing, line 74, in __call__
  Module Shared.DC.Scripts.Bindings, line 313, in __call__
  Module Shared.DC.Scripts.Bindings, line 350, in _bindAndExec
  Module Products.PageTemplates.PageTemplateFile, line 129, in _exec
  Module Products.PageTemplates.PageTemplate, line 89, in pt_render
  Module zope.pagetemplate.pagetemplate, line 117, in pt_render
  Module zope.tal.talinterpreter, line 271, in __call__
  Module zope.tal.talinterpreter, line 346, in interpret
  Module zope.tal.talinterpreter, line 891, in do_useMacro
  Module zope.tal.talinterpreter, line 346, in interpret
  Module zope.tal.talinterpreter, line 536, in do_optTag_tal
  Module zope.tal.talinterpreter, line 521, in do_optTag
  Module zope.tal.talinterpreter, line 516, in no_tag
  Module zope.tal.talinterpreter, line 346, in interpret
  Module zope.tal.talinterpreter, line 891, in do_useMacro
  Module zope.tal.talinterpreter, line 346, in interpret
  Module zope.tal.talinterpreter, line 536, in do_optTag_tal
  Module zope.tal.talinterpreter, line 521, in do_optTag
  Module zope.tal.talinterpreter, line 516, in no_tag
  Module zope.tal.talinterpreter, line 346, in interpret
  Module zope.tal.talinterpreter, line 957, in do_defineSlot
  Module zope.tal.talinterpreter, line 346, in interpret
  Module zope.tal.talinterpreter, line 536, in do_optTag_tal
  Module zope.tal.talinterpreter, line 521, in do_optTag
  Module zope.tal.talinterpreter, line 516, in no_tag
  Module zope.tal.talinterpreter, line 346, in interpret
  Module zope.tal.talinterpreter, line 861, in do_defineMacro
  Module zope.tal.talinterpreter, line 346, in interpret
  Module zope.tal.talinterpreter, line 949, in do_defineSlot
  Module zope.tal.talinterpreter, line 346, in interpret
  Module zope.tal.talinterpreter, line 536, in do_optTag_tal
  Module zope.tal.talinterpreter, line 521, in do_optTag
  Module zope.tal.talinterpreter, line 516, in no_tag
  Module zope.tal.talinterpreter, line 346, in interpret
  Module zope.tal.talinterpreter, line 949, in do_defineSlot
  Module zope.tal.talinterpreter, line 346, in interpret
  Module zope.tal.talinterpreter, line 534, in do_optTag_tal
  Module zope.tal.talinterpreter, line 516, in no_tag
  Module zope.tal.talinterpreter, line 346, in interpret
  Module zope.tal.talinterpreter, line 745, in do_insertStructure_tal
  Module Products.PageTemplates.Expressions, line 221, in evaluateStructure
  Module zope.tales.tales, line 696, in evaluate
   - URL: sharing
   - Line 153, Column 4
   - Expression: <PathExpr standard:'context/@@authenticator/authenticator'>
   - Names:
      {'container': <ATImage at /plone/Members/test_user_1_/test_object>,
       'context': <ATImage at /plone/Members/test_user_1_/test_object>,
       'default': <object object at 0x402be560>,
       'here': <ATImage at /plone/Members/test_user_1_/test_object>,
       'loop': {},
       'nothing': None,
       'options': {'args': ()},
       'repeat': <Products.PageTemplates.Expressions.SafeMapping object at 0x43a13e0c>,
       'request': <HTTPRequest, URL=http://nohost/plone/Members/test_user_1_/test_object/@@sharing>,
       'root': <Application at >,
       'template': <ImplicitAcquirerWrapper object at 0x4303e7ec>,
       'traverse_subpath': [],
       'user': <PloneUser 'test_user_1_'>,
       'view': <Products.Five.metaclass.SharingView object at 0x438691cc>,
       'views': <zope.app.pagetemplate.viewpagetemplatefile.ViewMapper object at 0x43a1356c>}
  Module zope.tales.expressions, line 217, in __call__
  Module Products.PageTemplates.Expressions, line 161, in _eval
  Module Products.PageTemplates.Expressions, line 123, in render
  Module plone.protect.authenticator, line 45, in authenticator
  Module zope.component._api, line 207, in getUtility
ComponentLookupError: (<InterfaceClass plone.keyring.interfaces.IKeyManager>, '')




Failure in test test_workflow_view (Products.ATContentTypes.tests.test_atimage.TestATImageFunctional)
Traceback (most recent call last):
  File "/home/stefan/autotest/temp/python24-zope210/lib/python/Testing/ZopeTestCase/profiler.py", line 98, in __call__
    testMethod()
  File "/home/stefan/autotest/temp/python24-zope210-cmf21-plone31/Products/ATContentTypes/tests/atctftestcase.py", line 157, in test_workflow_view
    self.assertStatusEqual(response.getStatus(), 200) # OK
  File "/home/stefan/autotest/temp/python24-zope210-cmf21-plone31/Products/ATContentTypes/tests/atctftestcase.py", line 83, in assertStatusEqual
    self.failUnlessEqual(a, b, msg)
  File "/usr/local/python2.4/lib/python2.4/unittest.py", line 333, in failUnlessEqual
    raise self.failureException, \
AssertionError: Traceback (innermost last):
  Module ZPublisher.Publish, line 119, in publish
  Module ZPublisher.mapply, line 88, in mapply
  Module ZPublisher.Publish, line 42, in call_object
  Module Products.CMFFormController.FSControllerPageTemplate, line 90, in __call__
  Module Products.CMFFormController.BaseControllerPageTemplate, line 31, in _call
  Module Shared.DC.Scripts.Bindings, line 313, in __call__
  Module Shared.DC.Scripts.Bindings, line 350, in _bindAndExec
  Module Products.CMFCore.FSPageTemplate, line 216, in _exec
  Module Products.CMFCore.FSPageTemplate, line 155, in pt_render
  Module Products.PageTemplates.PageTemplate, line 89, in pt_render
  Module zope.pagetemplate.pagetemplate, line 117, in pt_render
  Module zope.tal.talinterpreter, line 271, in __call__
  Module zope.tal.talinterpreter, line 346, in interpret
  Module zope.tal.talinterpreter, line 891, in do_useMacro
  Module zope.tal.talinterpreter, line 346, in interpret
  Module zope.tal.talinterpreter, line 536, in do_optTag_tal
  Module zope.tal.talinterpreter, line 521, in do_optTag
  Module zope.tal.talinterpreter, line 516, in no_tag
  Module zope.tal.talinterpreter, line 346, in interpret
  Module zope.tal.talinterpreter, line 957, in do_defineSlot
  Module zope.tal.talinterpreter, line 346, in interpret
  Module zope.tal.talinterpreter, line 536, in do_optTag_tal
  Module zope.tal.talinterpreter, line 521, in do_optTag
  Module zope.tal.talinterpreter, line 516, in no_tag
  Module zope.tal.talinterpreter, line 346, in interpret
  Module zope.tal.talinterpreter, line 861, in do_defineMacro
  Module zope.tal.talinterpreter, line 346, in interpret
  Module zope.tal.talinterpreter, line 957, in do_defineSlot
  Module zope.tal.talinterpreter, line 346, in interpret
  Module zope.tal.talinterpreter, line 536, in do_optTag_tal
  Module zope.tal.talinterpreter, line 521, in do_optTag
  Module zope.tal.talinterpreter, line 516, in no_tag
  Module zope.tal.talinterpreter, line 346, in interpret
  Module zope.tal.talinterpreter, line 534, in do_optTag_tal
  Module zope.tal.talinterpreter, line 516, in no_tag
  Module zope.tal.talinterpreter, line 346, in interpret
  Module zope.tal.talinterpreter, line 949, in do_defineSlot
  Module zope.tal.talinterpreter, line 346, in interpret
  Module zope.tal.talinterpreter, line 855, in do_condition
  Module zope.tal.talinterpreter, line 346, in interpret
  Module zope.tal.talinterpreter, line 534, in do_optTag_tal
  Module zope.tal.talinterpreter, line 516, in no_tag
  Module zope.tal.talinterpreter, line 346, in interpret
  Module zope.tal.talinterpreter, line 745, in do_insertStructure_tal
  Module Products.PageTemplates.Expressions, line 221, in evaluateStructure
  Module zope.tales.tales, line 696, in evaluate
   - URL: file:/home/stefan/autotest/temp/python24-zope210-cmf21-plone31/Products/CMFPlone/skins/plone_forms/content_status_history.cpt
   - Line 257, Column 10
   - Expression: <PathExpr standard:u'context/@@authenticator/authenticator'>
   - Names:
      {'container': <PloneSite at /plone>,
       'context': <ATImage at /plone/Members/test_user_1_/test_object>,
       'default': <object object at 0x402be560>,
       'here': <ATImage at /plone/Members/test_user_1_/test_object>,
       'loop': {},
       'nothing': None,
       'options': {'args': (),
                   'state': <Products.CMFFormController.ControllerState.ControllerState object at 0x43aac62c>},
       'repeat': <Products.PageTemplates.Expressions.SafeMapping object at 0x43aac38c>,
       'request': <HTTPRequest, URL=http://nohost/plone/Members/test_user_1_/test_object/content_status_history>,
       'root': <Application at >,
       'template': <FSControllerPageTemplate at /plone/content_status_history used for /plone/Members/test_user_1_/test_object>,
       'traverse_subpath': [],
       'user': <PloneUser 'test_user_1_'>}
  Module zope.tales.expressions, line 217, in __call__
  Module Products.PageTemplates.Expressions, line 161, in _eval
  Module Products.PageTemplates.Expressions, line 123, in render
  Module plone.protect.authenticator, line 45, in authenticator
  Module zope.component._api, line 207, in getUtility
ComponentLookupError: (<InterfaceClass plone.keyring.interfaces.IKeyManager>, '')




Failure in test test_local_sharing_view (Products.ATContentTypes.tests.test_atlink.TestATLinkFunctional)
Traceback (most recent call last):
  File "/home/stefan/autotest/temp/python24-zope210/lib/python/Testing/ZopeTestCase/profiler.py", line 98, in __call__
    testMethod()
  File "/home/stefan/autotest/temp/python24-zope210-cmf21-plone31/Products/ATContentTypes/tests/atctftestcase.py", line 152, in test_local_sharing_view
    self.assertStatusEqual(response.getStatus(), 200) # OK
  File "/home/stefan/autotest/temp/python24-zope210-cmf21-plone31/Products/ATContentTypes/tests/atctftestcase.py", line 83, in assertStatusEqual
    self.failUnlessEqual(a, b, msg)
  File "/usr/local/python2.4/lib/python2.4/unittest.py", line 333, in failUnlessEqual
    raise self.failureException, \
AssertionError: Traceback (innermost last):
  Module ZPublisher.Publish, line 119, in publish
  Module ZPublisher.mapply, line 88, in mapply
  Module ZPublisher.Publish, line 42, in call_object
  Module plone.app.workflow.browser.sharing, line 74, in __call__
  Module Shared.DC.Scripts.Bindings, line 313, in __call__
  Module Shared.DC.Scripts.Bindings, line 350, in _bindAndExec
  Module Products.PageTemplates.PageTemplateFile, line 129, in _exec
  Module Products.PageTemplates.PageTemplate, line 89, in pt_render
  Module zope.pagetemplate.pagetemplate, line 117, in pt_render
  Module zope.tal.talinterpreter, line 271, in __call__
  Module zope.tal.talinterpreter, line 346, in interpret
  Module zope.tal.talinterpreter, line 891, in do_useMacro
  Module zope.tal.talinterpreter, line 346, in interpret
  Module zope.tal.talinterpreter, line 536, in do_optTag_tal
  Module zope.tal.talinterpreter, line 521, in do_optTag
  Module zope.tal.talinterpreter, line 516, in no_tag
  Module zope.tal.talinterpreter, line 346, in interpret
  Module zope.tal.talinterpreter, line 891, in do_useMacro
  Module zope.tal.talinterpreter, line 346, in interpret
  Module zope.tal.talinterpreter, line 536, in do_optTag_tal
  Module zope.tal.talinterpreter, line 521, in do_optTag
  Module zope.tal.talinterpreter, line 516, in no_tag
  Module zope.tal.talinterpreter, line 346, in interpret
  Module zope.tal.talinterpreter, line 957, in do_defineSlot
  Module zope.tal.talinterpreter, line 346, in interpret
  Module zope.tal.talinterpreter, line 536, in do_optTag_tal
  Module zope.tal.talinterpreter, line 521, in do_optTag
  Module zope.tal.talinterpreter, line 516, in no_tag
  Module zope.tal.talinterpreter, line 346, in interpret
  Module zope.tal.talinterpreter, line 861, in do_defineMacro
  Module zope.tal.talinterpreter, line 346, in interpret
  Module zope.tal.talinterpreter, line 949, in do_defineSlot
  Module zope.tal.talinterpreter, line 346, in interpret
  Module zope.tal.talinterpreter, line 536, in do_optTag_tal
  Module zope.tal.talinterpreter, line 521, in do_optTag
  Module zope.tal.talinterpreter, line 516, in no_tag
  Module zope.tal.talinterpreter, line 346, in interpret
  Module zope.tal.talinterpreter, line 949, in do_defineSlot
  Module zope.tal.talinterpreter, line 346, in interpret
  Module zope.tal.talinterpreter, line 534, in do_optTag_tal
  Module zope.tal.talinterpreter, line 516, in no_tag
  Module zope.tal.talinterpreter, line 346, in interpret
  Module zope.tal.talinterpreter, line 745, in do_insertStructure_tal
  Module Products.PageTemplates.Expressions, line 221, in evaluateStructure
  Module zope.tales.tales, line 696, in evaluate
   - URL: sharing
   - Line 153, Column 4
   - Expression: <PathExpr standard:'context/@@authenticator/authenticator'>
   - Names:
      {'container': <ATLink at /plone/Members/test_user_1_/test_object>,
       'context': <ATLink at /plone/Members/test_user_1_/test_object>,
       'default': <object object at 0x402be560>,
       'here': <ATLink at /plone/Members/test_user_1_/test_object>,
       'loop': {},
       'nothing': None,
       'options': {'args': ()},
       'repeat': <Products.PageTemplates.Expressions.SafeMapping object at 0x43876a0c>,
       'request': <HTTPRequest, URL=http://nohost/plone/Members/test_user_1_/test_object/@@sharing>,
       'root': <Application at >,
       'template': <ImplicitAcquirerWrapper object at 0x43a14f2c>,
       'traverse_subpath': [],
       'user': <PloneUser 'test_user_1_'>,
       'view': <Products.Five.metaclass.SharingView object at 0x4393b58c>,
       'views': <zope.app.pagetemplate.viewpagetemplatefile.ViewMapper object at 0x4384ef0c>}
  Module zope.tales.expressions, line 217, in __call__
  Module Products.PageTemplates.Expressions, line 161, in _eval
  Module Products.PageTemplates.Expressions, line 123, in render
  Module plone.protect.authenticator, line 45, in authenticator
  Module zope.component._api, line 207, in getUtility
ComponentLookupError: (<InterfaceClass plone.keyring.interfaces.IKeyManager>, '')




Failure in test test_workflow_view (Products.ATContentTypes.tests.test_atlink.TestATLinkFunctional)
Traceback (most recent call last):
  File "/home/stefan/autotest/temp/python24-zope210/lib/python/Testing/ZopeTestCase/profiler.py", line 98, in __call__
    testMethod()
  File "/home/stefan/autotest/temp/python24-zope210-cmf21-plone31/Products/ATContentTypes/tests/atctftestcase.py", line 157, in test_workflow_view
    self.assertStatusEqual(response.getStatus(), 200) # OK
  File "/home/stefan/autotest/temp/python24-zope210-cmf21-plone31/Products/ATContentTypes/tests/atctftestcase.py", line 83, in assertStatusEqual
    self.failUnlessEqual(a, b, msg)
  File "/usr/local/python2.4/lib/python2.4/unittest.py", line 333, in failUnlessEqual
    raise self.failureException, \
AssertionError: Traceback (innermost last):
  Module ZPublisher.Publish, line 119, in publish
  Module ZPublisher.mapply, line 88, in mapply
  Module ZPublisher.Publish, line 42, in call_object
  Module Products.CMFFormController.FSControllerPageTemplate, line 90, in __call__
  Module Products.CMFFormController.BaseControllerPageTemplate, line 31, in _call
  Module Shared.DC.Scripts.Bindings, line 313, in __call__
  Module Shared.DC.Scripts.Bindings, line 350, in _bindAndExec
  Module Products.CMFCore.FSPageTemplate, line 216, in _exec
  Module Products.CMFCore.FSPageTemplate, line 155, in pt_render
  Module Products.PageTemplates.PageTemplate, line 89, in pt_render
  Module zope.pagetemplate.pagetemplate, line 117, in pt_render
  Module zope.tal.talinterpreter, line 271, in __call__
  Module zope.tal.talinterpreter, line 346, in interpret
  Module zope.tal.talinterpreter, line 891, in do_useMacro
  Module zope.tal.talinterpreter, line 346, in interpret
  Module zope.tal.talinterpreter, line 536, in do_optTag_tal
  Module zope.tal.talinterpreter, line 521, in do_optTag
  Module zope.tal.talinterpreter, line 516, in no_tag
  Module zope.tal.talinterpreter, line 346, in interpret
  Module zope.tal.talinterpreter, line 957, in do_defineSlot
  Module zope.tal.talinterpreter, line 346, in interpret
  Module zope.tal.talinterpreter, line 536, in do_optTag_tal
  Module zope.tal.talinterpreter, line 521, in do_optTag
  Module zope.tal.talinterpreter, line 516, in no_tag
  Module zope.tal.talinterpreter, line 346, in interpret
  Module zope.tal.talinterpreter, line 861, in do_defineMacro
  Module zope.tal.talinterpreter, line 346, in interpret
  Module zope.tal.talinterpreter, line 957, in do_defineSlot
  Module zope.tal.talinterpreter, line 346, in interpret
  Module zope.tal.talinterpreter, line 536, in do_optTag_tal
  Module zope.tal.talinterpreter, line 521, in do_optTag
  Module zope.tal.talinterpreter, line 516, in no_tag
  Module zope.tal.talinterpreter, line 346, in interpret
  Module zope.tal.talinterpreter, line 534, in do_optTag_tal
  Module zope.tal.talinterpreter, line 516, in no_tag
  Module zope.tal.talinterpreter, line 346, in interpret
  Module zope.tal.talinterpreter, line 949, in do_defineSlot
  Module zope.tal.talinterpreter, line 346, in interpret
  Module zope.tal.talinterpreter, line 855, in do_condition
  Module zope.tal.talinterpreter, line 346, in interpret
  Module zope.tal.talinterpreter, line 534, in do_optTag_tal
  Module zope.tal.talinterpreter, line 516, in no_tag
  Module zope.tal.talinterpreter, line 346, in interpret
  Module zope.tal.talinterpreter, line 745, in do_insertStructure_tal
  Module Products.PageTemplates.Expressions, line 221, in evaluateStructure
  Module zope.tales.tales, line 696, in evaluate
   - URL: file:/home/stefan/autotest/temp/python24-zope210-cmf21-plone31/Products/CMFPlone/skins/plone_forms/content_status_history.cpt
   - Line 257, Column 10
   - Expression: <PathExpr standard:u'context/@@authenticator/authenticator'>
   - Names:
      {'container': <PloneSite at /plone>,
       'context': <ATLink at /plone/Members/test_user_1_/test_object>,
       'default': <object object at 0x402be560>,
       'here': <ATLink at /plone/Members/test_user_1_/test_object>,
       'loop': {},
       'nothing': None,
       'options': {'args': (),
                   'state': <Products.CMFFormController.ControllerState.ControllerState object at 0x4370c2cc>},
       'repeat': <Products.PageTemplates.Expressions.SafeMapping object at 0x439f5d6c>,
       'request': <HTTPRequest, URL=http://nohost/plone/Members/test_user_1_/test_object/content_status_history>,
       'root': <Application at >,
       'template': <FSControllerPageTemplate at /plone/content_status_history used for /plone/Members/test_user_1_/test_object>,
       'traverse_subpath': [],
       'user': <PloneUser 'test_user_1_'>}
  Module zope.tales.expressions, line 217, in __call__
  Module Products.PageTemplates.Expressions, line 161, in _eval
  Module Products.PageTemplates.Expressions, line 123, in render
  Module plone.protect.authenticator, line 45, in authenticator
  Module zope.component._api, line 207, in getUtility
ComponentLookupError: (<InterfaceClass plone.keyring.interfaces.IKeyManager>, '')




Failure in test test_local_sharing_view (Products.ATContentTypes.tests.test_atnewsitem.TestATNewsItemFunctional)
Traceback (most recent call last):
  File "/home/stefan/autotest/temp/python24-zope210/lib/python/Testing/ZopeTestCase/profiler.py", line 98, in __call__
    testMethod()
  File "/home/stefan/autotest/temp/python24-zope210-cmf21-plone31/Products/ATContentTypes/tests/atctftestcase.py", line 152, in test_local_sharing_view
    self.assertStatusEqual(response.getStatus(), 200) # OK
  File "/home/stefan/autotest/temp/python24-zope210-cmf21-plone31/Products/ATContentTypes/tests/atctftestcase.py", line 83, in assertStatusEqual
    self.failUnlessEqual(a, b, msg)
  File "/usr/local/python2.4/lib/python2.4/unittest.py", line 333, in failUnlessEqual
    raise self.failureException, \
AssertionError: Traceback (innermost last):
  Module ZPublisher.Publish, line 119, in publish
  Module ZPublisher.mapply, line 88, in mapply
  Module ZPublisher.Publish, line 42, in call_object
  Module plone.app.workflow.browser.sharing, line 74, in __call__
  Module Shared.DC.Scripts.Bindings, line 313, in __call__
  Module Shared.DC.Scripts.Bindings, line 350, in _bindAndExec
  Module Products.PageTemplates.PageTemplateFile, line 129, in _exec
  Module Products.PageTemplates.PageTemplate, line 89, in pt_render
  Module zope.pagetemplate.pagetemplate, line 117, in pt_render
  Module zope.tal.talinterpreter, line 271, in __call__
  Module zope.tal.talinterpreter, line 346, in interpret
  Module zope.tal.talinterpreter, line 891, in do_useMacro
  Module zope.tal.talinterpreter, line 346, in interpret
  Module zope.tal.talinterpreter, line 536, in do_optTag_tal
  Module zope.tal.talinterpreter, line 521, in do_optTag
  Module zope.tal.talinterpreter, line 516, in no_tag
  Module zope.tal.talinterpreter, line 346, in interpret
  Module zope.tal.talinterpreter, line 891, in do_useMacro
  Module zope.tal.talinterpreter, line 346, in interpret
  Module zope.tal.talinterpreter, line 536, in do_optTag_tal
  Module zope.tal.talinterpreter, line 521, in do_optTag
  Module zope.tal.talinterpreter, line 516, in no_tag
  Module zope.tal.talinterpreter, line 346, in interpret
  Module zope.tal.talinterpreter, line 957, in do_defineSlot
  Module zope.tal.talinterpreter, line 346, in interpret
  Module zope.tal.talinterpreter, line 536, in do_optTag_tal
  Module zope.tal.talinterpreter, line 521, in do_optTag
  Module zope.tal.talinterpreter, line 516, in no_tag
  Module zope.tal.talinterpreter, line 346, in interpret
  Module zope.tal.talinterpreter, line 861, in do_defineMacro
  Module zope.tal.talinterpreter, line 346, in interpret
  Module zope.tal.talinterpreter, line 949, in do_defineSlot
  Module zope.tal.talinterpreter, line 346, in interpret
  Module zope.tal.talinterpreter, line 536, in do_optTag_tal
  Module zope.tal.talinterpreter, line 521, in do_optTag
  Module zope.tal.talinterpreter, line 516, in no_tag
  Module zope.tal.talinterpreter, line 346, in interpret
  Module zope.tal.talinterpreter, line 949, in do_defineSlot
  Module zope.tal.talinterpreter, line 346, in interpret
  Module zope.tal.talinterpreter, line 534, in do_optTag_tal
  Module zope.tal.talinterpreter, line 516, in no_tag
  Module zope.tal.talinterpreter, line 346, in interpret
  Module zope.tal.talinterpreter, line 745, in do_insertStructure_tal
  Module Products.PageTemplates.Expressions, line 221, in evaluateStructure
  Module zope.tales.tales, line 696, in evaluate
   - URL: sharing
   - Line 153, Column 4
   - Expression: <PathExpr standard:'context/@@authenticator/authenticator'>
   - Names:
      {'container': <ATNewsItem at /plone/Members/test_user_1_/test_object>,
       'context': <ATNewsItem at /plone/Members/test_user_1_/test_object>,
       'default': <object object at 0x402be560>,
       'here': <ATNewsItem at /plone/Members/test_user_1_/test_object>,
       'loop': {},
       'nothing': None,
       'options': {'args': ()},
       'repeat': <Products.PageTemplates.Expressions.SafeMapping object at 0x43683c2c>,
       'request': <HTTPRequest, URL=http://nohost/plone/Members/test_user_1_/test_object/@@sharing>,
       'root': <Application at >,
       'template': <ImplicitAcquirerWrapper object at 0x43a0820c>,
       'traverse_subpath': [],
       'user': <PloneUser 'test_user_1_'>,
       'view': <Products.Five.metaclass.SharingView object at 0x4368f52c>,
       'views': <zope.app.pagetemplate.viewpagetemplatefile.ViewMapper object at 0x4368f3cc>}
  Module zope.tales.expressions, line 217, in __call__
  Module Products.PageTemplates.Expressions, line 161, in _eval
  Module Products.PageTemplates.Expressions, line 123, in render
  Module plone.protect.authenticator, line 45, in authenticator
  Module zope.component._api, line 207, in getUtility
ComponentLookupError: (<InterfaceClass plone.keyring.interfaces.IKeyManager>, '')




Failure in test test_workflow_view (Products.ATContentTypes.tests.test_atnewsitem.TestATNewsItemFunctional)
Traceback (most recent call last):
  File "/home/stefan/autotest/temp/python24-zope210/lib/python/Testing/ZopeTestCase/profiler.py", line 98, in __call__
    testMethod()
  File "/home/stefan/autotest/temp/python24-zope210-cmf21-plone31/Products/ATContentTypes/tests/atctftestcase.py", line 157, in test_workflow_view
    self.assertStatusEqual(response.getStatus(), 200) # OK
  File "/home/stefan/autotest/temp/python24-zope210-cmf21-plone31/Products/ATContentTypes/tests/atctftestcase.py", line 83, in assertStatusEqual
    self.failUnlessEqual(a, b, msg)
  File "/usr/local/python2.4/lib/python2.4/unittest.py", line 333, in failUnlessEqual
    raise self.failureException, \
AssertionError: Traceback (innermost last):
  Module ZPublisher.Publish, line 119, in publish
  Module ZPublisher.mapply, line 88, in mapply
  Module ZPublisher.Publish, line 42, in call_object
  Module Products.CMFFormController.FSControllerPageTemplate, line 90, in __call__
  Module Products.CMFFormController.BaseControllerPageTemplate, line 31, in _call
  Module Shared.DC.Scripts.Bindings, line 313, in __call__
  Module Shared.DC.Scripts.Bindings, line 350, in _bindAndExec
  Module Products.CMFCore.FSPageTemplate, line 216, in _exec
  Module Products.CMFCore.FSPageTemplate, line 155, in pt_render
  Module Products.PageTemplates.PageTemplate, line 89, in pt_render
  Module zope.pagetemplate.pagetemplate, line 117, in pt_render
  Module zope.tal.talinterpreter, line 271, in __call__
  Module zope.tal.talinterpreter, line 346, in interpret
  Module zope.tal.talinterpreter, line 891, in do_useMacro
  Module zope.tal.talinterpreter, line 346, in interpret
  Module zope.tal.talinterpreter, line 536, in do_optTag_tal
  Module zope.tal.talinterpreter, line 521, in do_optTag
  Module zope.tal.talinterpreter, line 516, in no_tag
  Module zope.tal.talinterpreter, line 346, in interpret
  Module zope.tal.talinterpreter, line 957, in do_defineSlot
  Module zope.tal.talinterpreter, line 346, in interpret
  Module zope.tal.talinterpreter, line 536, in do_optTag_tal
  Module zope.tal.talinterpreter, line 521, in do_optTag
  Module zope.tal.talinterpreter, line 516, in no_tag
  Module zope.tal.talinterpreter, line 346, in interpret
  Module zope.tal.talinterpreter, line 861, in do_defineMacro
  Module zope.tal.talinterpreter, line 346, in interpret
  Module zope.tal.talinterpreter, line 957, in do_defineSlot
  Module zope.tal.talinterpreter, line 346, in interpret
  Module zope.tal.talinterpreter, line 536, in do_optTag_tal
  Module zope.tal.talinterpreter, line 521, in do_optTag
  Module zope.tal.talinterpreter, line 516, in no_tag
  Module zope.tal.talinterpreter, line 346, in interpret
  Module zope.tal.talinterpreter, line 534, in do_optTag_tal
  Module zope.tal.talinterpreter, line 516, in no_tag
  Module zope.tal.talinterpreter, line 346, in interpret
  Module zope.tal.talinterpreter, line 949, in do_defineSlot
  Module zope.tal.talinterpreter, line 346, in interpret
  Module zope.tal.talinterpreter, line 855, in do_condition
  Module zope.tal.talinterpreter, line 346, in interpret
  Module zope.tal.talinterpreter, line 534, in do_optTag_tal
  Module zope.tal.talinterpreter, line 516, in no_tag
  Module zope.tal.talinterpreter, line 346, in interpret
  Module zope.tal.talinterpreter, line 745, in do_insertStructure_tal
  Module Products.PageTemplates.Expressions, line 221, in evaluateStructure
  Module zope.tales.tales, line 696, in evaluate
   - URL: file:/home/stefan/autotest/temp/python24-zope210-cmf21-plone31/Products/CMFPlone/skins/plone_forms/content_status_history.cpt
   - Line 257, Column 10
   - Expression: <PathExpr standard:u'context/@@authenticator/authenticator'>
   - Names:
      {'container': <PloneSite at /plone>,
       'context': <ATNewsItem at /plone/Members/test_user_1_/test_object>,
       'default': <object object at 0x402be560>,
       'here': <ATNewsItem at /plone/Members/test_user_1_/test_object>,
       'loop': {},
       'nothing': None,
       'options': {'args': (),
                   'state': <Products.CMFFormController.ControllerState.ControllerState object at 0x4341464c>},
       'repeat': <Products.PageTemplates.Expressions.SafeMapping object at 0x4340c48c>,
       'request': <HTTPRequest, URL=http://nohost/plone/Members/test_user_1_/test_object/content_status_history>,
       'root': <Application at >,
       'template': <FSControllerPageTemplate at /plone/content_status_history used for /plone/Members/test_user_1_/test_object>,
       'traverse_subpath': [],
       'user': <PloneUser 'test_user_1_'>}
  Module zope.tales.expressions, line 217, in __call__
  Module Products.PageTemplates.Expressions, line 161, in _eval
  Module Products.PageTemplates.Expressions, line 123, in render
  Module plone.protect.authenticator, line 45, in authenticator
  Module zope.component._api, line 207, in getUtility
ComponentLookupError: (<InterfaceClass plone.keyring.interfaces.IKeyManager>, '')




Failure in test test_local_sharing_view (Products.ATContentTypes.tests.test_attopic.TestATTopicFunctional)
Traceback (most recent call last):
  File "/home/stefan/autotest/temp/python24-zope210/lib/python/Testing/ZopeTestCase/profiler.py", line 98, in __call__
    testMethod()
  File "/home/stefan/autotest/temp/python24-zope210-cmf21-plone31/Products/ATContentTypes/tests/atctftestcase.py", line 152, in test_local_sharing_view
    self.assertStatusEqual(response.getStatus(), 200) # OK
  File "/home/stefan/autotest/temp/python24-zope210-cmf21-plone31/Products/ATContentTypes/tests/atctftestcase.py", line 83, in assertStatusEqual
    self.failUnlessEqual(a, b, msg)
  File "/usr/local/python2.4/lib/python2.4/unittest.py", line 333, in failUnlessEqual
    raise self.failureException, \
AssertionError: Traceback (innermost last):
  Module ZPublisher.Publish, line 119, in publish
  Module ZPublisher.mapply, line 88, in mapply
  Module ZPublisher.Publish, line 42, in call_object
  Module plone.app.workflow.browser.sharing, line 74, in __call__
  Module Shared.DC.Scripts.Bindings, line 313, in __call__
  Module Shared.DC.Scripts.Bindings, line 350, in _bindAndExec
  Module Products.PageTemplates.PageTemplateFile, line 129, in _exec
  Module Products.PageTemplates.PageTemplate, line 89, in pt_render
  Module zope.pagetemplate.pagetemplate, line 117, in pt_render
  Module zope.tal.talinterpreter, line 271, in __call__
  Module zope.tal.talinterpreter, line 346, in interpret
  Module zope.tal.talinterpreter, line 891, in do_useMacro
  Module zope.tal.talinterpreter, line 346, in interpret
  Module zope.tal.talinterpreter, line 536, in do_optTag_tal
  Module zope.tal.talinterpreter, line 521, in do_optTag
  Module zope.tal.talinterpreter, line 516, in no_tag
  Module zope.tal.talinterpreter, line 346, in interpret
  Module zope.tal.talinterpreter, line 891, in do_useMacro
  Module zope.tal.talinterpreter, line 346, in interpret
  Module zope.tal.talinterpreter, line 536, in do_optTag_tal
  Module zope.tal.talinterpreter, line 521, in do_optTag
  Module zope.tal.talinterpreter, line 516, in no_tag
  Module zope.tal.talinterpreter, line 346, in interpret
  Module zope.tal.talinterpreter, line 957, in do_defineSlot
  Module zope.tal.talinterpreter, line 346, in interpret
  Module zope.tal.talinterpreter, line 536, in do_optTag_tal
  Module zope.tal.talinterpreter, line 521, in do_optTag
  Module zope.tal.talinterpreter, line 516, in no_tag
  Module zope.tal.talinterpreter, line 346, in interpret
  Module zope.tal.talinterpreter, line 861, in do_defineMacro
  Module zope.tal.talinterpreter, line 346, in interpret
  Module zope.tal.talinterpreter, line 949, in do_defineSlot
  Module zope.tal.talinterpreter, line 346, in interpret
  Module zope.tal.talinterpreter, line 536, in do_optTag_tal
  Module zope.tal.talinterpreter, line 521, in do_optTag
  Module zope.tal.talinterpreter, line 516, in no_tag
  Module zope.tal.talinterpreter, line 346, in interpret
  Module zope.tal.talinterpreter, line 949, in do_defineSlot
  Module zope.tal.talinterpreter, line 346, in interpret
  Module zope.tal.talinterpreter, line 534, in do_optTag_tal
  Module zope.tal.talinterpreter, line 516, in no_tag
  Module zope.tal.talinterpreter, line 346, in interpret
  Module zope.tal.talinterpreter, line 745, in do_insertStructure_tal
  Module Products.PageTemplates.Expressions, line 221, in evaluateStructure
  Module zope.tales.tales, line 696, in evaluate
   - URL: sharing
   - Line 153, Column 4
   - Expression: <PathExpr standard:'context/@@authenticator/authenticator'>
   - Names:
      {'container': <ATTopic at /plone/Members/test_user_1_/test_object>,
       'context': <ATTopic at /plone/Members/test_user_1_/test_object>,
       'default': <object object at 0x402be560>,
       'here': <ATTopic at /plone/Members/test_user_1_/test_object>,
       'loop': {},
       'nothing': None,
       'options': {'args': ()},
       'repeat': <Products.PageTemplates.Expressions.SafeMapping object at 0x43a3530c>,
       'request': <HTTPRequest, URL=http://nohost/plone/Members/test_user_1_/test_object/@@sharing>,
       'root': <Application at >,
       'template': <ImplicitAcquirerWrapper object at 0x4370c52c>,
       'traverse_subpath': [],
       'user': <PloneUser 'test_user_1_'>,
       'view': <Products.Five.metaclass.SharingView object at 0x43501b4c>,
       'views': <zope.app.pagetemplate.viewpagetemplatefile.ViewMapper object at 0x43501f0c>}
  Module zope.tales.expressions, line 217, in __call__
  Module Products.PageTemplates.Expressions, line 161, in _eval
  Module Products.PageTemplates.Expressions, line 123, in render
  Module plone.protect.authenticator, line 45, in authenticator
  Module zope.component._api, line 207, in getUtility
ComponentLookupError: (<InterfaceClass plone.keyring.interfaces.IKeyManager>, '')




Failure in test test_workflow_view (Products.ATContentTypes.tests.test_attopic.TestATTopicFunctional)
Traceback (most recent call last):
  File "/home/stefan/autotest/temp/python24-zope210/lib/python/Testing/ZopeTestCase/profiler.py", line 98, in __call__
    testMethod()
  File "/home/stefan/autotest/temp/python24-zope210-cmf21-plone31/Products/ATContentTypes/tests/atctftestcase.py", line 157, in test_workflow_view
    self.assertStatusEqual(response.getStatus(), 200) # OK
  File "/home/stefan/autotest/temp/python24-zope210-cmf21-plone31/Products/ATContentTypes/tests/atctftestcase.py", line 83, in assertStatusEqual
    self.failUnlessEqual(a, b, msg)
  File "/usr/local/python2.4/lib/python2.4/unittest.py", line 333, in failUnlessEqual
    raise self.failureException, \
AssertionError: Traceback (innermost last):
  Module ZPublisher.Publish, line 119, in publish
  Module ZPublisher.mapply, line 88, in mapply
  Module ZPublisher.Publish, line 42, in call_object
  Module Products.CMFFormController.FSControllerPageTemplate, line 90, in __call__
  Module Products.CMFFormController.BaseControllerPageTemplate, line 31, in _call
  Module Shared.DC.Scripts.Bindings, line 313, in __call__
  Module Shared.DC.Scripts.Bindings, line 350, in _bindAndExec
  Module Products.CMFCore.FSPageTemplate, line 216, in _exec
  Module Products.CMFCore.FSPageTemplate, line 155, in pt_render
  Module Products.PageTemplates.PageTemplate, line 89, in pt_render
  Module zope.pagetemplate.pagetemplate, line 117, in pt_render
  Module zope.tal.talinterpreter, line 271, in __call__
  Module zope.tal.talinterpreter, line 346, in interpret
  Module zope.tal.talinterpreter, line 891, in do_useMacro
  Module zope.tal.talinterpreter, line 346, in interpret
  Module zope.tal.talinterpreter, line 536, in do_optTag_tal
  Module zope.tal.talinterpreter, line 521, in do_optTag
  Module zope.tal.talinterpreter, line 516, in no_tag
  Module zope.tal.talinterpreter, line 346, in interpret
  Module zope.tal.talinterpreter, line 957, in do_defineSlot
  Module zope.tal.talinterpreter, line 346, in interpret
  Module zope.tal.talinterpreter, line 536, in do_optTag_tal
  Module zope.tal.talinterpreter, line 521, in do_optTag
  Module zope.tal.talinterpreter, line 516, in no_tag
  Module zope.tal.talinterpreter, line 346, in interpret
  Module zope.tal.talinterpreter, line 861, in do_defineMacro
  Module zope.tal.talinterpreter, line 346, in interpret
  Module zope.tal.talinterpreter, line 957, in do_defineSlot
  Module zope.tal.talinterpreter, line 346, in interpret
  Module zope.tal.talinterpreter, line 536, in do_optTag_tal
  Module zope.tal.talinterpreter, line 521, in do_optTag
  Module zope.tal.talinterpreter, line 516, in no_tag
  Module zope.tal.talinterpreter, line 346, in interpret
  Module zope.tal.talinterpreter, line 534, in do_optTag_tal
  Module zope.tal.talinterpreter, line 516, in no_tag
  Module zope.tal.talinterpreter, line 346, in interpret
  Module zope.tal.talinterpreter, line 949, in do_defineSlot
  Module zope.tal.talinterpreter, line 346, in interpret
  Module zope.tal.talinterpreter, line 855, in do_condition
  Module zope.tal.talinterpreter, line 346, in interpret
  Module zope.tal.talinterpreter, line 534, in do_optTag_tal
  Module zope.tal.talinterpreter, line 516, in no_tag
  Module zope.tal.talinterpreter, line 346, in interpret
  Module zope.tal.talinterpreter, line 745, in do_insertStructure_tal
  Module Products.PageTemplates.Expressions, line 221, in evaluateStructure
  Module zope.tales.tales, line 696, in evaluate
   - URL: file:/home/stefan/autotest/temp/python24-zope210-cmf21-plone31/Products/CMFPlone/skins/plone_forms/content_status_history.cpt
   - Line 257, Column 10
   - Expression: <PathExpr standard:u'context/@@authenticator/authenticator'>
   - Names:
      {'container': <PloneSite at /plone>,
       'context': <ATTopic at /plone/Members/test_user_1_/test_object>,
       'default': <object object at 0x402be560>,
       'here': <ATTopic at /plone/Members/test_user_1_/test_object>,
       'loop': {},
       'nothing': None,
       'options': {'args': (),
                   'state': <Products.CMFFormController.ControllerState.ControllerState object at 0x434ca06c>},
       'repeat': <Products.PageTemplates.Expressions.SafeMapping object at 0x43c370ec>,
       'request': <HTTPRequest, URL=http://nohost/plone/Members/test_user_1_/test_object/content_status_history>,
       'root': <Application at >,
       'template': <FSControllerPageTemplate at /plone/content_status_history used for /plone/Members/test_user_1_/test_object>,
       'traverse_subpath': [],
       'user': <PloneUser 'test_user_1_'>}
  Module zope.tales.expressions, line 217, in __call__
  Module Products.PageTemplates.Expressions, line 161, in _eval
  Module Products.PageTemplates.Expressions, line 123, in render
  Module plone.protect.authenticator, line 45, in authenticator
  Module zope.component._api, line 207, in getUtility
ComponentLookupError: (<InterfaceClass plone.keyring.interfaces.IKeyManager>, '')




Failure in test /home/stefan/autotest/temp/python24-zope210-cmf21-plone31/Products/ATContentTypes/tests/portaltype_criterion.txt
Failed doctest test for portaltype_criterion.txt
  File "/home/stefan/autotest/temp/python24-zope210-cmf21-plone31/Products/ATContentTypes/tests/portaltype_criterion.txt", line 0

----------------------------------------------------------------------
File "/home/stefan/autotest/temp/python24-zope210-cmf21-plone31/Products/ATContentTypes/tests/portaltype_criterion.txt", line 115, in portaltype_criterion.txt
Failed example:
    browser.getLink('Language').click()
Exception raised:
    Traceback (most recent call last):
      File "/home/stefan/autotest/temp/python24-zope210/lib/python/zope/testing/doctest.py", line 1348, in __run
        compileflags, 1) in test.globs
      File "<doctest portaltype_criterion.txt[37]>", line 1, in ?
        browser.getLink('Language').click()
      File "/home/stefan/autotest/temp/python24-zope210/lib/python/zope/testbrowser/browser.py", line 397, in click
        self.browser.mech_browser.follow_link(self.mech_link)
      File "/home/stefan/autotest/temp/python24-zope210/lib/python/mechanize/_mechanize.py", line 448, in follow_link
        return self.open(self.click_link(link, **kwds))
      File "/home/stefan/autotest/temp/python24-zope210/lib/python/mechanize/_mechanize.py", line 177, in open
        return self._mech_open(url, data)
      File "/home/stefan/autotest/temp/python24-zope210/lib/python/mechanize/_mechanize.py", line 219, in _mech_open
        raise error
    HTTPError: HTTP Error 500: Internal Server Error
----------------------------------------------------------------------
File "/home/stefan/autotest/temp/python24-zope210-cmf21-plone31/Products/ATContentTypes/tests/portaltype_criterion.txt", line 116, in portaltype_criterion.txt
Failed example:
    browser.getControl('Site language').value = ['de']
Exception raised:
    Traceback (most recent call last):
      File "/home/stefan/autotest/temp/python24-zope210/lib/python/zope/testing/doctest.py", line 1348, in __run
        compileflags, 1) in test.globs
      File "<doctest portaltype_criterion.txt[38]>", line 1, in ?
        browser.getControl('Site language').value = ['de']
      File "/home/stefan/autotest/temp/python24-zope210/lib/python/zope/testbrowser/browser.py", line 336, in getControl
        control, form = disambiguate(intermediate, msg, index)
      File "/home/stefan/autotest/temp/python24-zope210/lib/python/zope/testbrowser/browser.py", line 50, in disambiguate
        raise LookupError(msg)
    LookupError: label 'Site language'
----------------------------------------------------------------------
File "/home/stefan/autotest/temp/python24-zope210-cmf21-plone31/Products/ATContentTypes/tests/portaltype_criterion.txt", line 117, in portaltype_criterion.txt
Failed example:
    browser.getControl('Save').click()
Exception raised:
    Traceback (most recent call last):
      File "/home/stefan/autotest/temp/python24-zope210/lib/python/zope/testing/doctest.py", line 1348, in __run
        compileflags, 1) in test.globs
      File "<doctest portaltype_criterion.txt[39]>", line 1, in ?
        browser.getControl('Save').click()
      File "/home/stefan/autotest/temp/python24-zope210/lib/python/zope/testbrowser/browser.py", line 336, in getControl
        control, form = disambiguate(intermediate, msg, index)
      File "/home/stefan/autotest/temp/python24-zope210/lib/python/zope/testbrowser/browser.py", line 50, in disambiguate
        raise LookupError(msg)
    LookupError: label 'Save'

  Ran 802 tests with 22 failures and 0 errors in 712.215 seconds.
Tearing down left over layers:
  Tear down Products.PloneTestCase.layer.PloneSite in 0.723 seconds.
  Tear down Products.PloneTestCase.layer.ZCML in 0.022 seconds.

FAILED (failures=22)




More information about the Testbot mailing list