[Testbot] FAILED (failures=31) : Plone-3.1 Zope-2.10 Python-2.4.4

plone.* Tests plone-tests at epy.co.at
Mon May 5 04:20:51 UTC 2008


plone.* Tests : FAILED (failures=31)
Plone-3.1 Zope-2.10 Python-2.4.4

Running /usr/local/python2.4/bin/python /home/stefan/autotest/temp/python24-zope210/test.py -q -1 --config-file etc/zope.conf --package plone
Installing CMFCore ... done (0.515s)
Installing CMFDefault ... done (0.332s)
Installing CMFCalendar ... done (0.063s)
Installing CMFTopic ... done (0.028s)
Installing DCWorkflow ... done (0.071s)
Installing CMFActionIcons ... done (0.029s)
Installing CMFQuickInstallerTool ... done (0.096s)
Installing CMFFormController ... done (0.504s)
Installing GroupUserFolder ... done (0.589s)
Installing ZCTextIndex ... done (0.081s)
Installing CMFPlone ... done (3.168s)
Installing Archetypes ... done (0.146s)
Installing ATContentTypes ... done (0.062s)
Installing ATReferenceBrowserWidget ... done (0.018s)
Installing CMFDynamicViewFTI ... done (0.016s)
Installing ExternalEditor ... done (0.019s)
Installing ExtendedPathIndex ... done (0.020s)
Installing ResourceRegistries ... done (0.018s)
Installing SecureMailHost ... done (0.018s)
Installing CMFPlacefulWorkflow ... done (0.391s)
Installing PasswordResetTool ... done (0.021s)
Installing PluggableAuthService ... done (0.032s)
Installing PluginRegistry ... done (0.022s)
Installing PlonePAS ... done (0.029s)
Installing kupu ... done (0.366s)
Installing CMFEditions ... done (0.034s)
Installing CMFDiffTool ... done (0.029s)
Installing PloneLanguageTool ... done (0.028s)
/home/stefan/autotest/temp/python24-zope210/lib/python/zope/testing/testrunner.py:1251: DeprecationWarning: Non-ASCII character '\xc3' in file /home/stefan/autotest/temp/python24-zope210-cmf21-plone31/lib/python/plone/app/contentrules/tests/test_configuration.py on line 171, but no encoding declared; see http://www.python.org/peps/pep-0263.html for details
  __import__(name)
Parsing /home/stefan/autotest/temp/python24-zope210-cmf21-plone31/etc/zope.conf
Running unit tests:
/home/stefan/autotest/temp/python24-zope210/lib/python/zope/configuration/fields.py:417: UserWarning: You did not specify an i18n translation domain for the 'title' field in /home/stefan/autotest/temp/python24-zope210-cmf21-plone31/lib/python/kss/core/permission.zcml
  warnings.warn(
  Ran 369 tests with 0 failures and 0 errors in 7.216 seconds.
Running Products.PloneTestCase.layer.ZCML tests:
  Set up Products.PloneTestCase.layer.ZCML in 4.530 seconds.
Installing plone.app.form ... NOT FOUND
Installing plone.portlet.collection ... done (0.038s)
Installing plone.portlet.static ... done (0.033s)
  Ran 36 tests with 0 failures and 0 errors in 0.239 seconds.
Running Products.PloneTestCase.layer.PloneSite tests:
  Set up Products.PloneTestCase.layer.PloneSite in 12.183 seconds.


Failure in test /home/stefan/autotest/temp/python24-zope210-cmf21-plone31/lib/python/plone/app/content/browser/tests/foldercontents.txt
Failed doctest test for foldercontents.txt
  File "/home/stefan/autotest/temp/python24-zope210-cmf21-plone31/lib/python/plone/app/content/browser/tests/foldercontents.txt", line 0

----------------------------------------------------------------------
File "/home/stefan/autotest/temp/python24-zope210-cmf21-plone31/lib/python/plone/app/content/browser/tests/foldercontents.txt", line 21, in foldercontents.txt
Failed example:
    browser.open('http://nohost/plone/@@folder_contents')
Exception raised:
    Traceback (most recent call last):
      File "/home/stefan/autotest/temp/python24-zope210/lib/python/zope/testing/doctest.py", line 1348, in __run
        compileflags, 1) in test.globs
      File "<doctest foldercontents.txt[6]>", line 1, in ?
        browser.open('http://nohost/plone/@@folder_contents')
      File "/home/stefan/autotest/temp/python24-zope210/lib/python/zope/testbrowser/browser.py", line 224, in open
        self.mech_browser.open(url, data)
      File "/home/stefan/autotest/temp/python24-zope210/lib/python/mechanize/_mechanize.py", line 177, in open
        return self._mech_open(url, data)
      File "/home/stefan/autotest/temp/python24-zope210/lib/python/mechanize/_mechanize.py", line 219, in _mech_open
        raise error
    HTTPError: HTTP Error 500: Internal Server Error



Failure in test /home/stefan/autotest/temp/python24-zope210-cmf21-plone31/lib/python/plone/app/contentrules/tests/simplepublish.txt
Failed doctest test for simplepublish.txt
  File "/home/stefan/autotest/temp/python24-zope210-cmf21-plone31/lib/python/plone/app/contentrules/tests/simplepublish.txt", line 0

----------------------------------------------------------------------
File "/home/stefan/autotest/temp/python24-zope210-cmf21-plone31/lib/python/plone/app/contentrules/tests/simplepublish.txt", line 74, in simplepublish.txt
Failed example:
    browser.getLink('State:').click()
Exception raised:
    Traceback (most recent call last):
      File "/home/stefan/autotest/temp/python24-zope210/lib/python/zope/testing/doctest.py", line 1348, in __run
        compileflags, 1) in test.globs
      File "<doctest simplepublish.txt[41]>", line 1, in ?
        browser.getLink('State:').click()
      File "/home/stefan/autotest/temp/python24-zope210/lib/python/zope/testbrowser/browser.py", line 397, in click
        self.browser.mech_browser.follow_link(self.mech_link)
      File "/home/stefan/autotest/temp/python24-zope210/lib/python/mechanize/_mechanize.py", line 448, in follow_link
        return self.open(self.click_link(link, **kwds))
      File "/home/stefan/autotest/temp/python24-zope210/lib/python/mechanize/_mechanize.py", line 177, in open
        return self._mech_open(url, data)
      File "/home/stefan/autotest/temp/python24-zope210/lib/python/mechanize/_mechanize.py", line 219, in _mech_open
        raise error
    HTTPError: HTTP Error 500: Internal Server Error
----------------------------------------------------------------------
File "/home/stefan/autotest/temp/python24-zope210-cmf21-plone31/lib/python/plone/app/contentrules/tests/simplepublish.txt", line 75, in simplepublish.txt
Failed example:
    ctrl = browser.getControl(name='workflow_action') # XXX fix label
Exception raised:
    Traceback (most recent call last):
      File "/home/stefan/autotest/temp/python24-zope210/lib/python/zope/testing/doctest.py", line 1348, in __run
        compileflags, 1) in test.globs
      File "<doctest simplepublish.txt[42]>", line 1, in ?
        ctrl = browser.getControl(name='workflow_action') # XXX fix label
      File "/home/stefan/autotest/temp/python24-zope210/lib/python/zope/testbrowser/browser.py", line 336, in getControl
        control, form = disambiguate(intermediate, msg, index)
      File "/home/stefan/autotest/temp/python24-zope210/lib/python/zope/testbrowser/browser.py", line 50, in disambiguate
        raise LookupError(msg)
    LookupError: name 'workflow_action'
----------------------------------------------------------------------
File "/home/stefan/autotest/temp/python24-zope210-cmf21-plone31/lib/python/plone/app/contentrules/tests/simplepublish.txt", line 76, in simplepublish.txt
Failed example:
    ctrl.value = ['publish']
Exception raised:
    Traceback (most recent call last):
      File "/home/stefan/autotest/temp/python24-zope210/lib/python/zope/testing/doctest.py", line 1348, in __run
        compileflags, 1) in test.globs
      File "<doctest simplepublish.txt[43]>", line 1, in ?
        ctrl.value = ['publish']
      File "/home/stefan/autotest/temp/python24-zope210/lib/python/zope/testbrowser/browser.py", line 91, in __setattr__
        object.__setattr__(self, name, value)
      File "/home/stefan/autotest/temp/python24-zope210/lib/python/zope/testbrowser/browser.py", line 475, in fset
        raise interfaces.ExpiredError
    ExpiredError
----------------------------------------------------------------------
File "/home/stefan/autotest/temp/python24-zope210-cmf21-plone31/lib/python/plone/app/contentrules/tests/simplepublish.txt", line 77, in simplepublish.txt
Failed example:
    browser.getControl('Save').click()
Exception raised:
    Traceback (most recent call last):
      File "/home/stefan/autotest/temp/python24-zope210/lib/python/zope/testing/doctest.py", line 1348, in __run
        compileflags, 1) in test.globs
      File "<doctest simplepublish.txt[44]>", line 1, in ?
        browser.getControl('Save').click()
      File "/home/stefan/autotest/temp/python24-zope210/lib/python/zope/testbrowser/browser.py", line 336, in getControl
        control, form = disambiguate(intermediate, msg, index)
      File "/home/stefan/autotest/temp/python24-zope210/lib/python/zope/testbrowser/browser.py", line 50, in disambiguate
        raise LookupError(msg)
    LookupError: label 'Save'
----------------------------------------------------------------------
File "/home/stefan/autotest/temp/python24-zope210-cmf21-plone31/lib/python/plone/app/contentrules/tests/simplepublish.txt", line 81, in simplepublish.txt
Failed example:
    browser.url
Differences (ndiff with -expected +actual):
    - 'http://nohost/plone/news/my-news-item'
    + 'http://nohost/plone/my-news-item/content_status_history'



Failure in test /home/stefan/autotest/temp/python24-zope210-cmf21-plone31/lib/python/plone/app/contentrules/tests/multipublish.txt
Failed doctest test for multipublish.txt
  File "/home/stefan/autotest/temp/python24-zope210-cmf21-plone31/lib/python/plone/app/contentrules/tests/multipublish.txt", line 0

----------------------------------------------------------------------
File "/home/stefan/autotest/temp/python24-zope210-cmf21-plone31/lib/python/plone/app/contentrules/tests/multipublish.txt", line 89, in multipublish.txt
Failed example:
    browser.getLink('Contents').click()
Exception raised:
    Traceback (most recent call last):
      File "/home/stefan/autotest/temp/python24-zope210/lib/python/zope/testing/doctest.py", line 1348, in __run
        compileflags, 1) in test.globs
      File "<doctest multipublish.txt[49]>", line 1, in ?
        browser.getLink('Contents').click()
      File "/home/stefan/autotest/temp/python24-zope210/lib/python/zope/testbrowser/browser.py", line 397, in click
        self.browser.mech_browser.follow_link(self.mech_link)
      File "/home/stefan/autotest/temp/python24-zope210/lib/python/mechanize/_mechanize.py", line 448, in follow_link
        return self.open(self.click_link(link, **kwds))
      File "/home/stefan/autotest/temp/python24-zope210/lib/python/mechanize/_mechanize.py", line 177, in open
        return self._mech_open(url, data)
      File "/home/stefan/autotest/temp/python24-zope210/lib/python/mechanize/_mechanize.py", line 219, in _mech_open
        raise error
    HTTPError: HTTP Error 500: Internal Server Error
----------------------------------------------------------------------
File "/home/stefan/autotest/temp/python24-zope210-cmf21-plone31/lib/python/plone/app/contentrules/tests/multipublish.txt", line 90, in multipublish.txt
Failed example:
    browser.getControl('My news item').click()
Exception raised:
    Traceback (most recent call last):
      File "/home/stefan/autotest/temp/python24-zope210/lib/python/zope/testing/doctest.py", line 1348, in __run
        compileflags, 1) in test.globs
      File "<doctest multipublish.txt[50]>", line 1, in ?
        browser.getControl('My news item').click()
      File "/home/stefan/autotest/temp/python24-zope210/lib/python/zope/testbrowser/browser.py", line 336, in getControl
        control, form = disambiguate(intermediate, msg, index)
      File "/home/stefan/autotest/temp/python24-zope210/lib/python/zope/testbrowser/browser.py", line 50, in disambiguate
        raise LookupError(msg)
    LookupError: label 'My news item'
----------------------------------------------------------------------
File "/home/stefan/autotest/temp/python24-zope210-cmf21-plone31/lib/python/plone/app/contentrules/tests/multipublish.txt", line 91, in multipublish.txt
Failed example:
    browser.getControl('Second news item').click()
Exception raised:
    Traceback (most recent call last):
      File "/home/stefan/autotest/temp/python24-zope210/lib/python/zope/testing/doctest.py", line 1348, in __run
        compileflags, 1) in test.globs
      File "<doctest multipublish.txt[51]>", line 1, in ?
        browser.getControl('Second news item').click()
      File "/home/stefan/autotest/temp/python24-zope210/lib/python/zope/testbrowser/browser.py", line 336, in getControl
        control, form = disambiguate(intermediate, msg, index)
      File "/home/stefan/autotest/temp/python24-zope210/lib/python/zope/testbrowser/browser.py", line 50, in disambiguate
        raise LookupError(msg)
    LookupError: label 'Second news item'
----------------------------------------------------------------------
File "/home/stefan/autotest/temp/python24-zope210-cmf21-plone31/lib/python/plone/app/contentrules/tests/multipublish.txt", line 92, in multipublish.txt
Failed example:
    browser.getControl('Change State').click()
Exception raised:
    Traceback (most recent call last):
      File "/home/stefan/autotest/temp/python24-zope210/lib/python/zope/testing/doctest.py", line 1348, in __run
        compileflags, 1) in test.globs
      File "<doctest multipublish.txt[52]>", line 1, in ?
        browser.getControl('Change State').click()
      File "/home/stefan/autotest/temp/python24-zope210/lib/python/zope/testbrowser/browser.py", line 336, in getControl
        control, form = disambiguate(intermediate, msg, index)
      File "/home/stefan/autotest/temp/python24-zope210/lib/python/zope/testbrowser/browser.py", line 50, in disambiguate
        raise LookupError(msg)
    LookupError: label 'Change State'
----------------------------------------------------------------------
File "/home/stefan/autotest/temp/python24-zope210-cmf21-plone31/lib/python/plone/app/contentrules/tests/multipublish.txt", line 99, in multipublish.txt
Failed example:
    browser.getControl('Publish').click()
Exception raised:
    Traceback (most recent call last):
      File "/home/stefan/autotest/temp/python24-zope210/lib/python/zope/testing/doctest.py", line 1348, in __run
        compileflags, 1) in test.globs
      File "<doctest multipublish.txt[55]>", line 1, in ?
        browser.getControl('Publish').click()
      File "/home/stefan/autotest/temp/python24-zope210/lib/python/zope/testbrowser/browser.py", line 336, in getControl
        control, form = disambiguate(intermediate, msg, index)
      File "/home/stefan/autotest/temp/python24-zope210/lib/python/zope/testbrowser/browser.py", line 50, in disambiguate
        raise LookupError(msg)
    LookupError: label 'Publish'



Failure in test /home/stefan/autotest/temp/python24-zope210-cmf21-plone31/lib/python/plone/app/controlpanel/tests/calendar.txt
Failed doctest test for calendar.txt
  File "/home/stefan/autotest/temp/python24-zope210-cmf21-plone31/lib/python/plone/app/controlpanel/tests/calendar.txt", line 0

----------------------------------------------------------------------
File "/home/stefan/autotest/temp/python24-zope210-cmf21-plone31/lib/python/plone/app/controlpanel/tests/calendar.txt", line 13, in calendar.txt
Failed example:
    self.browser.open('http://nohost/plone/@@calendar-controlpanel')
Exception raised:
    Traceback (most recent call last):
      File "/home/stefan/autotest/temp/python24-zope210/lib/python/zope/testing/doctest.py", line 1348, in __run
        compileflags, 1) in test.globs
      File "<doctest calendar.txt[3]>", line 1, in ?
        self.browser.open('http://nohost/plone/@@calendar-controlpanel')
      File "/home/stefan/autotest/temp/python24-zope210/lib/python/zope/testbrowser/browser.py", line 224, in open
        self.mech_browser.open(url, data)
      File "/home/stefan/autotest/temp/python24-zope210/lib/python/mechanize/_mechanize.py", line 177, in open
        return self._mech_open(url, data)
      File "/home/stefan/autotest/temp/python24-zope210/lib/python/mechanize/_mechanize.py", line 219, in _mech_open
        raise error
    HTTPError: HTTP Error 500: Internal Server Error



Failure in test /home/stefan/autotest/temp/python24-zope210-cmf21-plone31/lib/python/plone/app/controlpanel/tests/filter.txt
Failed doctest test for filter.txt
  File "/home/stefan/autotest/temp/python24-zope210-cmf21-plone31/lib/python/plone/app/controlpanel/tests/filter.txt", line 0

----------------------------------------------------------------------
File "/home/stefan/autotest/temp/python24-zope210-cmf21-plone31/lib/python/plone/app/controlpanel/tests/filter.txt", line 19, in filter.txt
Failed example:
    browser.open('http://nohost/plone/@@filter-controlpanel')
Exception raised:
    Traceback (most recent call last):
      File "/home/stefan/autotest/temp/python24-zope210/lib/python/zope/testing/doctest.py", line 1348, in __run
        compileflags, 1) in test.globs
      File "<doctest filter.txt[8]>", line 1, in ?
        browser.open('http://nohost/plone/@@filter-controlpanel')
      File "/home/stefan/autotest/temp/python24-zope210/lib/python/zope/testbrowser/browser.py", line 224, in open
        self.mech_browser.open(url, data)
      File "/home/stefan/autotest/temp/python24-zope210/lib/python/mechanize/_mechanize.py", line 177, in open
        return self._mech_open(url, data)
      File "/home/stefan/autotest/temp/python24-zope210/lib/python/mechanize/_mechanize.py", line 219, in _mech_open
        raise error
    HTTPError: HTTP Error 500: Internal Server Error



Failure in test /home/stefan/autotest/temp/python24-zope210-cmf21-plone31/lib/python/plone/app/controlpanel/tests/mail.txt
Failed doctest test for mail.txt
  File "/home/stefan/autotest/temp/python24-zope210-cmf21-plone31/lib/python/plone/app/controlpanel/tests/mail.txt", line 0

----------------------------------------------------------------------
File "/home/stefan/autotest/temp/python24-zope210-cmf21-plone31/lib/python/plone/app/controlpanel/tests/mail.txt", line 16, in mail.txt
Failed example:
    self.browser.open('http://nohost/plone/@@mail-controlpanel')
Exception raised:
    Traceback (most recent call last):
      File "/home/stefan/autotest/temp/python24-zope210/lib/python/zope/testing/doctest.py", line 1348, in __run
        compileflags, 1) in test.globs
      File "<doctest mail.txt[6]>", line 1, in ?
        self.browser.open('http://nohost/plone/@@mail-controlpanel')
      File "/home/stefan/autotest/temp/python24-zope210/lib/python/zope/testbrowser/browser.py", line 224, in open
        self.mech_browser.open(url, data)
      File "/home/stefan/autotest/temp/python24-zope210/lib/python/mechanize/_mechanize.py", line 177, in open
        return self._mech_open(url, data)
      File "/home/stefan/autotest/temp/python24-zope210/lib/python/mechanize/_mechanize.py", line 219, in _mech_open
        raise error
    HTTPError: HTTP Error 500: Internal Server Error



Failure in test /home/stefan/autotest/temp/python24-zope210-cmf21-plone31/lib/python/plone/app/controlpanel/tests/maintenance.txt
Failed doctest test for maintenance.txt
  File "/home/stefan/autotest/temp/python24-zope210-cmf21-plone31/lib/python/plone/app/controlpanel/tests/maintenance.txt", line 0

----------------------------------------------------------------------
File "/home/stefan/autotest/temp/python24-zope210-cmf21-plone31/lib/python/plone/app/controlpanel/tests/maintenance.txt", line 33, in maintenance.txt
Failed example:
    self.browser.open('http://nohost/plone/@@maintenance-controlpanel')
Exception raised:
    Traceback (most recent call last):
      File "/home/stefan/autotest/temp/python24-zope210/lib/python/zope/testing/doctest.py", line 1348, in __run
        compileflags, 1) in test.globs
      File "<doctest maintenance.txt[8]>", line 1, in ?
        self.browser.open('http://nohost/plone/@@maintenance-controlpanel')
      File "/home/stefan/autotest/temp/python24-zope210/lib/python/zope/testbrowser/browser.py", line 224, in open
        self.mech_browser.open(url, data)
      File "/home/stefan/autotest/temp/python24-zope210/lib/python/mechanize/_mechanize.py", line 177, in open
        return self._mech_open(url, data)
      File "/home/stefan/autotest/temp/python24-zope210/lib/python/mechanize/_mechanize.py", line 219, in _mech_open
        raise error
    HTTPError: HTTP Error 500: Internal Server Error



Failure in test /home/stefan/autotest/temp/python24-zope210-cmf21-plone31/lib/python/plone/app/controlpanel/tests/search.txt
Failed doctest test for search.txt
  File "/home/stefan/autotest/temp/python24-zope210-cmf21-plone31/lib/python/plone/app/controlpanel/tests/search.txt", line 0

----------------------------------------------------------------------
File "/home/stefan/autotest/temp/python24-zope210-cmf21-plone31/lib/python/plone/app/controlpanel/tests/search.txt", line 13, in search.txt
Failed example:
    self.browser.open('http://nohost/plone/@@search-controlpanel')
Exception raised:
    Traceback (most recent call last):
      File "/home/stefan/autotest/temp/python24-zope210/lib/python/zope/testing/doctest.py", line 1348, in __run
        compileflags, 1) in test.globs
      File "<doctest search.txt[3]>", line 1, in ?
        self.browser.open('http://nohost/plone/@@search-controlpanel')
      File "/home/stefan/autotest/temp/python24-zope210/lib/python/zope/testbrowser/browser.py", line 224, in open
        self.mech_browser.open(url, data)
      File "/home/stefan/autotest/temp/python24-zope210/lib/python/mechanize/_mechanize.py", line 177, in open
        return self._mech_open(url, data)
      File "/home/stefan/autotest/temp/python24-zope210/lib/python/mechanize/_mechanize.py", line 219, in _mech_open
        raise error
    HTTPError: HTTP Error 500: Internal Server Error



Failure in test /home/stefan/autotest/temp/python24-zope210-cmf21-plone31/lib/python/plone/app/controlpanel/tests/site.txt
Failed doctest test for site.txt
  File "/home/stefan/autotest/temp/python24-zope210-cmf21-plone31/lib/python/plone/app/controlpanel/tests/site.txt", line 0

----------------------------------------------------------------------
File "/home/stefan/autotest/temp/python24-zope210-cmf21-plone31/lib/python/plone/app/controlpanel/tests/site.txt", line 17, in site.txt
Failed example:
    self.browser.open('http://nohost/plone/@@site-controlpanel')
Exception raised:
    Traceback (most recent call last):
      File "/home/stefan/autotest/temp/python24-zope210/lib/python/zope/testing/doctest.py", line 1348, in __run
        compileflags, 1) in test.globs
      File "<doctest site.txt[5]>", line 1, in ?
        self.browser.open('http://nohost/plone/@@site-controlpanel')
      File "/home/stefan/autotest/temp/python24-zope210/lib/python/zope/testbrowser/browser.py", line 224, in open
        self.mech_browser.open(url, data)
      File "/home/stefan/autotest/temp/python24-zope210/lib/python/mechanize/_mechanize.py", line 177, in open
        return self._mech_open(url, data)
      File "/home/stefan/autotest/temp/python24-zope210/lib/python/mechanize/_mechanize.py", line 219, in _mech_open
        raise error
    HTTPError: HTTP Error 500: Internal Server Error



Failure in test /home/stefan/autotest/temp/python24-zope210-cmf21-plone31/lib/python/plone/app/controlpanel/tests/skins.txt
Failed doctest test for skins.txt
  File "/home/stefan/autotest/temp/python24-zope210-cmf21-plone31/lib/python/plone/app/controlpanel/tests/skins.txt", line 0

----------------------------------------------------------------------
File "/home/stefan/autotest/temp/python24-zope210-cmf21-plone31/lib/python/plone/app/controlpanel/tests/skins.txt", line 26, in skins.txt
Failed example:
    self.browser.open('http://nohost/plone/@@skins-controlpanel')
Exception raised:
    Traceback (most recent call last):
      File "/home/stefan/autotest/temp/python24-zope210/lib/python/zope/testing/doctest.py", line 1348, in __run
        compileflags, 1) in test.globs
      File "<doctest skins.txt[6]>", line 1, in ?
        self.browser.open('http://nohost/plone/@@skins-controlpanel')
      File "/home/stefan/autotest/temp/python24-zope210/lib/python/zope/testbrowser/browser.py", line 224, in open
        self.mech_browser.open(url, data)
      File "/home/stefan/autotest/temp/python24-zope210/lib/python/mechanize/_mechanize.py", line 177, in open
        return self._mech_open(url, data)
      File "/home/stefan/autotest/temp/python24-zope210/lib/python/mechanize/_mechanize.py", line 219, in _mech_open
        raise error
    HTTPError: HTTP Error 500: Internal Server Error



Failure in test /home/stefan/autotest/temp/python24-zope210-cmf21-plone31/lib/python/plone/app/controlpanel/tests/markup.txt
Failed doctest test for markup.txt
  File "/home/stefan/autotest/temp/python24-zope210-cmf21-plone31/lib/python/plone/app/controlpanel/tests/markup.txt", line 0

----------------------------------------------------------------------
File "/home/stefan/autotest/temp/python24-zope210-cmf21-plone31/lib/python/plone/app/controlpanel/tests/markup.txt", line 8, in markup.txt
Failed example:
    self.browser.open('http://nohost/plone/@@markup-controlpanel')
Exception raised:
    Traceback (most recent call last):
      File "/home/stefan/autotest/temp/python24-zope210/lib/python/zope/testing/doctest.py", line 1348, in __run
        compileflags, 1) in test.globs
      File "<doctest markup.txt[1]>", line 1, in ?
        self.browser.open('http://nohost/plone/@@markup-controlpanel')
      File "/home/stefan/autotest/temp/python24-zope210/lib/python/zope/testbrowser/browser.py", line 224, in open
        self.mech_browser.open(url, data)
      File "/home/stefan/autotest/temp/python24-zope210/lib/python/mechanize/_mechanize.py", line 177, in open
        return self._mech_open(url, data)
      File "/home/stefan/autotest/temp/python24-zope210/lib/python/mechanize/_mechanize.py", line 219, in _mech_open
        raise error
    HTTPError: HTTP Error 500: Internal Server Error



Failure in test test_initPortletNode_i18n (plone.app.portlets.tests.test_exportimport.TestImportPortlets)
Traceback (most recent call last):
  File "/home/stefan/autotest/temp/python24-zope210/lib/python/Testing/ZopeTestCase/profiler.py", line 98, in __call__
    testMethod()
  File "/home/stefan/autotest/temp/python24-zope210-cmf21-plone31/lib/python/plone/app/portlets/tests/test_exportimport.py", line 109, in test_initPortletNode_i18n
    self.failUnless(isinstance(portlet.title, Message))
  File "/usr/local/python2.4/lib/python2.4/unittest.py", line 309, in failUnless
    if not expr: raise self.failureException, msg
AssertionError



Failure in test /home/stefan/autotest/temp/python24-zope210-cmf21-plone31/lib/python/plone/app/workflow/tests/sharingpage.txt
Failed doctest test for sharingpage.txt
  File "/home/stefan/autotest/temp/python24-zope210-cmf21-plone31/lib/python/plone/app/workflow/tests/sharingpage.txt", line 0

----------------------------------------------------------------------
File "/home/stefan/autotest/temp/python24-zope210-cmf21-plone31/lib/python/plone/app/workflow/tests/sharingpage.txt", line 53, in sharingpage.txt
Failed example:
    browser.getLink('Sharing').click()
Exception raised:
    Traceback (most recent call last):
      File "/home/stefan/autotest/temp/python24-zope210/lib/python/zope/testing/doctest.py", line 1348, in __run
        compileflags, 1) in test.globs
      File "<doctest sharingpage.txt[15]>", line 1, in ?
        browser.getLink('Sharing').click()
      File "/home/stefan/autotest/temp/python24-zope210/lib/python/zope/testbrowser/browser.py", line 397, in click
        self.browser.mech_browser.follow_link(self.mech_link)
      File "/home/stefan/autotest/temp/python24-zope210/lib/python/mechanize/_mechanize.py", line 448, in follow_link
        return self.open(self.click_link(link, **kwds))
      File "/home/stefan/autotest/temp/python24-zope210/lib/python/mechanize/_mechanize.py", line 177, in open
        return self._mech_open(url, data)
      File "/home/stefan/autotest/temp/python24-zope210/lib/python/mechanize/_mechanize.py", line 202, in _mech_open
        response = UserAgent.open(self, self.request, data)
      File "/home/stefan/autotest/temp/python24-zope210/lib/python/mechanize/_opener.py", line 234, in open
        response = urlopen(self, req, data)
      File "/usr/local/python2.4/lib/python2.4/urllib2.py", line 376, in _open
        '_open', req)
      File "/usr/local/python2.4/lib/python2.4/urllib2.py", line 337, in _call_chain
        result = func(*args)
      File "/home/stefan/autotest/temp/python24-zope210/lib/python/Products/Five/testbrowser.py", line 64, in http_open
        return self.do_open(PublisherConnection, req)
      File "/usr/local/python2.4/lib/python2.4/urllib2.py", line 993, in do_open
        h.request(req.get_method(), req.get_selector(), req.data, headers)
      File "/home/stefan/autotest/temp/python24-zope210/lib/python/zope/testbrowser/testing.py", line 80, in request
        self.response = self.caller(request_string, handle_errors)
      File "/home/stefan/autotest/temp/python24-zope210/lib/python/Testing/ZopeTestCase/functional.py", line 38, in wrapped_func
        return func(*args, **kw)
      File "/home/stefan/autotest/temp/python24-zope210/lib/python/Testing/ZopeTestCase/zopedoctest/functional.py", line 182, in http
        debug=not handle_errors,
      File "/home/stefan/autotest/temp/python24-zope210/lib/python/ZPublisher/Test.py", line 199, in publish_module
        response = publish(request, module_name, after_list, debug=debug)
      File "/home/stefan/autotest/temp/python24-zope210/lib/python/ZPublisher/Publish.py", line 150, in publish
        sys.exc_info()[2],
      File "/home/stefan/autotest/temp/python24-zope210/lib/python/Zope2/App/startup.py", line 221, in zpublisher_exception_hook
        f(client, REQUEST, t, v, traceback, error_log_url=error_log_url)
      File "/home/stefan/autotest/temp/python24-zope210/lib/python/ZPublisher/Publish.py", line 119, in publish
        request, bind=1)
      File "/home/stefan/autotest/temp/python24-zope210/lib/python/ZPublisher/mapply.py", line 88, in mapply
        if debug is not None: return debug(object,args,context)
      File "/home/stefan/autotest/temp/python24-zope210/lib/python/ZPublisher/Publish.py", line 42, in call_object
        result=apply(object,args) # Type s<cr> to step into published object.
      File "/home/stefan/autotest/temp/python24-zope210-cmf21-plone31/lib/python/plone/app/workflow/browser/sharing.py", line 74, in __call__
        return self.template()
      File "/home/stefan/autotest/temp/python24-zope210/lib/python/Shared/DC/Scripts/Bindings.py", line 313, in __call__
        return self._bindAndExec(args, kw, None)
      File "/home/stefan/autotest/temp/python24-zope210/lib/python/Shared/DC/Scripts/Bindings.py", line 350, in _bindAndExec
        return self._exec(bound_data, args, kw)
      File "/home/stefan/autotest/temp/python24-zope210/lib/python/Products/PageTemplates/PageTemplateFile.py", line 129, in _exec
        return self.pt_render(extra_context=bound_names)
      File "/home/stefan/autotest/temp/python24-zope210/lib/python/Products/PageTemplates/PageTemplate.py", line 89, in pt_render
        return super(PageTemplate, self).pt_render(c, source=source)
      File "/home/stefan/autotest/temp/python24-zope210/lib/python/zope/pagetemplate/pagetemplate.py", line 117, in pt_render
        strictinsert=0, sourceAnnotations=sourceAnnotations)()
      File "/home/stefan/autotest/temp/python24-zope210/lib/python/zope/tal/talinterpreter.py", line 271, in __call__
        self.interpret(self.program)
      File "/home/stefan/autotest/temp/python24-zope210/lib/python/zope/tal/talinterpreter.py", line 346, in interpret
        handlers[opcode](self, args)
      File "/home/stefan/autotest/temp/python24-zope210/lib/python/zope/tal/talinterpreter.py", line 891, in do_useMacro
        self.interpret(macro)
      File "/home/stefan/autotest/temp/python24-zope210/lib/python/zope/tal/talinterpreter.py", line 346, in interpret
        handlers[opcode](self, args)
      File "/home/stefan/autotest/temp/python24-zope210/lib/python/zope/tal/talinterpreter.py", line 536, in do_optTag_tal
        self.do_optTag(stuff)
      File "/home/stefan/autotest/temp/python24-zope210/lib/python/zope/tal/talinterpreter.py", line 521, in do_optTag
        return self.no_tag(start, program)
      File "/home/stefan/autotest/temp/python24-zope210/lib/python/zope/tal/talinterpreter.py", line 516, in no_tag
        self.interpret(program)
      File "/home/stefan/autotest/temp/python24-zope210/lib/python/zope/tal/talinterpreter.py", line 346, in interpret
        handlers[opcode](self, args)
      File "/home/stefan/autotest/temp/python24-zope210/lib/python/zope/tal/talinterpreter.py", line 891, in do_useMacro
        self.interpret(macro)
      File "/home/stefan/autotest/temp/python24-zope210/lib/python/zope/tal/talinterpreter.py", line 346, in interpret
        handlers[opcode](self, args)
      File "/home/stefan/autotest/temp/python24-zope210/lib/python/zope/tal/talinterpreter.py", line 536, in do_optTag_tal
        self.do_optTag(stuff)
      File "/home/stefan/autotest/temp/python24-zope210/lib/python/zope/tal/talinterpreter.py", line 521, in do_optTag
        return self.no_tag(start, program)
      File "/home/stefan/autotest/temp/python24-zope210/lib/python/zope/tal/talinterpreter.py", line 516, in no_tag
        self.interpret(program)
      File "/home/stefan/autotest/temp/python24-zope210/lib/python/zope/tal/talinterpreter.py", line 346, in interpret
        handlers[opcode](self, args)
      File "/home/stefan/autotest/temp/python24-zope210/lib/python/zope/tal/talinterpreter.py", line 957, in do_defineSlot
        self.interpret(block)
      File "/home/stefan/autotest/temp/python24-zope210/lib/python/zope/tal/talinterpreter.py", line 346, in interpret
        handlers[opcode](self, args)
      File "/home/stefan/autotest/temp/python24-zope210/lib/python/zope/tal/talinterpreter.py", line 536, in do_optTag_tal
        self.do_optTag(stuff)
      File "/home/stefan/autotest/temp/python24-zope210/lib/python/zope/tal/talinterpreter.py", line 521, in do_optTag
        return self.no_tag(start, program)
      File "/home/stefan/autotest/temp/python24-zope210/lib/python/zope/tal/talinterpreter.py", line 516, in no_tag
        self.interpret(program)
      File "/home/stefan/autotest/temp/python24-zope210/lib/python/zope/tal/talinterpreter.py", line 346, in interpret
        handlers[opcode](self, args)
      File "/home/stefan/autotest/temp/python24-zope210/lib/python/zope/tal/talinterpreter.py", line 861, in do_defineMacro
        self.interpret(macro)
      File "/home/stefan/autotest/temp/python24-zope210/lib/python/zope/tal/talinterpreter.py", line 346, in interpret
        handlers[opcode](self, args)
      File "/home/stefan/autotest/temp/python24-zope210/lib/python/zope/tal/talinterpreter.py", line 949, in do_defineSlot
        self.interpret(slot)
      File "/home/stefan/autotest/temp/python24-zope210/lib/python/zope/tal/talinterpreter.py", line 346, in interpret
        handlers[opcode](self, args)
      File "/home/stefan/autotest/temp/python24-zope210/lib/python/zope/tal/talinterpreter.py", line 536, in do_optTag_tal
        self.do_optTag(stuff)
      File "/home/stefan/autotest/temp/python24-zope210/lib/python/zope/tal/talinterpreter.py", line 521, in do_optTag
        return self.no_tag(start, program)
      File "/home/stefan/autotest/temp/python24-zope210/lib/python/zope/tal/talinterpreter.py", line 516, in no_tag
        self.interpret(program)
      File "/home/stefan/autotest/temp/python24-zope210/lib/python/zope/tal/talinterpreter.py", line 346, in interpret
        handlers[opcode](self, args)
      File "/home/stefan/autotest/temp/python24-zope210/lib/python/zope/tal/talinterpreter.py", line 949, in do_defineSlot
        self.interpret(slot)
      File "/home/stefan/autotest/temp/python24-zope210/lib/python/zope/tal/talinterpreter.py", line 346, in interpret
        handlers[opcode](self, args)
      File "/home/stefan/autotest/temp/python24-zope210/lib/python/zope/tal/talinterpreter.py", line 534, in do_optTag_tal
        self.no_tag(stuff[-2], stuff[-1])
      File "/home/stefan/autotest/temp/python24-zope210/lib/python/zope/tal/talinterpreter.py", line 516, in no_tag
        self.interpret(program)
      File "/home/stefan/autotest/temp/python24-zope210/lib/python/zope/tal/talinterpreter.py", line 346, in interpret
        handlers[opcode](self, args)
      File "/home/stefan/autotest/temp/python24-zope210/lib/python/zope/tal/talinterpreter.py", line 745, in do_insertStructure_tal
        structure = self.engine.evaluateStructure(expr)
      File "/home/stefan/autotest/temp/python24-zope210/lib/python/Products/PageTemplates/Expressions.py", line 221, in evaluateStructure
        text = super(ZopeContext, self).evaluateStructure(expr)
      File "/home/stefan/autotest/temp/python24-zope210/lib/python/zope/tales/tales.py", line 696, in evaluate
        return expression(self)
      File "/home/stefan/autotest/temp/python24-zope210/lib/python/zope/tales/expressions.py", line 217, in __call__
        return self._eval(econtext)
      File "/home/stefan/autotest/temp/python24-zope210/lib/python/Products/PageTemplates/Expressions.py", line 161, in _eval
        return render(ob, econtext.vars)
      File "/home/stefan/autotest/temp/python24-zope210/lib/python/Products/PageTemplates/Expressions.py", line 123, in render
        ob = ob()
      File "/home/stefan/autotest/temp/python24-zope210-cmf21-plone31/lib/python/plone/protect/authenticator.py", line 45, in authenticator
        manager=getUtility(IKeyManager)
      File "/home/stefan/autotest/temp/python24-zope210/lib/python/zope/component/_api.py", line 207, in getUtility
        raise ComponentLookupError(interface, name)
    ComponentLookupError: <!DOCTYPE html PUBLIC "-//W3C//DTD XHTML 1.0 Transitional//EN" "http://www.w3.org/TR/xhtml1/DTD/xhtml1-transitional.dtd">



    <html xmlns="http://www.w3.org/1999/xhtml" xml:lang="en"
          lang="en">

      
        
        
        
        
        

      

      <head>

        <meta http-equiv="Content-Type"
              content="text/html;charset=utf-8" />

        
          <base href="http://nohost/plone/Members/test_user_1_/" /><!--[if lt IE 7]></base><![endif]-->
        

        <meta name="generator" content="Plone - http://plone.org" />

        <link rel="kss-base-url" href="http://nohost/plone/Members/test_user_1_" />

      
      
        
          <script type="text/javascript"
                  src="http://nohost/plone/portal_javascripts/Plone%20Default/jquery-cachekey0625.js">
          </script>
        
        
      

      
        
          <script type="text/javascript"
                  src="http://nohost/plone/portal_javascripts/Plone%20Default/dropdown-cachekey5292.js">
          </script>
        
        
      

      
        
          <script type="text/javascript"
                  src="http://nohost/plone/portal_javascripts/Plone%20Default/resourcebase2-dom-fp-cachekey6237.js">
          </script>
        
        
      

      
        
          <script type="text/javascript"
                  src="http://nohost/plone/portal_javascripts/Plone%20Default/resourcekukit-cachekey1061.js">
          </script>
        
        
      

      
      
        
        
          <style type="text/css" media="screen"><!-- @import url(http://nohost/plone/portal_css/Plone%20Default/member-cachekey5690.css); --></style>
        
        
      

      
        
        
          <style type="text/css"><!-- @import url(http://nohost/plone/portal_css/Plone%20Default/base-cachekey8216.css); --></style>
        
        
      

      
      <link rel="kinetic-stylesheet" type="text/css"
            href="http://nohost/plone/portal_kss/Plone%20Default/at-cachekey1846.kss" />


    <title>test_user_1_ &mdash; Plone site</title>


        <!-- Internet Explorer CSS Fixes -->
        <!--[if IE]>
            <style type="text/css" media="all">@import url(http://nohost/plone/IEFixes.css);</style>
        <![endif]-->

        
        <link rel="author"
              href="http://nohost/plone/author/portal_owner"
              title="Author information" />



        <link rel="shortcut icon" type="image/x-icon"
              href="http://nohost/plone/favicon.ico" />



        <link rel="home" href="http://nohost/plone"
              title="Front page" />

        <link rel="contents" href="http://nohost/plone/sitemap"
              title="Site Map" />






        <link rel="search"
              href="http://nohost/plone/search_form"
              title="Search this site" />



        <!-- Disable IE6 image toolbar -->
        <meta http-equiv="imagetoolbar" content="no" />
        
        
        

        
        

        
        

        
        

      </head>

      <body class="section-Members template-default_error_message"
            dir="ltr">
        <div id="visual-portal-wrapper">

          <div id="portal-top">
            <div id="portal-header">
    <p class="hiddenStructure">
      <a accesskey="2"
         href="http://nohost/plone/Members/test_user_1_/@@sharing#documentContent">Skip to content.</a> |

      <a accesskey="6"
         href="http://nohost/plone/Members/test_user_1_/@@sharing#portlet-navigation-tree">Skip to navigation</a>
    </p>

    <ul id="portal-siteactions">

        <li id="siteaction-sitemap"><a
        href="http://nohost/plone/sitemap" accesskey="3"
        title="Site Map">Site Map</a></li>
        <li id="siteaction-accessibility"><a
        href="http://nohost/plone/accessibility-info"
        accesskey="0" title="Accessibility">Accessibility</a></li>
        <li id="siteaction-contact"><a
        href="http://nohost/plone/contact-info" accesskey="9"
        title="Contact">Contact</a></li>
        <li id="siteaction-plone_setup"><a
        href="http://nohost/plone/plone_control_panel"
        accesskey="" title="Site Setup">Site Setup</a></li>

    </ul>

    <div id="portal-searchbox">
        <form name="searchform"
              action="http://nohost/plone/search">

            <label for="searchGadget" class="hiddenStructure">Search Site</label>

            <div class="LSBox">
            <input name="SearchableText" type="text" size="18"
                   title="Search Site" accesskey="4"
                   class="inputLabel" id="searchGadget" />

            <input class="searchButton" type="submit"
                   value="Search" />
        
            <div class="searchSection">
                <input id="searchbox_currentfolder_only"
                       class="noborder" type="checkbox"
                       name="path"
                       value="/plone/Members/test_user_1_" />
                <label for="searchbox_currentfolder_only"
                       style="cursor: pointer">
                    only in current section
                </label>
            </div>

            <div class="LSResult" id="LSResult" style=""><div class="LSShadow" id="LSShadow"></div></div>
            </div>
        </form>

        <div id="portal-advanced-search" class="hiddenStructure">
            <a href="http://nohost/plone/search_form"
               accesskey="5">
                Advanced Search&hellip;
            </a>
        </div>

    </div>

    <a id="portal-logo" accesskey="1" href="http://nohost/plone">
        <img src="http://nohost/plone/logo.jpg" alt="" title="Plone" height="57" width="252" /></a>


        <h5 class="hiddenStructure">Sections</h5>

        <ul id="portal-globalnav">
            <li id="portaltab-index_html" class="plain">
                <a href="http://nohost/plone" title="">Home</a></li>
            <li id="portaltab-Members" class="selected">
                <a href="http://nohost/plone/Members"
                   title="Container for users' home directories">Users</a></li>
            <li id="portaltab-news" class="plain">
                <a href="http://nohost/plone/news"
                   title="Site News">News</a></li>
            <li id="portaltab-events" class="plain">
                <a href="http://nohost/plone/events"
                   title="Site Events">Events</a></li>
        </ul>

    </div>

    <div id="portal-personaltools-wrapper">

    <h5 class="hiddenStructure">Personal tools</h5>

    <ul id="portal-personaltools" class="visualInline">
       
           <li><a id="user-name"
                  href="http://nohost/plone/dashboard"><img src="http://nohost/plone/user.gif" alt="" title="User" height="16" width="16" />
                <span class="visualCaseSensitive">manager</span></a></li>
       

        
            <li>
                <a href="http://nohost/plone/logout">Log out</a>
            </li>
        

    </ul>
    </div>


        


    <div id="portal-breadcrumbs">

        <span id="breadcrumbs-you-are-here">You
    are here:</span>
        <a href="http://nohost/plone">Home</a>
        <span class="breadcrumbSeparator">
            &rarr;
            
        </span>
        <span dir="ltr">
            
                <a href="http://nohost/plone/Members">Users</a>
                <span class="breadcrumbSeparator">
                    &rarr;
                    
                </span>
                
             
        </span>
        <span dir="ltr">
            
                
                
                <span>test_user_1_</span>
             
        </span>

    </div>

          </div>

          <div class="visualClear" id="clear-space-before-wrapper-table"><!-- --></div>

          <table id="portal-columns">
            <tbody>
              <tr>
                
                
                

                
                <td id="portal-column-content">

                  
                    <div class="">

                      


                      <div id="region-content" class="documentContent">

                        <span id="contentTopLeft"></span>
                        <span id="contentTopRight"></span>
                        
                        <a name="documentContent"></a>

                        

        <dl class="portalMessage info" id="kssPortalMessage" style="display:none">
            <dt>Info</dt>
            <dd></dd>
        </dl>


                        
                        <div id="viewlet-above-content"><div id="plone-lock-status">
      
    </div>
    </div>

                        
                        
                        
                          
                          <div>

            

            <div>

                <h1 class="documentFirstHeading">
                    We're sorry, but there seems to be an error&hellip;
                </h1>

                
                    
                    
                    
                
                    <p>
                    Since you are a site administrator, you can
                    <span> <a href="http://nohost/plone/error_log/showEntry?id=1209959562.430.876054149018">see the full error message</a> </span>
                    </p>

                

                

            </div>
            

    </div>
                        
                        

                        
                        
                          

                        
                        

                        <span id="contentBottomLeft"></span>
                        <span id="contentBottomRight"></span>

                      </div>

                    </div>

                  
                </td>
                

                
                
                
              </tr>
            </tbody>
          </table>
          

          <div class="visualClear" id="clear-space-before-footer"><!-- --></div>
          
          <div>
              <a class="managePortletsFallback"
                 href="http://nohost/plone/Members/test_user_1_/@@manage-portlets">
                 Manage portlets
              </a>
          </div>

          

            <div id="portal-footer">

    <p>
        
        The
        <a href="http://plone.org">Plone<sup>&reg;</sup> CMS &mdash; Open Source Content Management System</a>
        is
        <acronym title="Copyright">&copy;</acronym>
        2000-2008
        by the
        <a href="http://plone.org/foundation">Plone Foundation</a>
        et al.
        
    </p>

    <p>
        
        Plone<sup>&reg;</sup> and the Plone logo are registered trademarks of the
            <a href="http://plone.org/foundation">Plone Foundation</a>.
        

        
        Distributed under the
            <a href="http://creativecommons.org/licenses/GPL/2.0/">GNU GPL license</a>.
        
    </p>

    </div>

      <div id="portal-colophon">
          

          

          <div class="colophonWrapper">
          <ul>
            <li>
              <a href="http://plone.org"
                 title="This site was built using Plone CMS, the Open Source Content Management System. Click for more information.">
                Powered by Plone</a>
            </li>
            <li>
              <a href="http://validator.w3.org/check/referer"
                 title="This site is valid XHTML.">
                Valid XHTML</a>
            </li>
            <li>
              <a href="http://jigsaw.w3.org/css-validator/check/referer&amp;warning=no&amp;profile=css3&amp;usermedium=all"
                 title="This site was built with valid CSS.">
                Valid CSS</a>
            </li>
            <li>
              <a href="http://www.section508.gov"
                 title="This site conforms to the US Government Section 508 Accessibility Guidelines.">
                Section 508</a>
            </li>
            <li>
              <a href="http://www.w3.org/WAI/WCAG1AA-Conformance"
                 title="This site conforms to the W3C-WAI Web Content Accessibility Guidelines.">
                WCAG</a>
            </li>
          </ul>
          </div>

        </div>



          

          <div class="visualClear"><!-- --></div>
        </div>
    <div id="kss-spinner"><img alt=""
                               src="http://nohost/plone/spinner.gif" /></div>
    </body>
    </html>



/home/stefan/autotest/temp/python24-zope210/lib/python/zope/configuration/fields.py:417: UserWarning: You did not specify an i18n translation domain for the 'description' field in <string>
  warnings.warn(
/home/stefan/autotest/temp/python24-zope210/lib/python/zope/configuration/fields.py:417: UserWarning: You did not specify an i18n translation domain for the 'title' field in <string>
  warnings.warn(
  Ran 748 tests with 13 failures and 0 errors in 218.975 seconds.
Running plone.app.contentrules.tests.test_configuration.TestContentrulesGSLayer tests:
  Set up plone.app.contentrules.tests.test_configuration.TestContentrulesGSLayer in 0.498 seconds.
  Ran 6 tests with 0 failures and 0 errors in 1.511 seconds.
Running plone.app.customerize.tests.layer.PloneCustomerize tests:
  Tear down plone.app.contentrules.tests.test_configuration.TestContentrulesGSLayer in 0.005 seconds.
  Set up plone.app.customerize.tests.layer.PloneCustomerize in 0.000 seconds.
  Ran 11 tests with 0 failures and 0 errors in 6.258 seconds.
Running plone.app.kss.tests.kss_and_plone_layer.KSSAndPloneLayer tests:
  Tear down plone.app.customerize.tests.layer.PloneCustomerize in 0.000 seconds.
  Set up plone.app.kss.tests.kss_and_plone_layer.KSSAndPloneLayer in 0.012 seconds.
  Ran 13 tests with 0 failures and 0 errors in 3.392 seconds.
Running plone.app.linkintegrity.tests.layer.PloneLinkintegrity tests:
  Tear down plone.app.kss.tests.kss_and_plone_layer.KSSAndPloneLayer in 0.000 seconds.
  Set up plone.app.linkintegrity.tests.layer.PloneLinkintegrity in 1.414 seconds.


Failure in test /home/stefan/autotest/temp/python24-zope210-cmf21-plone31/lib/python/plone/app/linkintegrity/docs/testRemovalsWithYesToAll.txt
Failed doctest test for testRemovalsWithYesToAll.txt
  File "/home/stefan/autotest/temp/python24-zope210-cmf21-plone31/lib/python/plone/app/linkintegrity/docs/testRemovalsWithYesToAll.txt", line 0

----------------------------------------------------------------------
File "/home/stefan/autotest/temp/python24-zope210-cmf21-plone31/lib/python/plone/app/linkintegrity/docs/testRemovalsWithYesToAll.txt", line 19, in testRemovalsWithYesToAll.txt
Failed example:
    browser.open('http://nohost/plone/folder_contents')
Exception raised:
    Traceback (most recent call last):
      File "/home/stefan/autotest/temp/python24-zope210/lib/python/zope/testing/doctest.py", line 1348, in __run
        compileflags, 1) in test.globs
      File "<doctest testRemovalsWithYesToAll.txt[8]>", line 1, in ?
        browser.open('http://nohost/plone/folder_contents')
      File "/home/stefan/autotest/temp/python24-zope210/lib/python/zope/testbrowser/browser.py", line 224, in open
        self.mech_browser.open(url, data)
      File "/home/stefan/autotest/temp/python24-zope210/lib/python/mechanize/_mechanize.py", line 177, in open
        return self._mech_open(url, data)
      File "/home/stefan/autotest/temp/python24-zope210/lib/python/mechanize/_mechanize.py", line 219, in _mech_open
        raise error
    HTTPError: HTTP Error 500: Internal Server Error



Failure in test /home/stefan/autotest/temp/python24-zope210-cmf21-plone31/lib/python/plone/app/linkintegrity/docs/testCircularReferencesWithHelper.txt
Failed doctest test for testCircularReferencesWithHelper.txt
  File "/home/stefan/autotest/temp/python24-zope210-cmf21-plone31/lib/python/plone/app/linkintegrity/docs/testCircularReferencesWithHelper.txt", line 0

----------------------------------------------------------------------
File "/home/stefan/autotest/temp/python24-zope210-cmf21-plone31/lib/python/plone/app/linkintegrity/docs/testCircularReferencesWithHelper.txt", line 20, in testCircularReferencesWithHelper.txt
Failed example:
    browser.open('http://nohost/plone/folder_contents')
Exception raised:
    Traceback (most recent call last):
      File "/home/stefan/autotest/temp/python24-zope210/lib/python/zope/testing/doctest.py", line 1348, in __run
        compileflags, 1) in test.globs
      File "<doctest testCircularReferencesWithHelper.txt[9]>", line 1, in ?
        browser.open('http://nohost/plone/folder_contents')
      File "/home/stefan/autotest/temp/python24-zope210/lib/python/zope/testbrowser/browser.py", line 224, in open
        self.mech_browser.open(url, data)
      File "/home/stefan/autotest/temp/python24-zope210/lib/python/mechanize/_mechanize.py", line 177, in open
        return self._mech_open(url, data)
      File "/home/stefan/autotest/temp/python24-zope210/lib/python/mechanize/_mechanize.py", line 219, in _mech_open
        raise error
    HTTPError: HTTP Error 500: Internal Server Error



Failure in test /home/stefan/autotest/temp/python24-zope210-cmf21-plone31/lib/python/plone/app/linkintegrity/docs/testReferalToPrivateFiles.txt
Failed doctest test for testReferalToPrivateFiles.txt
  File "/home/stefan/autotest/temp/python24-zope210-cmf21-plone31/lib/python/plone/app/linkintegrity/docs/testReferalToPrivateFiles.txt", line 0

----------------------------------------------------------------------
File "/home/stefan/autotest/temp/python24-zope210-cmf21-plone31/lib/python/plone/app/linkintegrity/docs/testReferalToPrivateFiles.txt", line 33, in testReferalToPrivateFiles.txt
Failed example:
    browser.open('http://nohost/plone/folder_contents')
Exception raised:
    Traceback (most recent call last):
      File "/home/stefan/autotest/temp/python24-zope210/lib/python/zope/testing/doctest.py", line 1348, in __run
        compileflags, 1) in test.globs
      File "<doctest testReferalToPrivateFiles.txt[16]>", line 1, in ?
        browser.open('http://nohost/plone/folder_contents')
      File "/home/stefan/autotest/temp/python24-zope210/lib/python/zope/testbrowser/browser.py", line 224, in open
        self.mech_browser.open(url, data)
      File "/home/stefan/autotest/temp/python24-zope210/lib/python/mechanize/_mechanize.py", line 177, in open
        return self._mech_open(url, data)
      File "/home/stefan/autotest/temp/python24-zope210/lib/python/mechanize/_mechanize.py", line 219, in _mech_open
        raise error
    HTTPError: HTTP Error 500: Internal Server Error



Failure in test /home/stefan/autotest/temp/python24-zope210-cmf21-plone31/lib/python/plone/app/linkintegrity/docs/testRenamingReferencedItem.txt
Failed doctest test for testRenamingReferencedItem.txt
  File "/home/stefan/autotest/temp/python24-zope210-cmf21-plone31/lib/python/plone/app/linkintegrity/docs/testRenamingReferencedItem.txt", line 0

----------------------------------------------------------------------
File "/home/stefan/autotest/temp/python24-zope210-cmf21-plone31/lib/python/plone/app/linkintegrity/docs/testRenamingReferencedItem.txt", line 11, in testRenamingReferencedItem.txt
Failed example:
    browser.open('http://nohost/plone/folder_contents')
Exception raised:
    Traceback (most recent call last):
      File "/home/stefan/autotest/temp/python24-zope210/lib/python/zope/testing/doctest.py", line 1348, in __run
        compileflags, 1) in test.globs
      File "<doctest testRenamingReferencedItem.txt[4]>", line 1, in ?
        browser.open('http://nohost/plone/folder_contents')
      File "/home/stefan/autotest/temp/python24-zope210/lib/python/zope/testbrowser/browser.py", line 224, in open
        self.mech_browser.open(url, data)
      File "/home/stefan/autotest/temp/python24-zope210/lib/python/mechanize/_mechanize.py", line 177, in open
        return self._mech_open(url, data)
      File "/home/stefan/autotest/temp/python24-zope210/lib/python/mechanize/_mechanize.py", line 219, in _mech_open
        raise error
    HTTPError: HTTP Error 500: Internal Server Error



Failure in test /home/stefan/autotest/temp/python24-zope210-cmf21-plone31/lib/python/plone/app/linkintegrity/docs/testRemovalInSubfolder.txt
Failed doctest test for testRemovalInSubfolder.txt
  File "/home/stefan/autotest/temp/python24-zope210-cmf21-plone31/lib/python/plone/app/linkintegrity/docs/testRemovalInSubfolder.txt", line 0

----------------------------------------------------------------------
File "/home/stefan/autotest/temp/python24-zope210-cmf21-plone31/lib/python/plone/app/linkintegrity/docs/testRemovalInSubfolder.txt", line 16, in testRemovalInSubfolder.txt
Failed example:
    browser.open('http://nohost/plone/folder_contents')
Exception raised:
    Traceback (most recent call last):
      File "/home/stefan/autotest/temp/python24-zope210/lib/python/zope/testing/doctest.py", line 1348, in __run
        compileflags, 1) in test.globs
      File "<doctest testRemovalInSubfolder.txt[5]>", line 1, in ?
        browser.open('http://nohost/plone/folder_contents')
      File "/home/stefan/autotest/temp/python24-zope210/lib/python/zope/testbrowser/browser.py", line 224, in open
        self.mech_browser.open(url, data)
      File "/home/stefan/autotest/temp/python24-zope210/lib/python/mechanize/_mechanize.py", line 177, in open
        return self._mech_open(url, data)
      File "/home/stefan/autotest/temp/python24-zope210/lib/python/mechanize/_mechanize.py", line 219, in _mech_open
        raise error
    HTTPError: HTTP Error 500: Internal Server Error



Failure in test /home/stefan/autotest/temp/python24-zope210-cmf21-plone31/lib/python/plone/app/linkintegrity/docs/testRemovalOfReferenceChain.txt
Failed doctest test for testRemovalOfReferenceChain.txt
  File "/home/stefan/autotest/temp/python24-zope210-cmf21-plone31/lib/python/plone/app/linkintegrity/docs/testRemovalOfReferenceChain.txt", line 0

----------------------------------------------------------------------
File "/home/stefan/autotest/temp/python24-zope210-cmf21-plone31/lib/python/plone/app/linkintegrity/docs/testRemovalOfReferenceChain.txt", line 21, in testRemovalOfReferenceChain.txt
Failed example:
    browser.open('http://nohost/plone/folder_contents')
Exception raised:
    Traceback (most recent call last):
      File "/home/stefan/autotest/temp/python24-zope210/lib/python/zope/testing/doctest.py", line 1348, in __run
        compileflags, 1) in test.globs
      File "<doctest testRemovalOfReferenceChain.txt[8]>", line 1, in ?
        browser.open('http://nohost/plone/folder_contents')
      File "/home/stefan/autotest/temp/python24-zope210/lib/python/zope/testbrowser/browser.py", line 224, in open
        self.mech_browser.open(url, data)
      File "/home/stefan/autotest/temp/python24-zope210/lib/python/mechanize/_mechanize.py", line 177, in open
        return self._mech_open(url, data)
      File "/home/stefan/autotest/temp/python24-zope210/lib/python/mechanize/_mechanize.py", line 219, in _mech_open
        raise error
    HTTPError: HTTP Error 500: Internal Server Error



Failure in test /home/stefan/autotest/temp/python24-zope210-cmf21-plone31/lib/python/plone/app/linkintegrity/docs/testMultipleFilesRemoval.txt
Failed doctest test for testMultipleFilesRemoval.txt
  File "/home/stefan/autotest/temp/python24-zope210-cmf21-plone31/lib/python/plone/app/linkintegrity/docs/testMultipleFilesRemoval.txt", line 0

----------------------------------------------------------------------
File "/home/stefan/autotest/temp/python24-zope210-cmf21-plone31/lib/python/plone/app/linkintegrity/docs/testMultipleFilesRemoval.txt", line 21, in testMultipleFilesRemoval.txt
Failed example:
    browser.open('http://nohost/plone/folder_contents')
Exception raised:
    Traceback (most recent call last):
      File "/home/stefan/autotest/temp/python24-zope210/lib/python/zope/testing/doctest.py", line 1348, in __run
        compileflags, 1) in test.globs
      File "<doctest testMultipleFilesRemoval.txt[8]>", line 1, in ?
        browser.open('http://nohost/plone/folder_contents')
      File "/home/stefan/autotest/temp/python24-zope210/lib/python/zope/testbrowser/browser.py", line 224, in open
        self.mech_browser.open(url, data)
      File "/home/stefan/autotest/temp/python24-zope210/lib/python/mechanize/_mechanize.py", line 177, in open
        return self._mech_open(url, data)
      File "/home/stefan/autotest/temp/python24-zope210/lib/python/mechanize/_mechanize.py", line 219, in _mech_open
        raise error
    HTTPError: HTTP Error 500: Internal Server Error



Failure in test /home/stefan/autotest/temp/python24-zope210-cmf21-plone31/lib/python/plone/app/linkintegrity/docs/testCircularReferences.txt
Failed doctest test for testCircularReferences.txt
  File "/home/stefan/autotest/temp/python24-zope210-cmf21-plone31/lib/python/plone/app/linkintegrity/docs/testCircularReferences.txt", line 0

----------------------------------------------------------------------
File "/home/stefan/autotest/temp/python24-zope210-cmf21-plone31/lib/python/plone/app/linkintegrity/docs/testCircularReferences.txt", line 28, in testCircularReferences.txt
Failed example:
    browser.open('http://nohost/plone/folder_contents')
Exception raised:
    Traceback (most recent call last):
      File "/home/stefan/autotest/temp/python24-zope210/lib/python/zope/testing/doctest.py", line 1348, in __run
        compileflags, 1) in test.globs
      File "<doctest testCircularReferences.txt[11]>", line 1, in ?
        browser.open('http://nohost/plone/folder_contents')
      File "/home/stefan/autotest/temp/python24-zope210/lib/python/zope/testbrowser/browser.py", line 224, in open
        self.mech_browser.open(url, data)
      File "/home/stefan/autotest/temp/python24-zope210/lib/python/mechanize/_mechanize.py", line 177, in open
        return self._mech_open(url, data)
      File "/home/stefan/autotest/temp/python24-zope210/lib/python/mechanize/_mechanize.py", line 219, in _mech_open
        raise error
    HTTPError: HTTP Error 500: Internal Server Error



Failure in test /home/stefan/autotest/temp/python24-zope210-cmf21-plone31/lib/python/plone/app/linkintegrity/docs/testReferenceInRestructuredText.txt
Failed doctest test for testReferenceInRestructuredText.txt
  File "/home/stefan/autotest/temp/python24-zope210-cmf21-plone31/lib/python/plone/app/linkintegrity/docs/testReferenceInRestructuredText.txt", line 0

----------------------------------------------------------------------
File "/home/stefan/autotest/temp/python24-zope210-cmf21-plone31/lib/python/plone/app/linkintegrity/docs/testReferenceInRestructuredText.txt", line 16, in testReferenceInRestructuredText.txt
Failed example:
    browser.open('http://nohost/plone/folder_contents')
Exception raised:
    Traceback (most recent call last):
      File "/home/stefan/autotest/temp/python24-zope210/lib/python/zope/testing/doctest.py", line 1348, in __run
        compileflags, 1) in test.globs
      File "<doctest testReferenceInRestructuredText.txt[4]>", line 1, in ?
        browser.open('http://nohost/plone/folder_contents')
      File "/home/stefan/autotest/temp/python24-zope210/lib/python/zope/testbrowser/browser.py", line 224, in open
        self.mech_browser.open(url, data)
      File "/home/stefan/autotest/temp/python24-zope210/lib/python/mechanize/_mechanize.py", line 177, in open
        return self._mech_open(url, data)
      File "/home/stefan/autotest/temp/python24-zope210/lib/python/mechanize/_mechanize.py", line 219, in _mech_open
        raise error
    HTTPError: HTTP Error 500: Internal Server Error



Failure in test /home/stefan/autotest/temp/python24-zope210-cmf21-plone31/lib/python/plone/app/linkintegrity/docs/testRemovalTriggersConfirmation.txt
Failed doctest test for testRemovalTriggersConfirmation.txt
  File "/home/stefan/autotest/temp/python24-zope210-cmf21-plone31/lib/python/plone/app/linkintegrity/docs/testRemovalTriggersConfirmation.txt", line 0

----------------------------------------------------------------------
File "/home/stefan/autotest/temp/python24-zope210-cmf21-plone31/lib/python/plone/app/linkintegrity/docs/testRemovalTriggersConfirmation.txt", line 15, in testRemovalTriggersConfirmation.txt
Failed example:
    browser.open('http://nohost/plone/folder_contents')
Exception raised:
    Traceback (most recent call last):
      File "/home/stefan/autotest/temp/python24-zope210/lib/python/zope/testing/doctest.py", line 1348, in __run
        compileflags, 1) in test.globs
      File "<doctest testRemovalTriggersConfirmation.txt[6]>", line 1, in ?
        browser.open('http://nohost/plone/folder_contents')
      File "/home/stefan/autotest/temp/python24-zope210/lib/python/zope/testbrowser/browser.py", line 224, in open
        self.mech_browser.open(url, data)
      File "/home/stefan/autotest/temp/python24-zope210/lib/python/mechanize/_mechanize.py", line 177, in open
        return self._mech_open(url, data)
      File "/home/stefan/autotest/temp/python24-zope210/lib/python/mechanize/_mechanize.py", line 219, in _mech_open
        raise error
    HTTPError: HTTP Error 500: Internal Server Error



Failure in test /home/stefan/autotest/temp/python24-zope210-cmf21-plone31/lib/python/plone/app/linkintegrity/docs/testRemovalWithCookieAuth.txt
Failed doctest test for testRemovalWithCookieAuth.txt
  File "/home/stefan/autotest/temp/python24-zope210-cmf21-plone31/lib/python/plone/app/linkintegrity/docs/testRemovalWithCookieAuth.txt", line 0

----------------------------------------------------------------------
File "/home/stefan/autotest/temp/python24-zope210-cmf21-plone31/lib/python/plone/app/linkintegrity/docs/testRemovalWithCookieAuth.txt", line 22, in testRemovalWithCookieAuth.txt
Failed example:
    browser.getControl('Log in').click()
Exception raised:
    Traceback (most recent call last):
      File "/home/stefan/autotest/temp/python24-zope210/lib/python/zope/testing/doctest.py", line 1348, in __run
        compileflags, 1) in test.globs
      File "<doctest testRemovalWithCookieAuth.txt[8]>", line 1, in ?
        browser.getControl('Log in').click()
      File "/home/stefan/autotest/temp/python24-zope210/lib/python/zope/testbrowser/browser.py", line 586, in click
        self.browser._clickSubmit(self.mech_form, self.mech_control, (1,1))
      File "/home/stefan/autotest/temp/python24-zope210/lib/python/zope/testbrowser/browser.py", line 375, in _clickSubmit
        self.mech_browser.open(form.click(
      File "/home/stefan/autotest/temp/python24-zope210/lib/python/mechanize/_mechanize.py", line 177, in open
        return self._mech_open(url, data)
      File "/home/stefan/autotest/temp/python24-zope210/lib/python/mechanize/_mechanize.py", line 219, in _mech_open
        raise error
    HTTPError: HTTP Error 500: Internal Server Error



Failure in test /home/stefan/autotest/temp/python24-zope210-cmf21-plone31/lib/python/plone/app/linkintegrity/docs/testRemovalInReferenceChain.txt
Failed doctest test for testRemovalInReferenceChain.txt
  File "/home/stefan/autotest/temp/python24-zope210-cmf21-plone31/lib/python/plone/app/linkintegrity/docs/testRemovalInReferenceChain.txt", line 0

----------------------------------------------------------------------
File "/home/stefan/autotest/temp/python24-zope210-cmf21-plone31/lib/python/plone/app/linkintegrity/docs/testRemovalInReferenceChain.txt", line 21, in testRemovalInReferenceChain.txt
Failed example:
    browser.open('http://nohost/plone/folder_contents')
Exception raised:
    Traceback (most recent call last):
      File "/home/stefan/autotest/temp/python24-zope210/lib/python/zope/testing/doctest.py", line 1348, in __run
        compileflags, 1) in test.globs
      File "<doctest testRemovalInReferenceChain.txt[8]>", line 1, in ?
        browser.open('http://nohost/plone/folder_contents')
      File "/home/stefan/autotest/temp/python24-zope210/lib/python/zope/testbrowser/browser.py", line 224, in open
        self.mech_browser.open(url, data)
      File "/home/stefan/autotest/temp/python24-zope210/lib/python/mechanize/_mechanize.py", line 177, in open
        return self._mech_open(url, data)
      File "/home/stefan/autotest/temp/python24-zope210/lib/python/mechanize/_mechanize.py", line 219, in _mech_open
        raise error
    HTTPError: HTTP Error 500: Internal Server Error



Failure in test /home/stefan/autotest/temp/python24-zope210-cmf21-plone31/lib/python/plone/app/linkintegrity/docs/testInterReferences.txt
Failed doctest test for testInterReferences.txt
  File "/home/stefan/autotest/temp/python24-zope210-cmf21-plone31/lib/python/plone/app/linkintegrity/docs/testInterReferences.txt", line 0

----------------------------------------------------------------------
File "/home/stefan/autotest/temp/python24-zope210-cmf21-plone31/lib/python/plone/app/linkintegrity/docs/testInterReferences.txt", line 23, in testInterReferences.txt
Failed example:
    browser.open('http://nohost/plone/folder_contents')
Exception raised:
    Traceback (most recent call last):
      File "/home/stefan/autotest/temp/python24-zope210/lib/python/zope/testing/doctest.py", line 1348, in __run
        compileflags, 1) in test.globs
      File "<doctest testInterReferences.txt[10]>", line 1, in ?
        browser.open('http://nohost/plone/folder_contents')
      File "/home/stefan/autotest/temp/python24-zope210/lib/python/zope/testbrowser/browser.py", line 224, in open
        self.mech_browser.open(url, data)
      File "/home/stefan/autotest/temp/python24-zope210/lib/python/mechanize/_mechanize.py", line 177, in open
        return self._mech_open(url, data)
      File "/home/stefan/autotest/temp/python24-zope210/lib/python/mechanize/_mechanize.py", line 219, in _mech_open
        raise error
    HTTPError: HTTP Error 500: Internal Server Error



Failure in test /home/stefan/autotest/temp/python24-zope210-cmf21-plone31/lib/python/plone/app/linkintegrity/docs/testOnOffSwitch.txt
Failed doctest test for testOnOffSwitch.txt
  File "/home/stefan/autotest/temp/python24-zope210-cmf21-plone31/lib/python/plone/app/linkintegrity/docs/testOnOffSwitch.txt", line 0

----------------------------------------------------------------------
File "/home/stefan/autotest/temp/python24-zope210-cmf21-plone31/lib/python/plone/app/linkintegrity/docs/testOnOffSwitch.txt", line 13, in testOnOffSwitch.txt
Failed example:
    browser.open('http://nohost/plone/folder_contents')
Exception raised:
    Traceback (most recent call last):
      File "/home/stefan/autotest/temp/python24-zope210/lib/python/zope/testing/doctest.py", line 1348, in __run
        compileflags, 1) in test.globs
      File "<doctest testOnOffSwitch.txt[4]>", line 1, in ?
        browser.open('http://nohost/plone/folder_contents')
      File "/home/stefan/autotest/temp/python24-zope210/lib/python/zope/testbrowser/browser.py", line 224, in open
        self.mech_browser.open(url, data)
      File "/home/stefan/autotest/temp/python24-zope210/lib/python/mechanize/_mechanize.py", line 177, in open
        return self._mech_open(url, data)
      File "/home/stefan/autotest/temp/python24-zope210/lib/python/mechanize/_mechanize.py", line 219, in _mech_open
        raise error
    HTTPError: HTTP Error 500: Internal Server Error



Failure in test /home/stefan/autotest/temp/python24-zope210-cmf21-plone31/lib/python/plone/app/linkintegrity/docs/testMultipleFilesRemovalWithHelper.txt
Failed doctest test for testMultipleFilesRemovalWithHelper.txt
  File "/home/stefan/autotest/temp/python24-zope210-cmf21-plone31/lib/python/plone/app/linkintegrity/docs/testMultipleFilesRemovalWithHelper.txt", line 0

----------------------------------------------------------------------
File "/home/stefan/autotest/temp/python24-zope210-cmf21-plone31/lib/python/plone/app/linkintegrity/docs/testMultipleFilesRemovalWithHelper.txt", line 19, in testMultipleFilesRemovalWithHelper.txt
Failed example:
    browser.open('http://nohost/plone/folder_contents')
Exception raised:
    Traceback (most recent call last):
      File "/home/stefan/autotest/temp/python24-zope210/lib/python/zope/testing/doctest.py", line 1348, in __run
        compileflags, 1) in test.globs
      File "<doctest testMultipleFilesRemovalWithHelper.txt[7]>", line 1, in ?
        browser.open('http://nohost/plone/folder_contents')
      File "/home/stefan/autotest/temp/python24-zope210/lib/python/zope/testbrowser/browser.py", line 224, in open
        self.mech_browser.open(url, data)
      File "/home/stefan/autotest/temp/python24-zope210/lib/python/mechanize/_mechanize.py", line 177, in open
        return self._mech_open(url, data)
      File "/home/stefan/autotest/temp/python24-zope210/lib/python/mechanize/_mechanize.py", line 219, in _mech_open
        raise error
    HTTPError: HTTP Error 500: Internal Server Error



Failure in test /home/stefan/autotest/temp/python24-zope210-cmf21-plone31/lib/python/plone/app/linkintegrity/docs/testConfirmationPageIntegration.txt
Failed doctest test for testConfirmationPageIntegration.txt
  File "/home/stefan/autotest/temp/python24-zope210-cmf21-plone31/lib/python/plone/app/linkintegrity/docs/testConfirmationPageIntegration.txt", line 0

----------------------------------------------------------------------
File "/home/stefan/autotest/temp/python24-zope210-cmf21-plone31/lib/python/plone/app/linkintegrity/docs/testConfirmationPageIntegration.txt", line 11, in testConfirmationPageIntegration.txt
Failed example:
    browser.getLink('Delete').click()
Exception raised:
    Traceback (most recent call last):
      File "/home/stefan/autotest/temp/python24-zope210/lib/python/zope/testing/doctest.py", line 1348, in __run
        compileflags, 1) in test.globs
      File "<doctest testConfirmationPageIntegration.txt[3]>", line 1, in ?
        browser.getLink('Delete').click()
      File "/home/stefan/autotest/temp/python24-zope210/lib/python/zope/testbrowser/browser.py", line 397, in click
        self.browser.mech_browser.follow_link(self.mech_link)
      File "/home/stefan/autotest/temp/python24-zope210/lib/python/mechanize/_mechanize.py", line 448, in follow_link
        return self.open(self.click_link(link, **kwds))
      File "/home/stefan/autotest/temp/python24-zope210/lib/python/mechanize/_mechanize.py", line 177, in open
        return self._mech_open(url, data)
      File "/home/stefan/autotest/temp/python24-zope210/lib/python/mechanize/_mechanize.py", line 219, in _mech_open
        raise error
    HTTPError: HTTP Error 500: Internal Server Error



Failure in test /home/stefan/autotest/temp/python24-zope210-cmf21-plone31/lib/python/plone/app/linkintegrity/docs/testCancelDuringMultiRemoval.txt
Failed doctest test for testCancelDuringMultiRemoval.txt
  File "/home/stefan/autotest/temp/python24-zope210-cmf21-plone31/lib/python/plone/app/linkintegrity/docs/testCancelDuringMultiRemoval.txt", line 0

----------------------------------------------------------------------
File "/home/stefan/autotest/temp/python24-zope210-cmf21-plone31/lib/python/plone/app/linkintegrity/docs/testCancelDuringMultiRemoval.txt", line 23, in testCancelDuringMultiRemoval.txt
Failed example:
    browser.open('http://nohost/plone/folder_contents')
Exception raised:
    Traceback (most recent call last):
      File "/home/stefan/autotest/temp/python24-zope210/lib/python/zope/testing/doctest.py", line 1348, in __run
        compileflags, 1) in test.globs
      File "<doctest testCancelDuringMultiRemoval.txt[8]>", line 1, in ?
        browser.open('http://nohost/plone/folder_contents')
      File "/home/stefan/autotest/temp/python24-zope210/lib/python/zope/testbrowser/browser.py", line 224, in open
        self.mech_browser.open(url, data)
      File "/home/stefan/autotest/temp/python24-zope210/lib/python/mechanize/_mechanize.py", line 177, in open
        return self._mech_open(url, data)
      File "/home/stefan/autotest/temp/python24-zope210/lib/python/mechanize/_mechanize.py", line 219, in _mech_open
        raise error
    HTTPError: HTTP Error 500: Internal Server Error

  Ran 95 tests with 17 failures and 0 errors in 32.641 seconds.
Running plone.app.portlets.tests.test_configuration.TestPortletZCMLLayer tests:
  Tear down plone.app.linkintegrity.tests.layer.PloneLinkintegrity in 0.224 seconds.
  Set up plone.app.portlets.tests.test_configuration.TestPortletZCMLLayer in 0.016 seconds.
  Ran 5 tests with 0 failures and 0 errors in 0.059 seconds.
Running plone.app.portlets.tests.test_configuration.TestPortletGSLayer tests:
  Set up plone.app.portlets.tests.test_configuration.TestPortletGSLayer in 1.571 seconds.


Failure in test testPortletTypeRegistered (plone.app.portlets.tests.test_configuration.TestGenericSetup)
Traceback (most recent call last):
  File "/home/stefan/autotest/temp/python24-zope210/lib/python/Testing/ZopeTestCase/profiler.py", line 98, in __call__
    testMethod()
  File "/home/stefan/autotest/temp/python24-zope210-cmf21-plone31/lib/python/plone/app/portlets/tests/test_configuration.py", line 202, in testPortletTypeRegistered
    self.failUnless(isinstance(portlet_type.title, Message))
  File "/usr/local/python2.4/lib/python2.4/unittest.py", line 309, in failUnless
    if not expr: raise self.failureException, msg
AssertionError

  Ran 12 tests with 1 failures and 0 errors in 4.736 seconds.
Running plone.app.viewletmanager.tests.test_exportimport.Layer tests:
  Tear down plone.app.portlets.tests.test_configuration.TestPortletGSLayer in 0.000 seconds.
  Tear down plone.app.portlets.tests.test_configuration.TestPortletZCMLLayer in 0.000 seconds.
  Tear down Products.PloneTestCase.layer.PloneSite in 0.745 seconds.
  Tear down Products.PloneTestCase.layer.ZCML in 0.020 seconds.
  Set up plone.app.viewletmanager.tests.test_exportimport.Layer in 0.000 seconds.
Installing plone.app.form ... NOT FOUND
Installing plone.browserlayer ... NOT FOUND
  Ran 15 tests with 0 failures and 0 errors in 0.140 seconds.
Running plone.browserlayer.tests.test_doctest.PloneBrowserLayerLayer tests:
  Tear down plone.app.viewletmanager.tests.test_exportimport.Layer in 0.000 seconds.
  Set up Products.PloneTestCase.layer.ZCML in 4.358 seconds.
  Set up Products.PloneTestCase.layer.PloneSite in 9.920 seconds.
  Set up plone.browserlayer.tests.test_doctest.PloneBrowserLayerLayer in 0.010 seconds.
  Ran 9 tests with 0 failures and 0 errors in 1.382 seconds.
Running plone.theme.tests.test_doctest.PloneThemeLayer tests:
  Tear down plone.browserlayer.tests.test_doctest.PloneBrowserLayerLayer in 0.000 seconds.
  Set up plone.theme.tests.test_doctest.PloneThemeLayer in 0.012 seconds.
  Ran 5 tests with 0 failures and 0 errors in 0.177 seconds.
Tearing down left over layers:
  Tear down plone.theme.tests.test_doctest.PloneThemeLayer in 0.000 seconds.
  Tear down Products.PloneTestCase.layer.PloneSite in 0.711 seconds.
  Tear down Products.PloneTestCase.layer.ZCML in 0.013 seconds.
Total: 1324 tests, 31 failures, 0 errors

FAILED (failures=31)




More information about the Testbot mailing list