[Testbot] FAILED (failures=38, errors=1) : Plone-trunk Zope-2.11 Python-2.4.4

plone.* Tests plone-tests at epy.co.at
Sun May 4 03:51:47 UTC 2008


plone.* Tests : FAILED (failures=38, errors=1)
Plone-trunk Zope-2.11 Python-2.4.4

Running /usr/local/python2.4/bin/python /home/stefan/autotest/temp/python24-zope211/test.py -q -1 --config-file etc/zope.conf --package plone
/home/stefan/autotest/temp/python24-zope211/lib/python/zope/testing/testrunner.py:1834: DeprecationWarning: Non-ASCII character '\xc3' in file /home/stefan/autotest/temp/python24-zope211-cmf22-plone40/lib/python/plone/app/contentrules/tests/test_configuration.py on line 171, but no encoding declared; see http://www.python.org/peps/pep-0263.html for details
  __import__(name)
GenericCache not found; tests skipped
Parsing /home/stefan/autotest/temp/python24-zope211-cmf22-plone40/etc/zope.conf
Running unit tests:
  Ran 373 tests with 0 failures and 0 errors in 7.840 seconds.
Running Products.PloneTestCase.layer.ZCML tests:
  Set up Testing.ZopeTestCase.layer.ZopeLite in 1.236 seconds.
  Set up Products.PloneTestCase.layer.ZCML in 3.968 seconds.


Failure in test /home/stefan/autotest/temp/python24-zope211-cmf22-plone40/lib/python/plone/session/tests/adapters.txt
Failed doctest test for adapters.txt
  File "/home/stefan/autotest/temp/python24-zope211-cmf22-plone40/lib/python/plone/session/tests/adapters.txt", line 0

----------------------------------------------------------------------
File "/home/stefan/autotest/temp/python24-zope211-cmf22-plone40/lib/python/plone/session/tests/adapters.txt", line 28, in adapters.txt
Failed example:
    id=source.createIdentifier("johny.bravo")
Exception raised:
    Traceback (most recent call last):
      File "/home/stefan/autotest/temp/python24-zope211/lib/python/zope/testing/doctest.py", line 1356, in __run
        compileflags, 1) in test.globs
      File "<doctest adapters.txt[5]>", line 1, in ?
        id=source.createIdentifier("johny.bravo")
      File "/home/stefan/autotest/temp/python24-zope211-cmf22-plone40/lib/python/plone/session/sources/hash.py", line 41, in createIdentifier
        signature=self.signUserid(userid)
      File "/home/stefan/autotest/temp/python24-zope211-cmf22-plone40/lib/python/plone/session/sources/hash.py", line 35, in signUserid
        secret = self.getSigningSecret()
      File "/home/stefan/autotest/temp/python24-zope211-cmf22-plone40/lib/python/plone/session/sources/hash.py", line 30, in getSigningSecret
        return self.getSecrets()[0]
      File "/home/stefan/autotest/temp/python24-zope211-cmf22-plone40/lib/python/plone/session/sources/hash.py", line 25, in getSecrets
        raise NoKeyManager
    NoKeyManager



Failure in test /home/stefan/autotest/temp/python24-zope211-cmf22-plone40/lib/python/plone/session/tests/hash.txt
Failed doctest test for hash.txt
  File "/home/stefan/autotest/temp/python24-zope211-cmf22-plone40/lib/python/plone/session/tests/hash.txt", line 0

----------------------------------------------------------------------
File "/home/stefan/autotest/temp/python24-zope211-cmf22-plone40/lib/python/plone/session/tests/hash.txt", line 21, in hash.txt
Failed example:
    one = source.createIdentifier("john.doe")
Exception raised:
    Traceback (most recent call last):
      File "/home/stefan/autotest/temp/python24-zope211/lib/python/zope/testing/doctest.py", line 1356, in __run
        compileflags, 1) in test.globs
      File "<doctest hash.txt[3]>", line 1, in ?
        one = source.createIdentifier("john.doe")
      File "/home/stefan/autotest/temp/python24-zope211-cmf22-plone40/lib/python/plone/session/sources/hash.py", line 41, in createIdentifier
        signature=self.signUserid(userid)
      File "/home/stefan/autotest/temp/python24-zope211-cmf22-plone40/lib/python/plone/session/sources/hash.py", line 35, in signUserid
        secret = self.getSigningSecret()
      File "/home/stefan/autotest/temp/python24-zope211-cmf22-plone40/lib/python/plone/session/sources/hash.py", line 30, in getSigningSecret
        return self.getSecrets()[0]
      File "/home/stefan/autotest/temp/python24-zope211-cmf22-plone40/lib/python/plone/session/sources/hash.py", line 25, in getSecrets
        raise NoKeyManager
    NoKeyManager



Error in test testCredentialsUpdate (plone.session.tests.testPAS.TestSessionPlugin)
Traceback (most recent call last):
  File "/usr/local/python2.4/lib/python2.4/unittest.py", line 260, in run
    testMethod()
  File "/home/stefan/autotest/temp/python24-zope211-cmf22-plone40/lib/python/plone/session/tests/testPAS.py", line 59, in testCredentialsUpdate
    "our_user", "password")
  File "/home/stefan/autotest/temp/python24-zope211-cmf22-plone40/lib/python/plone/session/plugins/session.py", line 133, in updateCredentials
    self.setupSession(info["id"], response)
  File "/home/stefan/autotest/temp/python24-zope211-cmf22-plone40/lib/python/plone/session/plugins/session.py", line 85, in setupSession
    cookie=self.source.createIdentifier(userid)
  File "/home/stefan/autotest/temp/python24-zope211-cmf22-plone40/lib/python/plone/session/sources/hash.py", line 41, in createIdentifier
    signature=self.signUserid(userid)
  File "/home/stefan/autotest/temp/python24-zope211-cmf22-plone40/lib/python/plone/session/sources/hash.py", line 35, in signUserid
    secret = self.getSigningSecret()
  File "/home/stefan/autotest/temp/python24-zope211-cmf22-plone40/lib/python/plone/session/sources/hash.py", line 30, in getSigningSecret
    return self.getSecrets()[0]
  File "/home/stefan/autotest/temp/python24-zope211-cmf22-plone40/lib/python/plone/session/sources/hash.py", line 25, in getSecrets
    raise NoKeyManager
NoKeyManager

  Ran 36 tests with 2 failures and 1 errors in 0.281 seconds.
Running Products.PloneTestCase.layer.PloneSite tests:
  Set up Products.PloneTestCase.layer.PloneSite in 11.564 seconds.


Failure in test /home/stefan/autotest/temp/python24-zope211-cmf22-plone40/lib/python/plone/app/content/browser/tests/foldercontents.txt
Failed doctest test for foldercontents.txt
  File "/home/stefan/autotest/temp/python24-zope211-cmf22-plone40/lib/python/plone/app/content/browser/tests/foldercontents.txt", line 0

----------------------------------------------------------------------
File "/home/stefan/autotest/temp/python24-zope211-cmf22-plone40/lib/python/plone/app/content/browser/tests/foldercontents.txt", line 21, in foldercontents.txt
Failed example:
    browser.open('http://nohost/plone/@@folder_contents')
Exception raised:
    Traceback (most recent call last):
      File "/home/stefan/autotest/temp/python24-zope211/lib/python/zope/testing/doctest.py", line 1356, in __run
        compileflags, 1) in test.globs
      File "<doctest foldercontents.txt[6]>", line 1, in ?
        browser.open('http://nohost/plone/@@folder_contents')
      File "/home/stefan/autotest/temp/python24-zope211/lib/python/zope/testbrowser/browser.py", line 224, in open
        self.mech_browser.open(url, data)
      File "/home/stefan/autotest/temp/python24-zope211/lib/python/mechanize/_mechanize.py", line 177, in open
        return self._mech_open(url, data)
      File "/home/stefan/autotest/temp/python24-zope211/lib/python/mechanize/_mechanize.py", line 219, in _mech_open
        raise error
    HTTPError: HTTP Error 500: Internal Server Error



Failure in test /home/stefan/autotest/temp/python24-zope211-cmf22-plone40/lib/python/plone/app/contentrules/tests/simplepublish.txt
Failed doctest test for simplepublish.txt
  File "/home/stefan/autotest/temp/python24-zope211-cmf22-plone40/lib/python/plone/app/contentrules/tests/simplepublish.txt", line 0

----------------------------------------------------------------------
File "/home/stefan/autotest/temp/python24-zope211-cmf22-plone40/lib/python/plone/app/contentrules/tests/simplepublish.txt", line 74, in simplepublish.txt
Failed example:
    browser.getLink('State:').click()
Exception raised:
    Traceback (most recent call last):
      File "/home/stefan/autotest/temp/python24-zope211/lib/python/zope/testing/doctest.py", line 1356, in __run
        compileflags, 1) in test.globs
      File "<doctest simplepublish.txt[41]>", line 1, in ?
        browser.getLink('State:').click()
      File "/home/stefan/autotest/temp/python24-zope211/lib/python/zope/testbrowser/browser.py", line 402, in click
        self.browser.mech_browser.follow_link(self.mech_link)
      File "/home/stefan/autotest/temp/python24-zope211/lib/python/mechanize/_mechanize.py", line 448, in follow_link
        return self.open(self.click_link(link, **kwds))
      File "/home/stefan/autotest/temp/python24-zope211/lib/python/mechanize/_mechanize.py", line 177, in open
        return self._mech_open(url, data)
      File "/home/stefan/autotest/temp/python24-zope211/lib/python/mechanize/_mechanize.py", line 219, in _mech_open
        raise error
    HTTPError: HTTP Error 500: Internal Server Error
----------------------------------------------------------------------
File "/home/stefan/autotest/temp/python24-zope211-cmf22-plone40/lib/python/plone/app/contentrules/tests/simplepublish.txt", line 75, in simplepublish.txt
Failed example:
    ctrl = browser.getControl(name='workflow_action') # XXX fix label
Exception raised:
    Traceback (most recent call last):
      File "/home/stefan/autotest/temp/python24-zope211/lib/python/zope/testing/doctest.py", line 1356, in __run
        compileflags, 1) in test.globs
      File "<doctest simplepublish.txt[42]>", line 1, in ?
        ctrl = browser.getControl(name='workflow_action') # XXX fix label
      File "/home/stefan/autotest/temp/python24-zope211/lib/python/zope/testbrowser/browser.py", line 337, in getControl
        control, form = disambiguate(intermediate, msg, index)
      File "/home/stefan/autotest/temp/python24-zope211/lib/python/zope/testbrowser/browser.py", line 50, in disambiguate
        raise LookupError(msg)
    LookupError: name 'workflow_action'
----------------------------------------------------------------------
File "/home/stefan/autotest/temp/python24-zope211-cmf22-plone40/lib/python/plone/app/contentrules/tests/simplepublish.txt", line 76, in simplepublish.txt
Failed example:
    ctrl.value = ['publish']
Exception raised:
    Traceback (most recent call last):
      File "/home/stefan/autotest/temp/python24-zope211/lib/python/zope/testing/doctest.py", line 1356, in __run
        compileflags, 1) in test.globs
      File "<doctest simplepublish.txt[43]>", line 1, in ?
        ctrl.value = ['publish']
      File "/home/stefan/autotest/temp/python24-zope211/lib/python/zope/testbrowser/browser.py", line 91, in __setattr__
        object.__setattr__(self, name, value)
      File "/home/stefan/autotest/temp/python24-zope211/lib/python/zope/testbrowser/browser.py", line 480, in fset
        raise interfaces.ExpiredError
    ExpiredError
----------------------------------------------------------------------
File "/home/stefan/autotest/temp/python24-zope211-cmf22-plone40/lib/python/plone/app/contentrules/tests/simplepublish.txt", line 77, in simplepublish.txt
Failed example:
    browser.getControl('Save').click()
Exception raised:
    Traceback (most recent call last):
      File "/home/stefan/autotest/temp/python24-zope211/lib/python/zope/testing/doctest.py", line 1356, in __run
        compileflags, 1) in test.globs
      File "<doctest simplepublish.txt[44]>", line 1, in ?
        browser.getControl('Save').click()
      File "/home/stefan/autotest/temp/python24-zope211/lib/python/zope/testbrowser/browser.py", line 337, in getControl
        control, form = disambiguate(intermediate, msg, index)
      File "/home/stefan/autotest/temp/python24-zope211/lib/python/zope/testbrowser/browser.py", line 50, in disambiguate
        raise LookupError(msg)
    LookupError: label 'Save'
----------------------------------------------------------------------
File "/home/stefan/autotest/temp/python24-zope211-cmf22-plone40/lib/python/plone/app/contentrules/tests/simplepublish.txt", line 81, in simplepublish.txt
Failed example:
    browser.url
Differences (ndiff with -expected +actual):
    - 'http://nohost/plone/news/my-news-item'
    + 'http://nohost/plone/my-news-item/content_status_history'



Failure in test /home/stefan/autotest/temp/python24-zope211-cmf22-plone40/lib/python/plone/app/contentrules/tests/multipublish.txt
Failed doctest test for multipublish.txt
  File "/home/stefan/autotest/temp/python24-zope211-cmf22-plone40/lib/python/plone/app/contentrules/tests/multipublish.txt", line 0

----------------------------------------------------------------------
File "/home/stefan/autotest/temp/python24-zope211-cmf22-plone40/lib/python/plone/app/contentrules/tests/multipublish.txt", line 89, in multipublish.txt
Failed example:
    browser.getLink('Contents').click()
Exception raised:
    Traceback (most recent call last):
      File "/home/stefan/autotest/temp/python24-zope211/lib/python/zope/testing/doctest.py", line 1356, in __run
        compileflags, 1) in test.globs
      File "<doctest multipublish.txt[49]>", line 1, in ?
        browser.getLink('Contents').click()
      File "/home/stefan/autotest/temp/python24-zope211/lib/python/zope/testbrowser/browser.py", line 402, in click
        self.browser.mech_browser.follow_link(self.mech_link)
      File "/home/stefan/autotest/temp/python24-zope211/lib/python/mechanize/_mechanize.py", line 448, in follow_link
        return self.open(self.click_link(link, **kwds))
      File "/home/stefan/autotest/temp/python24-zope211/lib/python/mechanize/_mechanize.py", line 177, in open
        return self._mech_open(url, data)
      File "/home/stefan/autotest/temp/python24-zope211/lib/python/mechanize/_mechanize.py", line 219, in _mech_open
        raise error
    HTTPError: HTTP Error 500: Internal Server Error
----------------------------------------------------------------------
File "/home/stefan/autotest/temp/python24-zope211-cmf22-plone40/lib/python/plone/app/contentrules/tests/multipublish.txt", line 90, in multipublish.txt
Failed example:
    browser.getControl('My news item').click()
Exception raised:
    Traceback (most recent call last):
      File "/home/stefan/autotest/temp/python24-zope211/lib/python/zope/testing/doctest.py", line 1356, in __run
        compileflags, 1) in test.globs
      File "<doctest multipublish.txt[50]>", line 1, in ?
        browser.getControl('My news item').click()
      File "/home/stefan/autotest/temp/python24-zope211/lib/python/zope/testbrowser/browser.py", line 337, in getControl
        control, form = disambiguate(intermediate, msg, index)
      File "/home/stefan/autotest/temp/python24-zope211/lib/python/zope/testbrowser/browser.py", line 50, in disambiguate
        raise LookupError(msg)
    LookupError: label 'My news item'
----------------------------------------------------------------------
File "/home/stefan/autotest/temp/python24-zope211-cmf22-plone40/lib/python/plone/app/contentrules/tests/multipublish.txt", line 91, in multipublish.txt
Failed example:
    browser.getControl('Second news item').click()
Exception raised:
    Traceback (most recent call last):
      File "/home/stefan/autotest/temp/python24-zope211/lib/python/zope/testing/doctest.py", line 1356, in __run
        compileflags, 1) in test.globs
      File "<doctest multipublish.txt[51]>", line 1, in ?
        browser.getControl('Second news item').click()
      File "/home/stefan/autotest/temp/python24-zope211/lib/python/zope/testbrowser/browser.py", line 337, in getControl
        control, form = disambiguate(intermediate, msg, index)
      File "/home/stefan/autotest/temp/python24-zope211/lib/python/zope/testbrowser/browser.py", line 50, in disambiguate
        raise LookupError(msg)
    LookupError: label 'Second news item'
----------------------------------------------------------------------
File "/home/stefan/autotest/temp/python24-zope211-cmf22-plone40/lib/python/plone/app/contentrules/tests/multipublish.txt", line 92, in multipublish.txt
Failed example:
    browser.getControl('Change State').click()
Exception raised:
    Traceback (most recent call last):
      File "/home/stefan/autotest/temp/python24-zope211/lib/python/zope/testing/doctest.py", line 1356, in __run
        compileflags, 1) in test.globs
      File "<doctest multipublish.txt[52]>", line 1, in ?
        browser.getControl('Change State').click()
      File "/home/stefan/autotest/temp/python24-zope211/lib/python/zope/testbrowser/browser.py", line 337, in getControl
        control, form = disambiguate(intermediate, msg, index)
      File "/home/stefan/autotest/temp/python24-zope211/lib/python/zope/testbrowser/browser.py", line 50, in disambiguate
        raise LookupError(msg)
    LookupError: label 'Change State'
----------------------------------------------------------------------
File "/home/stefan/autotest/temp/python24-zope211-cmf22-plone40/lib/python/plone/app/contentrules/tests/multipublish.txt", line 99, in multipublish.txt
Failed example:
    browser.getControl('Publish').click()
Exception raised:
    Traceback (most recent call last):
      File "/home/stefan/autotest/temp/python24-zope211/lib/python/zope/testing/doctest.py", line 1356, in __run
        compileflags, 1) in test.globs
      File "<doctest multipublish.txt[55]>", line 1, in ?
        browser.getControl('Publish').click()
      File "/home/stefan/autotest/temp/python24-zope211/lib/python/zope/testbrowser/browser.py", line 337, in getControl
        control, form = disambiguate(intermediate, msg, index)
      File "/home/stefan/autotest/temp/python24-zope211/lib/python/zope/testbrowser/browser.py", line 50, in disambiguate
        raise LookupError(msg)
    LookupError: label 'Publish'



Failure in test /home/stefan/autotest/temp/python24-zope211-cmf22-plone40/lib/python/plone/app/controlpanel/tests/calendar.txt
Failed doctest test for calendar.txt
  File "/home/stefan/autotest/temp/python24-zope211-cmf22-plone40/lib/python/plone/app/controlpanel/tests/calendar.txt", line 0

----------------------------------------------------------------------
File "/home/stefan/autotest/temp/python24-zope211-cmf22-plone40/lib/python/plone/app/controlpanel/tests/calendar.txt", line 8, in calendar.txt
Failed example:
    self.loginAsManager()
Exception raised:
    Traceback (most recent call last):
      File "/home/stefan/autotest/temp/python24-zope211/lib/python/zope/testing/doctest.py", line 1356, in __run
        compileflags, 1) in test.globs
      File "<doctest calendar.txt[2]>", line 1, in ?
        self.loginAsManager()
      File "/home/stefan/autotest/temp/python24-zope211-cmf22-plone40/lib/python/plone/app/controlpanel/tests/cptc.py", line 32, in loginAsManager
        self.browser.getControl('Log in').click()
      File "/home/stefan/autotest/temp/python24-zope211/lib/python/zope/testbrowser/browser.py", line 591, in click
        self.browser._clickSubmit(self.mech_form, self.mech_control, (1,1))
      File "/home/stefan/autotest/temp/python24-zope211/lib/python/zope/testbrowser/browser.py", line 380, in _clickSubmit
        self.mech_browser.open(form.click(
      File "/home/stefan/autotest/temp/python24-zope211/lib/python/mechanize/_mechanize.py", line 177, in open
        return self._mech_open(url, data)
      File "/home/stefan/autotest/temp/python24-zope211/lib/python/mechanize/_mechanize.py", line 219, in _mech_open
        raise error
    HTTPError: HTTP Error 500: Internal Server Error



Failure in test /home/stefan/autotest/temp/python24-zope211-cmf22-plone40/lib/python/plone/app/controlpanel/tests/filter.txt
Failed doctest test for filter.txt
  File "/home/stefan/autotest/temp/python24-zope211-cmf22-plone40/lib/python/plone/app/controlpanel/tests/filter.txt", line 0

----------------------------------------------------------------------
File "/home/stefan/autotest/temp/python24-zope211-cmf22-plone40/lib/python/plone/app/controlpanel/tests/filter.txt", line 14, in filter.txt
Failed example:
    self.loginAsManager()
Exception raised:
    Traceback (most recent call last):
      File "/home/stefan/autotest/temp/python24-zope211/lib/python/zope/testing/doctest.py", line 1356, in __run
        compileflags, 1) in test.globs
      File "<doctest filter.txt[7]>", line 1, in ?
        self.loginAsManager()
      File "/home/stefan/autotest/temp/python24-zope211-cmf22-plone40/lib/python/plone/app/controlpanel/tests/cptc.py", line 32, in loginAsManager
        self.browser.getControl('Log in').click()
      File "/home/stefan/autotest/temp/python24-zope211/lib/python/zope/testbrowser/browser.py", line 591, in click
        self.browser._clickSubmit(self.mech_form, self.mech_control, (1,1))
      File "/home/stefan/autotest/temp/python24-zope211/lib/python/zope/testbrowser/browser.py", line 380, in _clickSubmit
        self.mech_browser.open(form.click(
      File "/home/stefan/autotest/temp/python24-zope211/lib/python/mechanize/_mechanize.py", line 177, in open
        return self._mech_open(url, data)
      File "/home/stefan/autotest/temp/python24-zope211/lib/python/mechanize/_mechanize.py", line 219, in _mech_open
        raise error
    HTTPError: HTTP Error 500: Internal Server Error



Failure in test /home/stefan/autotest/temp/python24-zope211-cmf22-plone40/lib/python/plone/app/controlpanel/tests/mail.txt
Failed doctest test for mail.txt
  File "/home/stefan/autotest/temp/python24-zope211-cmf22-plone40/lib/python/plone/app/controlpanel/tests/mail.txt", line 0

----------------------------------------------------------------------
File "/home/stefan/autotest/temp/python24-zope211-cmf22-plone40/lib/python/plone/app/controlpanel/tests/mail.txt", line 11, in mail.txt
Failed example:
    self.loginAsManager()
Exception raised:
    Traceback (most recent call last):
      File "/home/stefan/autotest/temp/python24-zope211/lib/python/zope/testing/doctest.py", line 1356, in __run
        compileflags, 1) in test.globs
      File "<doctest mail.txt[5]>", line 1, in ?
        self.loginAsManager()
      File "/home/stefan/autotest/temp/python24-zope211-cmf22-plone40/lib/python/plone/app/controlpanel/tests/cptc.py", line 32, in loginAsManager
        self.browser.getControl('Log in').click()
      File "/home/stefan/autotest/temp/python24-zope211/lib/python/zope/testbrowser/browser.py", line 591, in click
        self.browser._clickSubmit(self.mech_form, self.mech_control, (1,1))
      File "/home/stefan/autotest/temp/python24-zope211/lib/python/zope/testbrowser/browser.py", line 380, in _clickSubmit
        self.mech_browser.open(form.click(
      File "/home/stefan/autotest/temp/python24-zope211/lib/python/mechanize/_mechanize.py", line 177, in open
        return self._mech_open(url, data)
      File "/home/stefan/autotest/temp/python24-zope211/lib/python/mechanize/_mechanize.py", line 219, in _mech_open
        raise error
    HTTPError: HTTP Error 500: Internal Server Error



Failure in test /home/stefan/autotest/temp/python24-zope211-cmf22-plone40/lib/python/plone/app/controlpanel/tests/maintenance.txt
Failed doctest test for maintenance.txt
  File "/home/stefan/autotest/temp/python24-zope211-cmf22-plone40/lib/python/plone/app/controlpanel/tests/maintenance.txt", line 0

----------------------------------------------------------------------
File "/home/stefan/autotest/temp/python24-zope211-cmf22-plone40/lib/python/plone/app/controlpanel/tests/maintenance.txt", line 6, in maintenance.txt
Failed example:
    self.loginAsManager()
Exception raised:
    Traceback (most recent call last):
      File "/home/stefan/autotest/temp/python24-zope211/lib/python/zope/testing/doctest.py", line 1356, in __run
        compileflags, 1) in test.globs
      File "<doctest maintenance.txt[0]>", line 1, in ?
        self.loginAsManager()
      File "/home/stefan/autotest/temp/python24-zope211-cmf22-plone40/lib/python/plone/app/controlpanel/tests/cptc.py", line 32, in loginAsManager
        self.browser.getControl('Log in').click()
      File "/home/stefan/autotest/temp/python24-zope211/lib/python/zope/testbrowser/browser.py", line 591, in click
        self.browser._clickSubmit(self.mech_form, self.mech_control, (1,1))
      File "/home/stefan/autotest/temp/python24-zope211/lib/python/zope/testbrowser/browser.py", line 380, in _clickSubmit
        self.mech_browser.open(form.click(
      File "/home/stefan/autotest/temp/python24-zope211/lib/python/mechanize/_mechanize.py", line 177, in open
        return self._mech_open(url, data)
      File "/home/stefan/autotest/temp/python24-zope211/lib/python/mechanize/_mechanize.py", line 219, in _mech_open
        raise error
    HTTPError: HTTP Error 500: Internal Server Error



Failure in test /home/stefan/autotest/temp/python24-zope211-cmf22-plone40/lib/python/plone/app/controlpanel/tests/search.txt
Failed doctest test for search.txt
  File "/home/stefan/autotest/temp/python24-zope211-cmf22-plone40/lib/python/plone/app/controlpanel/tests/search.txt", line 0

----------------------------------------------------------------------
File "/home/stefan/autotest/temp/python24-zope211-cmf22-plone40/lib/python/plone/app/controlpanel/tests/search.txt", line 8, in search.txt
Failed example:
    self.loginAsManager()
Exception raised:
    Traceback (most recent call last):
      File "/home/stefan/autotest/temp/python24-zope211/lib/python/zope/testing/doctest.py", line 1356, in __run
        compileflags, 1) in test.globs
      File "<doctest search.txt[2]>", line 1, in ?
        self.loginAsManager()
      File "/home/stefan/autotest/temp/python24-zope211-cmf22-plone40/lib/python/plone/app/controlpanel/tests/cptc.py", line 32, in loginAsManager
        self.browser.getControl('Log in').click()
      File "/home/stefan/autotest/temp/python24-zope211/lib/python/zope/testbrowser/browser.py", line 591, in click
        self.browser._clickSubmit(self.mech_form, self.mech_control, (1,1))
      File "/home/stefan/autotest/temp/python24-zope211/lib/python/zope/testbrowser/browser.py", line 380, in _clickSubmit
        self.mech_browser.open(form.click(
      File "/home/stefan/autotest/temp/python24-zope211/lib/python/mechanize/_mechanize.py", line 177, in open
        return self._mech_open(url, data)
      File "/home/stefan/autotest/temp/python24-zope211/lib/python/mechanize/_mechanize.py", line 219, in _mech_open
        raise error
    HTTPError: HTTP Error 500: Internal Server Error



Failure in test /home/stefan/autotest/temp/python24-zope211-cmf22-plone40/lib/python/plone/app/controlpanel/tests/site.txt
Failed doctest test for site.txt
  File "/home/stefan/autotest/temp/python24-zope211-cmf22-plone40/lib/python/plone/app/controlpanel/tests/site.txt", line 0

----------------------------------------------------------------------
File "/home/stefan/autotest/temp/python24-zope211-cmf22-plone40/lib/python/plone/app/controlpanel/tests/site.txt", line 9, in site.txt
Failed example:
    self.loginAsManager()
Exception raised:
    Traceback (most recent call last):
      File "/home/stefan/autotest/temp/python24-zope211/lib/python/zope/testing/doctest.py", line 1356, in __run
        compileflags, 1) in test.globs
      File "<doctest site.txt[3]>", line 1, in ?
        self.loginAsManager()
      File "/home/stefan/autotest/temp/python24-zope211-cmf22-plone40/lib/python/plone/app/controlpanel/tests/cptc.py", line 32, in loginAsManager
        self.browser.getControl('Log in').click()
      File "/home/stefan/autotest/temp/python24-zope211/lib/python/zope/testbrowser/browser.py", line 591, in click
        self.browser._clickSubmit(self.mech_form, self.mech_control, (1,1))
      File "/home/stefan/autotest/temp/python24-zope211/lib/python/zope/testbrowser/browser.py", line 380, in _clickSubmit
        self.mech_browser.open(form.click(
      File "/home/stefan/autotest/temp/python24-zope211/lib/python/mechanize/_mechanize.py", line 177, in open
        return self._mech_open(url, data)
      File "/home/stefan/autotest/temp/python24-zope211/lib/python/mechanize/_mechanize.py", line 219, in _mech_open
        raise error
    HTTPError: HTTP Error 500: Internal Server Error



Failure in test /home/stefan/autotest/temp/python24-zope211-cmf22-plone40/lib/python/plone/app/controlpanel/tests/skins.txt
Failed doctest test for skins.txt
  File "/home/stefan/autotest/temp/python24-zope211-cmf22-plone40/lib/python/plone/app/controlpanel/tests/skins.txt", line 0

----------------------------------------------------------------------
File "/home/stefan/autotest/temp/python24-zope211-cmf22-plone40/lib/python/plone/app/controlpanel/tests/skins.txt", line 8, in skins.txt
Failed example:
    self.loginAsManager()
Exception raised:
    Traceback (most recent call last):
      File "/home/stefan/autotest/temp/python24-zope211/lib/python/zope/testing/doctest.py", line 1356, in __run
        compileflags, 1) in test.globs
      File "<doctest skins.txt[2]>", line 1, in ?
        self.loginAsManager()
      File "/home/stefan/autotest/temp/python24-zope211-cmf22-plone40/lib/python/plone/app/controlpanel/tests/cptc.py", line 32, in loginAsManager
        self.browser.getControl('Log in').click()
      File "/home/stefan/autotest/temp/python24-zope211/lib/python/zope/testbrowser/browser.py", line 591, in click
        self.browser._clickSubmit(self.mech_form, self.mech_control, (1,1))
      File "/home/stefan/autotest/temp/python24-zope211/lib/python/zope/testbrowser/browser.py", line 380, in _clickSubmit
        self.mech_browser.open(form.click(
      File "/home/stefan/autotest/temp/python24-zope211/lib/python/mechanize/_mechanize.py", line 177, in open
        return self._mech_open(url, data)
      File "/home/stefan/autotest/temp/python24-zope211/lib/python/mechanize/_mechanize.py", line 219, in _mech_open
        raise error
    HTTPError: HTTP Error 500: Internal Server Error



Failure in test /home/stefan/autotest/temp/python24-zope211-cmf22-plone40/lib/python/plone/app/controlpanel/tests/markup.txt
Failed doctest test for markup.txt
  File "/home/stefan/autotest/temp/python24-zope211-cmf22-plone40/lib/python/plone/app/controlpanel/tests/markup.txt", line 0

----------------------------------------------------------------------
File "/home/stefan/autotest/temp/python24-zope211-cmf22-plone40/lib/python/plone/app/controlpanel/tests/markup.txt", line 7, in markup.txt
Failed example:
    self.loginAsManager()
Exception raised:
    Traceback (most recent call last):
      File "/home/stefan/autotest/temp/python24-zope211/lib/python/zope/testing/doctest.py", line 1356, in __run
        compileflags, 1) in test.globs
      File "<doctest markup.txt[0]>", line 1, in ?
        self.loginAsManager()
      File "/home/stefan/autotest/temp/python24-zope211-cmf22-plone40/lib/python/plone/app/controlpanel/tests/cptc.py", line 32, in loginAsManager
        self.browser.getControl('Log in').click()
      File "/home/stefan/autotest/temp/python24-zope211/lib/python/zope/testbrowser/browser.py", line 591, in click
        self.browser._clickSubmit(self.mech_form, self.mech_control, (1,1))
      File "/home/stefan/autotest/temp/python24-zope211/lib/python/zope/testbrowser/browser.py", line 380, in _clickSubmit
        self.mech_browser.open(form.click(
      File "/home/stefan/autotest/temp/python24-zope211/lib/python/mechanize/_mechanize.py", line 177, in open
        return self._mech_open(url, data)
      File "/home/stefan/autotest/temp/python24-zope211/lib/python/mechanize/_mechanize.py", line 219, in _mech_open
        raise error
    HTTPError: HTTP Error 500: Internal Server Error



Failure in test test_initPortletNode_i18n (plone.app.portlets.tests.test_exportimport.TestImportPortlets)
Traceback (most recent call last):
  File "/usr/local/python2.4/lib/python2.4/unittest.py", line 260, in run
    testMethod()
  File "/home/stefan/autotest/temp/python24-zope211-cmf22-plone40/lib/python/plone/app/portlets/tests/test_exportimport.py", line 109, in test_initPortletNode_i18n
    self.failUnless(isinstance(portlet.title, Message))
  File "/usr/local/python2.4/lib/python2.4/unittest.py", line 309, in failUnless
    if not expr: raise self.failureException, msg
AssertionError



Failure in test /home/stefan/autotest/temp/python24-zope211-cmf22-plone40/lib/python/plone/app/workflow/tests/onestateworkflow.txt
Failed doctest test for onestateworkflow.txt
  File "/home/stefan/autotest/temp/python24-zope211-cmf22-plone40/lib/python/plone/app/workflow/tests/onestateworkflow.txt", line 0

----------------------------------------------------------------------
File "/home/stefan/autotest/temp/python24-zope211-cmf22-plone40/lib/python/plone/app/workflow/tests/onestateworkflow.txt", line 117, in onestateworkflow.txt
Failed example:
    browser.getControl('Log in').click()
Exception raised:
    Traceback (most recent call last):
      File "/home/stefan/autotest/temp/python24-zope211/lib/python/zope/testing/doctest.py", line 1356, in __run
        compileflags, 1) in test.globs
      File "<doctest onestateworkflow.txt[29]>", line 1, in ?
        browser.getControl('Log in').click()
      File "/home/stefan/autotest/temp/python24-zope211/lib/python/zope/testbrowser/browser.py", line 591, in click
        self.browser._clickSubmit(self.mech_form, self.mech_control, (1,1))
      File "/home/stefan/autotest/temp/python24-zope211/lib/python/zope/testbrowser/browser.py", line 380, in _clickSubmit
        self.mech_browser.open(form.click(
      File "/home/stefan/autotest/temp/python24-zope211/lib/python/mechanize/_mechanize.py", line 177, in open
        return self._mech_open(url, data)
      File "/home/stefan/autotest/temp/python24-zope211/lib/python/mechanize/_mechanize.py", line 202, in _mech_open
        response = UserAgent.open(self, self.request, data)
      File "/home/stefan/autotest/temp/python24-zope211/lib/python/mechanize/_opener.py", line 235, in open
        response = urlopen(self, req, data)
      File "/usr/local/python2.4/lib/python2.4/urllib2.py", line 376, in _open
        '_open', req)
      File "/usr/local/python2.4/lib/python2.4/urllib2.py", line 337, in _call_chain
        result = func(*args)
      File "/home/stefan/autotest/temp/python24-zope211/lib/python/Products/Five/testbrowser.py", line 79, in http_open
        return self.do_open(PublisherConnection, req)
      File "/usr/local/python2.4/lib/python2.4/urllib2.py", line 993, in do_open
        h.request(req.get_method(), req.get_selector(), req.data, headers)
      File "/home/stefan/autotest/temp/python24-zope211/lib/python/zope/testbrowser/testing.py", line 84, in request
        self.response = self.caller(request_string, handle_errors)
      File "/home/stefan/autotest/temp/python24-zope211/lib/python/Testing/ZopeTestCase/functional.py", line 40, in wrapped_func
        return func(*args, **kw)
      File "/home/stefan/autotest/temp/python24-zope211/lib/python/Testing/ZopeTestCase/zopedoctest/functional.py", line 182, in http
        debug=not handle_errors,
      File "/home/stefan/autotest/temp/python24-zope211/lib/python/ZPublisher/Test.py", line 199, in publish_module
        response = publish(request, module_name, after_list, debug=debug)
      File "/home/stefan/autotest/temp/python24-zope211/lib/python/ZPublisher/Publish.py", line 150, in publish
        sys.exc_info()[2],
      File "/home/stefan/autotest/temp/python24-zope211/lib/python/Zope2/App/startup.py", line 252, in __call__
        f(client, REQUEST, t, v, traceback, error_log_url=error_log_url)
      File "/home/stefan/autotest/temp/python24-zope211/lib/python/ZPublisher/Publish.py", line 119, in publish
        request, bind=1)
      File "/home/stefan/autotest/temp/python24-zope211/lib/python/ZPublisher/mapply.py", line 88, in mapply
        if debug is not None: return debug(object,args,context)
      File "/home/stefan/autotest/temp/python24-zope211/lib/python/ZPublisher/Publish.py", line 42, in call_object
        result=apply(object,args) # Type s<cr> to step into published object.
      File "/home/stefan/autotest/temp/python24-zope211-cmf22-plone40/lib/python/Products/CMFFormController/FSControllerPageTemplate.py", line 90, in __call__
        return self._call(FSControllerPageTemplate.inheritedAttribute('__call__'), *args, **kwargs)
      File "/home/stefan/autotest/temp/python24-zope211-cmf22-plone40/lib/python/Products/CMFFormController/BaseControllerPageTemplate.py", line 28, in _call
        return self.getNext(controller_state, REQUEST)
      File "/home/stefan/autotest/temp/python24-zope211-cmf22-plone40/lib/python/Products/CMFFormController/ControllerBase.py", line 231, in getNext
        return next_action.getAction()(controller_state)
      File "/home/stefan/autotest/temp/python24-zope211-cmf22-plone40/lib/python/Products/CMFFormController/Actions/TraverseTo.py", line 38, in __call__
        REQUEST, bind=1)
      File "/home/stefan/autotest/temp/python24-zope211/lib/python/ZPublisher/mapply.py", line 88, in mapply
        if debug is not None: return debug(object,args,context)
      File "/home/stefan/autotest/temp/python24-zope211/lib/python/ZPublisher/Publish.py", line 42, in call_object
        result=apply(object,args) # Type s<cr> to step into published object.
      File "/home/stefan/autotest/temp/python24-zope211-cmf22-plone40/lib/python/Products/CMFFormController/FSControllerPythonScript.py", line 104, in __call__
        result = FSControllerPythonScript.inheritedAttribute('__call__')(self, *args, **kwargs)
      File "/home/stefan/autotest/temp/python24-zope211-cmf22-plone40/lib/python/Products/CMFFormController/Script.py", line 145, in __call__
        return BaseFSPythonScript.__call__(self, *args, **kw)
      File "/home/stefan/autotest/temp/python24-zope211-cmf22-plone40/lib/python/Products/CMFCore/FSPythonScript.py", line 140, in __call__
        return Script.__call__(self, *args, **kw)
      File "/home/stefan/autotest/temp/python24-zope211/lib/python/Shared/DC/Scripts/Bindings.py", line 313, in __call__
        return self._bindAndExec(args, kw, None)
      File "/home/stefan/autotest/temp/python24-zope211/lib/python/Shared/DC/Scripts/Bindings.py", line 350, in _bindAndExec
        return self._exec(bound_data, args, kw)
      File "/home/stefan/autotest/temp/python24-zope211-cmf22-plone40/lib/python/Products/CMFCore/FSPythonScript.py", line 196, in _exec
        result = f(*args, **kw)
      File "Script (Python)", line 24, in logged_in
      File "/home/stefan/autotest/temp/python24-zope211-cmf22-plone40/lib/python/Products/CMFPlone/MembershipTool.py", line 310, in loginUser
        pas.credentials_cookie_auth.login()
      File "/home/stefan/autotest/temp/python24-zope211-cmf22-plone40/lib/python/Products/PlonePAS/plugins/cookie_handler.py", line 87, in login
        user_pas.updateCredentials(request, response, login, password)
      File "/home/stefan/autotest/temp/python24-zope211-cmf22-plone40/lib/python/Products/PluggableAuthService/PluggableAuthService.py", line 1098, in updateCredentials
        updater.updateCredentials(request, response, login, new_password)
      File "/home/stefan/autotest/temp/python24-zope211-cmf22-plone40/lib/python/plone/session/plugins/session.py", line 133, in updateCredentials
        self.setupSession(info["id"], response)
      File "/home/stefan/autotest/temp/python24-zope211-cmf22-plone40/lib/python/plone/session/plugins/session.py", line 85, in setupSession
        cookie=self.source.createIdentifier(userid)
      File "/home/stefan/autotest/temp/python24-zope211-cmf22-plone40/lib/python/plone/session/sources/hash.py", line 41, in createIdentifier
        signature=self.signUserid(userid)
      File "/home/stefan/autotest/temp/python24-zope211-cmf22-plone40/lib/python/plone/session/sources/hash.py", line 35, in signUserid
        secret = self.getSigningSecret()
      File "/home/stefan/autotest/temp/python24-zope211-cmf22-plone40/lib/python/plone/session/sources/hash.py", line 30, in getSigningSecret
        return self.getSecrets()[0]
      File "/home/stefan/autotest/temp/python24-zope211-cmf22-plone40/lib/python/plone/session/sources/hash.py", line 25, in getSecrets
        raise NoKeyManager
    NoKeyManager: <!DOCTYPE html PUBLIC "-//W3C//DTD XHTML 1.0 Transitional//EN" "http://www.w3.org/TR/xhtml1/DTD/xhtml1-transitional.dtd">



    <html xmlns="http://www.w3.org/1999/xhtml" xml:lang="en" lang="en">

      
        
        
        
        
        

      

      <head>

        <meta http-equiv="Content-Type" content="text/html;charset=utf-8" />

        
          <base href="http://nohost/plone/" /><!--[if lt IE 7]></base><![endif]-->
        

        <meta name="generator" content="Plone - http://plone.org" />

        <link rel="kss-base-url" href="http://nohost/plone/" />

      
      
        
          <script type="text/javascript" src="http://nohost/plone/portal_javascripts/Plone%20Default/jquery-cachekey8050.js">
          </script>
        
        
      

      
        
          <script type="text/javascript" src="http://nohost/plone/portal_javascripts/Plone%20Default/dropdown-cachekey2601.js">
          </script>
        
        
      

      
        
          <script type="text/javascript" src="http://nohost/plone/portal_javascripts/Plone%20Default/resourcekukit-cachekey7458.js">
          </script>
        
        
      

      
      
        
        
          <style type="text/css" media="screen"><!-- @import url(http://nohost/plone/portal_css/Plone%20Default/member-cachekey5128.css); --></style>
        
        
      

      
        
        
          <style type="text/css"><!-- @import url(http://nohost/plone/portal_css/Plone%20Default/base-cachekey7460.css); --></style>
        
        
      

      
      <link rel="kinetic-stylesheet" type="text/css" href="http://nohost/plone/portal_kss/Plone%20Default/at-cachekey8315.kss" />


    <title>Plone site</title>


        <!-- Internet Explorer CSS Fixes -->
        <!--[if IE]>
            <style type="text/css" media="all">@import url(http://nohost/plone/IEFixes.css);</style>
        <![endif]-->

        
        <link rel="author" href="http://nohost/plone/author/" title="Author information" />



        <link rel="shortcut icon" type="image/x-icon" href="http://nohost/plone/favicon.ico" />



        <link rel="home" href="http://nohost/plone" title="Front page" />

        <link rel="contents" href="http://nohost/plone/sitemap" title="Site Map" />






        <link rel="search" href="http://nohost/plone/search_form" title="Search this site" />



        <!-- Disable IE6 image toolbar -->
        <meta http-equiv="imagetoolbar" content="no" />
        
        
        

        
        

        
        

        
        

      </head>

      <body class="None template-default_error_message" dir="ltr">
        <div id="visual-portal-wrapper">

          <div id="portal-top">
            <div id="portal-header">
    <p class="hiddenStructure">
      <a accesskey="2" href="http://nohost/plone/login_form#documentContent">Skip to content.</a> |

      <a accesskey="6" href="http://nohost/plone/login_form#portlet-navigation-tree">Skip to navigation</a>
    </p>

    <ul id="portal-siteactions">

        <li id="siteaction-sitemap"><a href="http://nohost/plone/sitemap" accesskey="3" title="Site Map">Site Map</a></li>
        <li id="siteaction-accessibility"><a href="http://nohost/plone/accessibility-info" accesskey="0" title="Accessibility">Accessibility</a></li>
        <li id="siteaction-contact"><a href="http://nohost/plone/contact-info" accesskey="9" title="Contact">Contact</a></li>

    </ul>

    <div id="portal-searchbox">
        <form name="searchform" action="http://nohost/plone/search">

            <label for="searchGadget" class="hiddenStructure">Search Site</label>

            <div class="LSBox">
            <input name="SearchableText" type="text" size="18" title="Search Site" accesskey="4" class="inputLabel" id="searchGadget" />

            <input class="searchButton" type="submit" value="Search" />
        
            <div class="searchSection">
                <input id="searchbox_currentfolder_only" class="noborder" type="checkbox" name="path" value="/plone" />
                <label for="searchbox_currentfolder_only" style="cursor: pointer">
                    only in current section
                </label>
            </div>

            <div class="LSResult" id="LSResult" style=""><div class="LSShadow" id="LSShadow"></div></div>
            </div>
        </form>

        <div id="portal-advanced-search" class="hiddenStructure">
            <a href="http://nohost/plone/search_form" accesskey="5">
                Advanced Search&hellip;
            </a>
        </div>

    </div>

    <a id="portal-logo" accesskey="1" href="http://nohost/plone">
        <img src="http://nohost/plone/logo.jpg" alt="" title="Plone" height="57" width="252" /></a>


        <h5 class="hiddenStructure">Sections</h5>

        <ul id="portal-globalnav">
            <li id="portaltab-index_html" class="selected">
                <a href="http://nohost/plone" title="">Home</a></li>
            <li id="portaltab-Members" class="plain">
                <a href="http://nohost/plone/Members" title="Container for users' home directories">Users</a></li>
            <li id="portaltab-news" class="plain">
                <a href="http://nohost/plone/news" title="Site News">News</a></li>
            <li id="portaltab-events" class="plain">
                <a href="http://nohost/plone/events" title="Site Events">Events</a></li>
        </ul>

    </div>

    <div id="portal-personaltools-wrapper">

    <h5 class="hiddenStructure">Personal tools</h5>

    <ul id="portal-personaltools" class="visualInline">
       
           <li><a id="user-name" href="http://nohost/plone/dashboard"><img src="http://nohost/plone/user.gif" alt="" title="User" height="16" width="16" />
                <span class="visualCaseSensitive">member</span></a></li>
       

        
            <li>
                <a href="http://nohost/plone/logout">Log out</a>
            </li>
        

    </ul>
    </div>


        


    <div id="portal-breadcrumbs">

        <span id="breadcrumbs-you-are-here">You
    are here:</span>
        <a href="http://nohost/plone">Home</a>
        

    </div>

          </div>

          <div class="visualClear" id="clear-space-before-wrapper-table"><!-- --></div>

          <table id="portal-columns">
            <tbody>
              <tr>
                
                
                

                
                <td id="portal-column-content">

                  
                    <div class="">

                      


                      <div id="region-content" class="documentContent">

                        <span id="contentTopLeft"></span>
                        <span id="contentTopRight"></span>
                        
                        <a name="documentContent"></a>

                        

        <dl class="portalMessage info" id="kssPortalMessage" style="display:none">
            <dt>Info</dt>
            <dd></dd>
        </dl>


                        
                        <div id="viewlet-above-content"></div>

                        
                        
                        
                          
                          <div>

            

            <div>

                <h1 class="documentFirstHeading">
                    We're sorry, but there seems to be an error&hellip;
                </h1>

                
                    <p>
                    The error has been logged as entry number 
                    <code>1209871807.330.814988328114</code>.
                    </p>
                    
                    <p>
                    If you need to report this to the 
                    <span> <a href="http://nohost/plone/contact-info">site administration</a></span>,
                    please include this entry number in your message.
                    </p>
                
                    

                

                

            </div>
            

    </div>
                        
                        

                        
                        
                          

                        
                        

                        <span id="contentBottomLeft"></span>
                        <span id="contentBottomRight"></span>

                      </div>

                    </div>

                  
                </td>
                

                
                
                
              </tr>
            </tbody>
          </table>
          

          <div class="visualClear" id="clear-space-before-footer"><!-- --></div>
          
          

          

            <div id="portal-footer">

    <p>
        
        The
        <a href="http://plone.org">Plone<sup>&reg;</sup> CMS &mdash; Open Source Content Management System</a>
        is
        <acronym title="Copyright">&copy;</acronym>
        2000-2008
        by the
        <a href="http://plone.org/foundation">Plone Foundation</a>
        et al.
        
    </p>

    <p>
        
        Plone<sup>&reg;</sup> and the Plone logo are registered trademarks of the
            <a href="http://plone.org/foundation">Plone Foundation</a>.
        

        
        Distributed under the
            <a href="http://creativecommons.org/licenses/GPL/2.0/">GNU GPL license</a>.
        
    </p>

    </div>

      <div id="portal-colophon">
          

          

          <div class="colophonWrapper">
          <ul>
            <li>
              <a href="http://plone.org" title="This site was built using Plone CMS, the Open Source Content Management System. Click for more information.">
                Powered by Plone</a>
            </li>
            <li>
              <a href="http://validator.w3.org/check/referer" title="This site is valid XHTML.">
                Valid XHTML</a>
            </li>
            <li>
              <a href="http://jigsaw.w3.org/css-validator/check/referer&amp;warning=no&amp;profile=css3&amp;usermedium=all" title="This site was built with valid CSS.">
                Valid CSS</a>
            </li>
            <li>
              <a href="http://www.section508.gov" title="This site conforms to the US Government Section 508 Accessibility Guidelines.">
                Section 508</a>
            </li>
            <li>
              <a href="http://www.w3.org/WAI/WCAG1AA-Conformance" title="This site conforms to the W3C-WAI Web Content Accessibility Guidelines.">
                WCAG</a>
            </li>
          </ul>
          </div>

        </div>



          

          <div class="visualClear"><!-- --></div>
        </div>
    <div id="kss-spinner"><img alt="" src="http://nohost/plone/spinner.png" /></div>
    </body>
    </html>





Failure in test /home/stefan/autotest/temp/python24-zope211-cmf22-plone40/lib/python/plone/app/workflow/tests/sharingpage.txt
Failed doctest test for sharingpage.txt
  File "/home/stefan/autotest/temp/python24-zope211-cmf22-plone40/lib/python/plone/app/workflow/tests/sharingpage.txt", line 0

----------------------------------------------------------------------
File "/home/stefan/autotest/temp/python24-zope211-cmf22-plone40/lib/python/plone/app/workflow/tests/sharingpage.txt", line 50, in sharingpage.txt
Failed example:
    browser.getControl('Log in').click()
Exception raised:
    Traceback (most recent call last):
      File "/home/stefan/autotest/temp/python24-zope211/lib/python/zope/testing/doctest.py", line 1356, in __run
        compileflags, 1) in test.globs
      File "<doctest sharingpage.txt[13]>", line 1, in ?
        browser.getControl('Log in').click()
      File "/home/stefan/autotest/temp/python24-zope211/lib/python/zope/testbrowser/browser.py", line 591, in click
        self.browser._clickSubmit(self.mech_form, self.mech_control, (1,1))
      File "/home/stefan/autotest/temp/python24-zope211/lib/python/zope/testbrowser/browser.py", line 380, in _clickSubmit
        self.mech_browser.open(form.click(
      File "/home/stefan/autotest/temp/python24-zope211/lib/python/mechanize/_mechanize.py", line 177, in open
        return self._mech_open(url, data)
      File "/home/stefan/autotest/temp/python24-zope211/lib/python/mechanize/_mechanize.py", line 202, in _mech_open
        response = UserAgent.open(self, self.request, data)
      File "/home/stefan/autotest/temp/python24-zope211/lib/python/mechanize/_opener.py", line 235, in open
        response = urlopen(self, req, data)
      File "/usr/local/python2.4/lib/python2.4/urllib2.py", line 376, in _open
        '_open', req)
      File "/usr/local/python2.4/lib/python2.4/urllib2.py", line 337, in _call_chain
        result = func(*args)
      File "/home/stefan/autotest/temp/python24-zope211/lib/python/Products/Five/testbrowser.py", line 79, in http_open
        return self.do_open(PublisherConnection, req)
      File "/usr/local/python2.4/lib/python2.4/urllib2.py", line 993, in do_open
        h.request(req.get_method(), req.get_selector(), req.data, headers)
      File "/home/stefan/autotest/temp/python24-zope211/lib/python/zope/testbrowser/testing.py", line 84, in request
        self.response = self.caller(request_string, handle_errors)
      File "/home/stefan/autotest/temp/python24-zope211/lib/python/Testing/ZopeTestCase/functional.py", line 40, in wrapped_func
        return func(*args, **kw)
      File "/home/stefan/autotest/temp/python24-zope211/lib/python/Testing/ZopeTestCase/zopedoctest/functional.py", line 182, in http
        debug=not handle_errors,
      File "/home/stefan/autotest/temp/python24-zope211/lib/python/ZPublisher/Test.py", line 199, in publish_module
        response = publish(request, module_name, after_list, debug=debug)
      File "/home/stefan/autotest/temp/python24-zope211/lib/python/ZPublisher/Publish.py", line 150, in publish
        sys.exc_info()[2],
      File "/home/stefan/autotest/temp/python24-zope211/lib/python/Zope2/App/startup.py", line 252, in __call__
        f(client, REQUEST, t, v, traceback, error_log_url=error_log_url)
      File "/home/stefan/autotest/temp/python24-zope211/lib/python/ZPublisher/Publish.py", line 119, in publish
        request, bind=1)
      File "/home/stefan/autotest/temp/python24-zope211/lib/python/ZPublisher/mapply.py", line 88, in mapply
        if debug is not None: return debug(object,args,context)
      File "/home/stefan/autotest/temp/python24-zope211/lib/python/ZPublisher/Publish.py", line 42, in call_object
        result=apply(object,args) # Type s<cr> to step into published object.
      File "/home/stefan/autotest/temp/python24-zope211-cmf22-plone40/lib/python/Products/CMFFormController/FSControllerPageTemplate.py", line 90, in __call__
        return self._call(FSControllerPageTemplate.inheritedAttribute('__call__'), *args, **kwargs)
      File "/home/stefan/autotest/temp/python24-zope211-cmf22-plone40/lib/python/Products/CMFFormController/BaseControllerPageTemplate.py", line 28, in _call
        return self.getNext(controller_state, REQUEST)
      File "/home/stefan/autotest/temp/python24-zope211-cmf22-plone40/lib/python/Products/CMFFormController/ControllerBase.py", line 231, in getNext
        return next_action.getAction()(controller_state)
      File "/home/stefan/autotest/temp/python24-zope211-cmf22-plone40/lib/python/Products/CMFFormController/Actions/TraverseTo.py", line 38, in __call__
        REQUEST, bind=1)
      File "/home/stefan/autotest/temp/python24-zope211/lib/python/ZPublisher/mapply.py", line 88, in mapply
        if debug is not None: return debug(object,args,context)
      File "/home/stefan/autotest/temp/python24-zope211/lib/python/ZPublisher/Publish.py", line 42, in call_object
        result=apply(object,args) # Type s<cr> to step into published object.
      File "/home/stefan/autotest/temp/python24-zope211-cmf22-plone40/lib/python/Products/CMFFormController/FSControllerPythonScript.py", line 104, in __call__
        result = FSControllerPythonScript.inheritedAttribute('__call__')(self, *args, **kwargs)
      File "/home/stefan/autotest/temp/python24-zope211-cmf22-plone40/lib/python/Products/CMFFormController/Script.py", line 145, in __call__
        return BaseFSPythonScript.__call__(self, *args, **kw)
      File "/home/stefan/autotest/temp/python24-zope211-cmf22-plone40/lib/python/Products/CMFCore/FSPythonScript.py", line 140, in __call__
        return Script.__call__(self, *args, **kw)
      File "/home/stefan/autotest/temp/python24-zope211/lib/python/Shared/DC/Scripts/Bindings.py", line 313, in __call__
        return self._bindAndExec(args, kw, None)
      File "/home/stefan/autotest/temp/python24-zope211/lib/python/Shared/DC/Scripts/Bindings.py", line 350, in _bindAndExec
        return self._exec(bound_data, args, kw)
      File "/home/stefan/autotest/temp/python24-zope211-cmf22-plone40/lib/python/Products/CMFCore/FSPythonScript.py", line 196, in _exec
        result = f(*args, **kw)
      File "Script (Python)", line 24, in logged_in
      File "/home/stefan/autotest/temp/python24-zope211-cmf22-plone40/lib/python/Products/CMFPlone/MembershipTool.py", line 310, in loginUser
        pas.credentials_cookie_auth.login()
      File "/home/stefan/autotest/temp/python24-zope211-cmf22-plone40/lib/python/Products/PlonePAS/plugins/cookie_handler.py", line 87, in login
        user_pas.updateCredentials(request, response, login, password)
      File "/home/stefan/autotest/temp/python24-zope211-cmf22-plone40/lib/python/Products/PluggableAuthService/PluggableAuthService.py", line 1098, in updateCredentials
        updater.updateCredentials(request, response, login, new_password)
      File "/home/stefan/autotest/temp/python24-zope211-cmf22-plone40/lib/python/plone/session/plugins/session.py", line 133, in updateCredentials
        self.setupSession(info["id"], response)
      File "/home/stefan/autotest/temp/python24-zope211-cmf22-plone40/lib/python/plone/session/plugins/session.py", line 85, in setupSession
        cookie=self.source.createIdentifier(userid)
      File "/home/stefan/autotest/temp/python24-zope211-cmf22-plone40/lib/python/plone/session/sources/hash.py", line 41, in createIdentifier
        signature=self.signUserid(userid)
      File "/home/stefan/autotest/temp/python24-zope211-cmf22-plone40/lib/python/plone/session/sources/hash.py", line 35, in signUserid
        secret = self.getSigningSecret()
      File "/home/stefan/autotest/temp/python24-zope211-cmf22-plone40/lib/python/plone/session/sources/hash.py", line 30, in getSigningSecret
        return self.getSecrets()[0]
      File "/home/stefan/autotest/temp/python24-zope211-cmf22-plone40/lib/python/plone/session/sources/hash.py", line 25, in getSecrets
        raise NoKeyManager
    NoKeyManager: <!DOCTYPE html PUBLIC "-//W3C//DTD XHTML 1.0 Transitional//EN" "http://www.w3.org/TR/xhtml1/DTD/xhtml1-transitional.dtd">



    <html xmlns="http://www.w3.org/1999/xhtml" xml:lang="en" lang="en">

      
        
        
        
        
        

      

      <head>

        <meta http-equiv="Content-Type" content="text/html;charset=utf-8" />

        
          <base href="http://nohost/plone/" /><!--[if lt IE 7]></base><![endif]-->
        

        <meta name="generator" content="Plone - http://plone.org" />

        <link rel="kss-base-url" href="http://nohost/plone/" />

      
      
        
          <script type="text/javascript" src="http://nohost/plone/portal_javascripts/Plone%20Default/jquery-cachekey8050.js">
          </script>
        
        
      

      
        
          <script type="text/javascript" src="http://nohost/plone/portal_javascripts/Plone%20Default/dropdown-cachekey2601.js">
          </script>
        
        
      

      
        
          <script type="text/javascript" src="http://nohost/plone/portal_javascripts/Plone%20Default/resourcekukit-cachekey7458.js">
          </script>
        
        
      

      
      
        
        
          <style type="text/css" media="screen"><!-- @import url(http://nohost/plone/portal_css/Plone%20Default/member-cachekey5128.css); --></style>
        
        
      

      
        
        
          <style type="text/css"><!-- @import url(http://nohost/plone/portal_css/Plone%20Default/base-cachekey7460.css); --></style>
        
        
      

      
      <link rel="kinetic-stylesheet" type="text/css" href="http://nohost/plone/portal_kss/Plone%20Default/at-cachekey8315.kss" />


    <title>Plone site</title>


        <!-- Internet Explorer CSS Fixes -->
        <!--[if IE]>
            <style type="text/css" media="all">@import url(http://nohost/plone/IEFixes.css);</style>
        <![endif]-->

        
        <link rel="author" href="http://nohost/plone/author/" title="Author information" />



        <link rel="shortcut icon" type="image/x-icon" href="http://nohost/plone/favicon.ico" />



        <link rel="home" href="http://nohost/plone" title="Front page" />

        <link rel="contents" href="http://nohost/plone/sitemap" title="Site Map" />






        <link rel="search" href="http://nohost/plone/search_form" title="Search this site" />



        <!-- Disable IE6 image toolbar -->
        <meta http-equiv="imagetoolbar" content="no" />
        
        
        

        
        

        
        

        
        

      </head>

      <body class="None template-default_error_message" dir="ltr">
        <div id="visual-portal-wrapper">

          <div id="portal-top">
            <div id="portal-header">
    <p class="hiddenStructure">
      <a accesskey="2" href="http://nohost/plone/login_form#documentContent">Skip to content.</a> |

      <a accesskey="6" href="http://nohost/plone/login_form#portlet-navigation-tree">Skip to navigation</a>
    </p>

    <ul id="portal-siteactions">

        <li id="siteaction-sitemap"><a href="http://nohost/plone/sitemap" accesskey="3" title="Site Map">Site Map</a></li>
        <li id="siteaction-accessibility"><a href="http://nohost/plone/accessibility-info" accesskey="0" title="Accessibility">Accessibility</a></li>
        <li id="siteaction-contact"><a href="http://nohost/plone/contact-info" accesskey="9" title="Contact">Contact</a></li>
        <li id="siteaction-plone_setup"><a href="http://nohost/plone/plone_control_panel" accesskey="" title="Site Setup">Site Setup</a></li>

    </ul>

    <div id="portal-searchbox">
        <form name="searchform" action="http://nohost/plone/search">

            <label for="searchGadget" class="hiddenStructure">Search Site</label>

            <div class="LSBox">
            <input name="SearchableText" type="text" size="18" title="Search Site" accesskey="4" class="inputLabel" id="searchGadget" />

            <input class="searchButton" type="submit" value="Search" />
        
            <div class="searchSection">
                <input id="searchbox_currentfolder_only" class="noborder" type="checkbox" name="path" value="/plone" />
                <label for="searchbox_currentfolder_only" style="cursor: pointer">
                    only in current section
                </label>
            </div>

            <div class="LSResult" id="LSResult" style=""><div class="LSShadow" id="LSShadow"></div></div>
            </div>
        </form>

        <div id="portal-advanced-search" class="hiddenStructure">
            <a href="http://nohost/plone/search_form" accesskey="5">
                Advanced Search&hellip;
            </a>
        </div>

    </div>

    <a id="portal-logo" accesskey="1" href="http://nohost/plone">
        <img src="http://nohost/plone/logo.jpg" alt="" title="Plone" height="57" width="252" /></a>


        <h5 class="hiddenStructure">Sections</h5>

        <ul id="portal-globalnav">
            <li id="portaltab-index_html" class="selected">
                <a href="http://nohost/plone" title="">Home</a></li>
            <li id="portaltab-Members" class="plain">
                <a href="http://nohost/plone/Members" title="Container for users' home directories">Users</a></li>
            <li id="portaltab-news" class="plain">
                <a href="http://nohost/plone/news" title="Site News">News</a></li>
            <li id="portaltab-events" class="plain">
                <a href="http://nohost/plone/events" title="Site Events">Events</a></li>
        </ul>

    </div>

    <div id="portal-personaltools-wrapper">

    <h5 class="hiddenStructure">Personal tools</h5>

    <ul id="portal-personaltools" class="visualInline">
       
           <li><a id="user-name" href="http://nohost/plone/dashboard"><img src="http://nohost/plone/user.gif" alt="" title="User" height="16" width="16" />
                <span class="visualCaseSensitive">manager</span></a></li>
       

        
            <li>
                <a href="http://nohost/plone/logout">Log out</a>
            </li>
        

    </ul>
    </div>


        


    <div id="portal-breadcrumbs">

        <span id="breadcrumbs-you-are-here">You
    are here:</span>
        <a href="http://nohost/plone">Home</a>
        

    </div>

          </div>

          <div class="visualClear" id="clear-space-before-wrapper-table"><!-- --></div>

          <table id="portal-columns">
            <tbody>
              <tr>
                
                
                

                
                <td id="portal-column-content">

                  
                    <div class="">

                      


                      <div id="region-content" class="documentContent">

                        <span id="contentTopLeft"></span>
                        <span id="contentTopRight"></span>
                        
                        <a name="documentContent"></a>

                        

        <dl class="portalMessage info" id="kssPortalMessage" style="display:none">
            <dt>Info</dt>
            <dd></dd>
        </dl>


                        
                        <div id="viewlet-above-content"></div>

                        
                        
                        
                          
                          <div>

            

            <div>

                <h1 class="documentFirstHeading">
                    We're sorry, but there seems to be an error&hellip;
                </h1>

                
                    
                    
                    
                
                    <p>
                    Since you are a site administrator, you can
                    <span> <a href="http://nohost/plone/error_log/showEntry?id=1209871810.390.54024435753">see the full error message</a> </span>
                    </p>

                

                

            </div>
            

    </div>
                        
                        

                        
                        
                          

                        
                        

                        <span id="contentBottomLeft"></span>
                        <span id="contentBottomRight"></span>

                      </div>

                    </div>

                  
                </td>
                

                
                
                
              </tr>
            </tbody>
          </table>
          

          <div class="visualClear" id="clear-space-before-footer"><!-- --></div>
          
          <div>
              <a class="managePortletsFallback" href="http://nohost/plone/@@manage-portlets">
                 Manage portlets
              </a>
          </div>

          

            <div id="portal-footer">

    <p>
        
        The
        <a href="http://plone.org">Plone<sup>&reg;</sup> CMS &mdash; Open Source Content Management System</a>
        is
        <acronym title="Copyright">&copy;</acronym>
        2000-2008
        by the
        <a href="http://plone.org/foundation">Plone Foundation</a>
        et al.
        
    </p>

    <p>
        
        Plone<sup>&reg;</sup> and the Plone logo are registered trademarks of the
            <a href="http://plone.org/foundation">Plone Foundation</a>.
        

        
        Distributed under the
            <a href="http://creativecommons.org/licenses/GPL/2.0/">GNU GPL license</a>.
        
    </p>

    </div>

      <div id="portal-colophon">
          

          

          <div class="colophonWrapper">
          <ul>
            <li>
              <a href="http://plone.org" title="This site was built using Plone CMS, the Open Source Content Management System. Click for more information.">
                Powered by Plone</a>
            </li>
            <li>
              <a href="http://validator.w3.org/check/referer" title="This site is valid XHTML.">
                Valid XHTML</a>
            </li>
            <li>
              <a href="http://jigsaw.w3.org/css-validator/check/referer&amp;warning=no&amp;profile=css3&amp;usermedium=all" title="This site was built with valid CSS.">
                Valid CSS</a>
            </li>
            <li>
              <a href="http://www.section508.gov" title="This site conforms to the US Government Section 508 Accessibility Guidelines.">
                Section 508</a>
            </li>
            <li>
              <a href="http://www.w3.org/WAI/WCAG1AA-Conformance" title="This site conforms to the W3C-WAI Web Content Accessibility Guidelines.">
                WCAG</a>
            </li>
          </ul>
          </div>

        </div>



          

          <div class="visualClear"><!-- --></div>
        </div>
    <div id="kss-spinner"><img alt="" src="http://nohost/plone/spinner.png" /></div>
    </body>
    </html>



  Ran 748 tests with 14 failures and 0 errors in 5 minutes 38.400 seconds.
Running plone.app.contentrules.tests.test_configuration.TestContentrulesGSLayer tests:
  Set up plone.app.contentrules.tests.test_configuration.TestContentrulesGSLayer/home/stefan/autotest/temp/python24-zope211/lib/python/zope/configuration/fields.py:417: UserWarning: You did not specify an i18n translation domain for the 'description' field in <string>
  warnings.warn(
/home/stefan/autotest/temp/python24-zope211/lib/python/zope/configuration/fields.py:417: UserWarning: You did not specify an i18n translation domain for the 'title' field in <string>
  warnings.warn(
 in 0.545 seconds.
  Ran 6 tests with 0 failures and 0 errors in 1.563 seconds.
Running plone.app.customerize.tests.layer.PloneCustomerize tests:
  Tear down plone.app.contentrules.tests.test_configuration.TestContentrulesGSLayer in 0.005 seconds.
  Set up plone.app.customerize.tests.layer.PloneCustomerize in 0.000 seconds.
  Ran 11 tests with 0 failures and 0 errors in 5.627 seconds.
Running plone.app.kss.tests.kss_and_plone_layer.KSSAndPloneLayer tests:
  Tear down plone.app.customerize.tests.layer.PloneCustomerize in 0.000 seconds.
  Set up plone.app.kss.tests.kss_and_plone_layer.KSSAndPloneLayer in 0.012 seconds.
  Ran 13 tests with 0 failures and 0 errors in 3.660 seconds.
Running plone.app.linkintegrity.tests.layer.PloneLinkintegrity tests:
  Tear down plone.app.kss.tests.kss_and_plone_layer.KSSAndPloneLayer in 0.000 seconds.
  Set up plone.app.linkintegrity.tests.layer.PloneLinkintegrity in 1.611 seconds.


Failure in test /home/stefan/autotest/temp/python24-zope211-cmf22-plone40/lib/python/plone/app/linkintegrity/docs/testRemovalsWithYesToAll.txt
Failed doctest test for testRemovalsWithYesToAll.txt
  File "/home/stefan/autotest/temp/python24-zope211-cmf22-plone40/lib/python/plone/app/linkintegrity/docs/testRemovalsWithYesToAll.txt", line 0

----------------------------------------------------------------------
File "/home/stefan/autotest/temp/python24-zope211-cmf22-plone40/lib/python/plone/app/linkintegrity/docs/testRemovalsWithYesToAll.txt", line 19, in testRemovalsWithYesToAll.txt
Failed example:
    browser.open('http://nohost/plone/folder_contents')
Exception raised:
    Traceback (most recent call last):
      File "/home/stefan/autotest/temp/python24-zope211/lib/python/zope/testing/doctest.py", line 1356, in __run
        compileflags, 1) in test.globs
      File "<doctest testRemovalsWithYesToAll.txt[8]>", line 1, in ?
        browser.open('http://nohost/plone/folder_contents')
      File "/home/stefan/autotest/temp/python24-zope211/lib/python/zope/testbrowser/browser.py", line 224, in open
        self.mech_browser.open(url, data)
      File "/home/stefan/autotest/temp/python24-zope211/lib/python/mechanize/_mechanize.py", line 177, in open
        return self._mech_open(url, data)
      File "/home/stefan/autotest/temp/python24-zope211/lib/python/mechanize/_mechanize.py", line 219, in _mech_open
        raise error
    HTTPError: HTTP Error 500: Internal Server Error



Failure in test /home/stefan/autotest/temp/python24-zope211-cmf22-plone40/lib/python/plone/app/linkintegrity/docs/testCircularReferencesWithHelper.txt
Failed doctest test for testCircularReferencesWithHelper.txt
  File "/home/stefan/autotest/temp/python24-zope211-cmf22-plone40/lib/python/plone/app/linkintegrity/docs/testCircularReferencesWithHelper.txt", line 0

----------------------------------------------------------------------
File "/home/stefan/autotest/temp/python24-zope211-cmf22-plone40/lib/python/plone/app/linkintegrity/docs/testCircularReferencesWithHelper.txt", line 20, in testCircularReferencesWithHelper.txt
Failed example:
    browser.open('http://nohost/plone/folder_contents')
Exception raised:
    Traceback (most recent call last):
      File "/home/stefan/autotest/temp/python24-zope211/lib/python/zope/testing/doctest.py", line 1356, in __run
        compileflags, 1) in test.globs
      File "<doctest testCircularReferencesWithHelper.txt[9]>", line 1, in ?
        browser.open('http://nohost/plone/folder_contents')
      File "/home/stefan/autotest/temp/python24-zope211/lib/python/zope/testbrowser/browser.py", line 224, in open
        self.mech_browser.open(url, data)
      File "/home/stefan/autotest/temp/python24-zope211/lib/python/mechanize/_mechanize.py", line 177, in open
        return self._mech_open(url, data)
      File "/home/stefan/autotest/temp/python24-zope211/lib/python/mechanize/_mechanize.py", line 219, in _mech_open
        raise error
    HTTPError: HTTP Error 500: Internal Server Error



Failure in test /home/stefan/autotest/temp/python24-zope211-cmf22-plone40/lib/python/plone/app/linkintegrity/docs/testReferalToPrivateFiles.txt
Failed doctest test for testReferalToPrivateFiles.txt
  File "/home/stefan/autotest/temp/python24-zope211-cmf22-plone40/lib/python/plone/app/linkintegrity/docs/testReferalToPrivateFiles.txt", line 0

----------------------------------------------------------------------
File "/home/stefan/autotest/temp/python24-zope211-cmf22-plone40/lib/python/plone/app/linkintegrity/docs/testReferalToPrivateFiles.txt", line 33, in testReferalToPrivateFiles.txt
Failed example:
    browser.open('http://nohost/plone/folder_contents')
Exception raised:
    Traceback (most recent call last):
      File "/home/stefan/autotest/temp/python24-zope211/lib/python/zope/testing/doctest.py", line 1356, in __run
        compileflags, 1) in test.globs
      File "<doctest testReferalToPrivateFiles.txt[16]>", line 1, in ?
        browser.open('http://nohost/plone/folder_contents')
      File "/home/stefan/autotest/temp/python24-zope211/lib/python/zope/testbrowser/browser.py", line 224, in open
        self.mech_browser.open(url, data)
      File "/home/stefan/autotest/temp/python24-zope211/lib/python/mechanize/_mechanize.py", line 177, in open
        return self._mech_open(url, data)
      File "/home/stefan/autotest/temp/python24-zope211/lib/python/mechanize/_mechanize.py", line 219, in _mech_open
        raise error
    HTTPError: HTTP Error 500: Internal Server Error



Failure in test /home/stefan/autotest/temp/python24-zope211-cmf22-plone40/lib/python/plone/app/linkintegrity/docs/testRenamingReferencedItem.txt
Failed doctest test for testRenamingReferencedItem.txt
  File "/home/stefan/autotest/temp/python24-zope211-cmf22-plone40/lib/python/plone/app/linkintegrity/docs/testRenamingReferencedItem.txt", line 0

----------------------------------------------------------------------
File "/home/stefan/autotest/temp/python24-zope211-cmf22-plone40/lib/python/plone/app/linkintegrity/docs/testRenamingReferencedItem.txt", line 11, in testRenamingReferencedItem.txt
Failed example:
    browser.open('http://nohost/plone/folder_contents')
Exception raised:
    Traceback (most recent call last):
      File "/home/stefan/autotest/temp/python24-zope211/lib/python/zope/testing/doctest.py", line 1356, in __run
        compileflags, 1) in test.globs
      File "<doctest testRenamingReferencedItem.txt[4]>", line 1, in ?
        browser.open('http://nohost/plone/folder_contents')
      File "/home/stefan/autotest/temp/python24-zope211/lib/python/zope/testbrowser/browser.py", line 224, in open
        self.mech_browser.open(url, data)
      File "/home/stefan/autotest/temp/python24-zope211/lib/python/mechanize/_mechanize.py", line 177, in open
        return self._mech_open(url, data)
      File "/home/stefan/autotest/temp/python24-zope211/lib/python/mechanize/_mechanize.py", line 219, in _mech_open
        raise error
    HTTPError: HTTP Error 500: Internal Server Error



Failure in test /home/stefan/autotest/temp/python24-zope211-cmf22-plone40/lib/python/plone/app/linkintegrity/docs/testRemovalInSubfolder.txt
Failed doctest test for testRemovalInSubfolder.txt
  File "/home/stefan/autotest/temp/python24-zope211-cmf22-plone40/lib/python/plone/app/linkintegrity/docs/testRemovalInSubfolder.txt", line 0

----------------------------------------------------------------------
File "/home/stefan/autotest/temp/python24-zope211-cmf22-plone40/lib/python/plone/app/linkintegrity/docs/testRemovalInSubfolder.txt", line 16, in testRemovalInSubfolder.txt
Failed example:
    browser.open('http://nohost/plone/folder_contents')
Exception raised:
    Traceback (most recent call last):
      File "/home/stefan/autotest/temp/python24-zope211/lib/python/zope/testing/doctest.py", line 1356, in __run
        compileflags, 1) in test.globs
      File "<doctest testRemovalInSubfolder.txt[5]>", line 1, in ?
        browser.open('http://nohost/plone/folder_contents')
      File "/home/stefan/autotest/temp/python24-zope211/lib/python/zope/testbrowser/browser.py", line 224, in open
        self.mech_browser.open(url, data)
      File "/home/stefan/autotest/temp/python24-zope211/lib/python/mechanize/_mechanize.py", line 177, in open
        return self._mech_open(url, data)
      File "/home/stefan/autotest/temp/python24-zope211/lib/python/mechanize/_mechanize.py", line 219, in _mech_open
        raise error
    HTTPError: HTTP Error 500: Internal Server Error



Failure in test /home/stefan/autotest/temp/python24-zope211-cmf22-plone40/lib/python/plone/app/linkintegrity/docs/testRemovalOfReferenceChain.txt
Failed doctest test for testRemovalOfReferenceChain.txt
  File "/home/stefan/autotest/temp/python24-zope211-cmf22-plone40/lib/python/plone/app/linkintegrity/docs/testRemovalOfReferenceChain.txt", line 0

----------------------------------------------------------------------
File "/home/stefan/autotest/temp/python24-zope211-cmf22-plone40/lib/python/plone/app/linkintegrity/docs/testRemovalOfReferenceChain.txt", line 21, in testRemovalOfReferenceChain.txt
Failed example:
    browser.open('http://nohost/plone/folder_contents')
Exception raised:
    Traceback (most recent call last):
      File "/home/stefan/autotest/temp/python24-zope211/lib/python/zope/testing/doctest.py", line 1356, in __run
        compileflags, 1) in test.globs
      File "<doctest testRemovalOfReferenceChain.txt[8]>", line 1, in ?
        browser.open('http://nohost/plone/folder_contents')
      File "/home/stefan/autotest/temp/python24-zope211/lib/python/zope/testbrowser/browser.py", line 224, in open
        self.mech_browser.open(url, data)
      File "/home/stefan/autotest/temp/python24-zope211/lib/python/mechanize/_mechanize.py", line 177, in open
        return self._mech_open(url, data)
      File "/home/stefan/autotest/temp/python24-zope211/lib/python/mechanize/_mechanize.py", line 219, in _mech_open
        raise error
    HTTPError: HTTP Error 500: Internal Server Error



Failure in test /home/stefan/autotest/temp/python24-zope211-cmf22-plone40/lib/python/plone/app/linkintegrity/docs/testMultipleFilesRemoval.txt
Failed doctest test for testMultipleFilesRemoval.txt
  File "/home/stefan/autotest/temp/python24-zope211-cmf22-plone40/lib/python/plone/app/linkintegrity/docs/testMultipleFilesRemoval.txt", line 0

----------------------------------------------------------------------
File "/home/stefan/autotest/temp/python24-zope211-cmf22-plone40/lib/python/plone/app/linkintegrity/docs/testMultipleFilesRemoval.txt", line 21, in testMultipleFilesRemoval.txt
Failed example:
    browser.open('http://nohost/plone/folder_contents')
Exception raised:
    Traceback (most recent call last):
      File "/home/stefan/autotest/temp/python24-zope211/lib/python/zope/testing/doctest.py", line 1356, in __run
        compileflags, 1) in test.globs
      File "<doctest testMultipleFilesRemoval.txt[8]>", line 1, in ?
        browser.open('http://nohost/plone/folder_contents')
      File "/home/stefan/autotest/temp/python24-zope211/lib/python/zope/testbrowser/browser.py", line 224, in open
        self.mech_browser.open(url, data)
      File "/home/stefan/autotest/temp/python24-zope211/lib/python/mechanize/_mechanize.py", line 177, in open
        return self._mech_open(url, data)
      File "/home/stefan/autotest/temp/python24-zope211/lib/python/mechanize/_mechanize.py", line 219, in _mech_open
        raise error
    HTTPError: HTTP Error 500: Internal Server Error



Failure in test /home/stefan/autotest/temp/python24-zope211-cmf22-plone40/lib/python/plone/app/linkintegrity/docs/testCircularReferences.txt
Failed doctest test for testCircularReferences.txt
  File "/home/stefan/autotest/temp/python24-zope211-cmf22-plone40/lib/python/plone/app/linkintegrity/docs/testCircularReferences.txt", line 0

----------------------------------------------------------------------
File "/home/stefan/autotest/temp/python24-zope211-cmf22-plone40/lib/python/plone/app/linkintegrity/docs/testCircularReferences.txt", line 28, in testCircularReferences.txt
Failed example:
    browser.open('http://nohost/plone/folder_contents')
Exception raised:
    Traceback (most recent call last):
      File "/home/stefan/autotest/temp/python24-zope211/lib/python/zope/testing/doctest.py", line 1356, in __run
        compileflags, 1) in test.globs
      File "<doctest testCircularReferences.txt[11]>", line 1, in ?
        browser.open('http://nohost/plone/folder_contents')
      File "/home/stefan/autotest/temp/python24-zope211/lib/python/zope/testbrowser/browser.py", line 224, in open
        self.mech_browser.open(url, data)
      File "/home/stefan/autotest/temp/python24-zope211/lib/python/mechanize/_mechanize.py", line 177, in open
        return self._mech_open(url, data)
      File "/home/stefan/autotest/temp/python24-zope211/lib/python/mechanize/_mechanize.py", line 219, in _mech_open
        raise error
    HTTPError: HTTP Error 500: Internal Server Error



Failure in test /home/stefan/autotest/temp/python24-zope211-cmf22-plone40/lib/python/plone/app/linkintegrity/docs/testReferenceInRestructuredText.txt
Failed doctest test for testReferenceInRestructuredText.txt
  File "/home/stefan/autotest/temp/python24-zope211-cmf22-plone40/lib/python/plone/app/linkintegrity/docs/testReferenceInRestructuredText.txt", line 0

----------------------------------------------------------------------
File "/home/stefan/autotest/temp/python24-zope211-cmf22-plone40/lib/python/plone/app/linkintegrity/docs/testReferenceInRestructuredText.txt", line 16, in testReferenceInRestructuredText.txt
Failed example:
    browser.open('http://nohost/plone/folder_contents')
Exception raised:
    Traceback (most recent call last):
      File "/home/stefan/autotest/temp/python24-zope211/lib/python/zope/testing/doctest.py", line 1356, in __run
        compileflags, 1) in test.globs
      File "<doctest testReferenceInRestructuredText.txt[4]>", line 1, in ?
        browser.open('http://nohost/plone/folder_contents')
      File "/home/stefan/autotest/temp/python24-zope211/lib/python/zope/testbrowser/browser.py", line 224, in open
        self.mech_browser.open(url, data)
      File "/home/stefan/autotest/temp/python24-zope211/lib/python/mechanize/_mechanize.py", line 177, in open
        return self._mech_open(url, data)
      File "/home/stefan/autotest/temp/python24-zope211/lib/python/mechanize/_mechanize.py", line 219, in _mech_open
        raise error
    HTTPError: HTTP Error 500: Internal Server Error



Failure in test /home/stefan/autotest/temp/python24-zope211-cmf22-plone40/lib/python/plone/app/linkintegrity/docs/testRemovalTriggersConfirmation.txt
Failed doctest test for testRemovalTriggersConfirmation.txt
  File "/home/stefan/autotest/temp/python24-zope211-cmf22-plone40/lib/python/plone/app/linkintegrity/docs/testRemovalTriggersConfirmation.txt", line 0

----------------------------------------------------------------------
File "/home/stefan/autotest/temp/python24-zope211-cmf22-plone40/lib/python/plone/app/linkintegrity/docs/testRemovalTriggersConfirmation.txt", line 10, in testRemovalTriggersConfirmation.txt
Failed example:
    self.assertEqual(doc.getReferences(), [img])
Exception raised:
    Traceback (most recent call last):
      File "/home/stefan/autotest/temp/python24-zope211/lib/python/zope/testing/doctest.py", line 1356, in __run
        compileflags, 1) in test.globs
      File "<doctest testRemovalTriggersConfirmation.txt[4]>", line 1, in ?
        self.assertEqual(doc.getReferences(), [img])
      File "/usr/local/python2.4/lib/python2.4/unittest.py", line 333, in failUnlessEqual
        raise self.failureException, \
    AssertionError: [] != [<ATImage at /plone/image1>]



Failure in test /home/stefan/autotest/temp/python24-zope211-cmf22-plone40/lib/python/plone/app/linkintegrity/docs/testRemovalWithCookieAuth.txt
Failed doctest test for testRemovalWithCookieAuth.txt
  File "/home/stefan/autotest/temp/python24-zope211-cmf22-plone40/lib/python/plone/app/linkintegrity/docs/testRemovalWithCookieAuth.txt", line 0

----------------------------------------------------------------------
File "/home/stefan/autotest/temp/python24-zope211-cmf22-plone40/lib/python/plone/app/linkintegrity/docs/testRemovalWithCookieAuth.txt", line 22, in testRemovalWithCookieAuth.txt
Failed example:
    browser.getControl('Log in').click()
Exception raised:
    Traceback (most recent call last):
      File "/home/stefan/autotest/temp/python24-zope211/lib/python/zope/testing/doctest.py", line 1356, in __run
        compileflags, 1) in test.globs
      File "<doctest testRemovalWithCookieAuth.txt[8]>", line 1, in ?
        browser.getControl('Log in').click()
      File "/home/stefan/autotest/temp/python24-zope211/lib/python/zope/testbrowser/browser.py", line 591, in click
        self.browser._clickSubmit(self.mech_form, self.mech_control, (1,1))
      File "/home/stefan/autotest/temp/python24-zope211/lib/python/zope/testbrowser/browser.py", line 380, in _clickSubmit
        self.mech_browser.open(form.click(
      File "/home/stefan/autotest/temp/python24-zope211/lib/python/mechanize/_mechanize.py", line 177, in open
        return self._mech_open(url, data)
      File "/home/stefan/autotest/temp/python24-zope211/lib/python/mechanize/_mechanize.py", line 219, in _mech_open
        raise error
    HTTPError: HTTP Error 500: Internal Server Error



Failure in test /home/stefan/autotest/temp/python24-zope211-cmf22-plone40/lib/python/plone/app/linkintegrity/docs/testRemovalInReferenceChain.txt
Failed doctest test for testRemovalInReferenceChain.txt
  File "/home/stefan/autotest/temp/python24-zope211-cmf22-plone40/lib/python/plone/app/linkintegrity/docs/testRemovalInReferenceChain.txt", line 0

----------------------------------------------------------------------
File "/home/stefan/autotest/temp/python24-zope211-cmf22-plone40/lib/python/plone/app/linkintegrity/docs/testRemovalInReferenceChain.txt", line 21, in testRemovalInReferenceChain.txt
Failed example:
    browser.open('http://nohost/plone/folder_contents')
Exception raised:
    Traceback (most recent call last):
      File "/home/stefan/autotest/temp/python24-zope211/lib/python/zope/testing/doctest.py", line 1356, in __run
        compileflags, 1) in test.globs
      File "<doctest testRemovalInReferenceChain.txt[8]>", line 1, in ?
        browser.open('http://nohost/plone/folder_contents')
      File "/home/stefan/autotest/temp/python24-zope211/lib/python/zope/testbrowser/browser.py", line 224, in open
        self.mech_browser.open(url, data)
      File "/home/stefan/autotest/temp/python24-zope211/lib/python/mechanize/_mechanize.py", line 177, in open
        return self._mech_open(url, data)
      File "/home/stefan/autotest/temp/python24-zope211/lib/python/mechanize/_mechanize.py", line 219, in _mech_open
        raise error
    HTTPError: HTTP Error 500: Internal Server Error



Failure in test /home/stefan/autotest/temp/python24-zope211-cmf22-plone40/lib/python/plone/app/linkintegrity/docs/testReferenceCreation.txt
Failed doctest test for testReferenceCreation.txt
  File "/home/stefan/autotest/temp/python24-zope211-cmf22-plone40/lib/python/plone/app/linkintegrity/docs/testReferenceCreation.txt", line 0

----------------------------------------------------------------------
File "/home/stefan/autotest/temp/python24-zope211-cmf22-plone40/lib/python/plone/app/linkintegrity/docs/testReferenceCreation.txt", line 24, in testReferenceCreation.txt
Failed example:
    doc.getReferences()
Expected:
    [<ATImage at /plone/image1>]
Got:
    []



Failure in test /home/stefan/autotest/temp/python24-zope211-cmf22-plone40/lib/python/plone/app/linkintegrity/docs/testReferenceOrthogonality.txt
Failed doctest test for testReferenceOrthogonality.txt
  File "/home/stefan/autotest/temp/python24-zope211-cmf22-plone40/lib/python/plone/app/linkintegrity/docs/testReferenceOrthogonality.txt", line 0

----------------------------------------------------------------------
File "/home/stefan/autotest/temp/python24-zope211-cmf22-plone40/lib/python/plone/app/linkintegrity/docs/testReferenceOrthogonality.txt", line 27, in testReferenceOrthogonality.txt
Failed example:
    doc.getReferences(relationship=referencedRelationship)
Expected:
    [<ATImage at /plone/image1>]
Got:
    []



Failure in test /home/stefan/autotest/temp/python24-zope211-cmf22-plone40/lib/python/plone/app/linkintegrity/docs/testInterReferences.txt
Failed doctest test for testInterReferences.txt
  File "/home/stefan/autotest/temp/python24-zope211-cmf22-plone40/lib/python/plone/app/linkintegrity/docs/testInterReferences.txt", line 0

----------------------------------------------------------------------
File "/home/stefan/autotest/temp/python24-zope211-cmf22-plone40/lib/python/plone/app/linkintegrity/docs/testInterReferences.txt", line 23, in testInterReferences.txt
Failed example:
    browser.open('http://nohost/plone/folder_contents')
Exception raised:
    Traceback (most recent call last):
      File "/home/stefan/autotest/temp/python24-zope211/lib/python/zope/testing/doctest.py", line 1356, in __run
        compileflags, 1) in test.globs
      File "<doctest testInterReferences.txt[10]>", line 1, in ?
        browser.open('http://nohost/plone/folder_contents')
      File "/home/stefan/autotest/temp/python24-zope211/lib/python/zope/testbrowser/browser.py", line 224, in open
        self.mech_browser.open(url, data)
      File "/home/stefan/autotest/temp/python24-zope211/lib/python/mechanize/_mechanize.py", line 177, in open
        return self._mech_open(url, data)
      File "/home/stefan/autotest/temp/python24-zope211/lib/python/mechanize/_mechanize.py", line 219, in _mech_open
        raise error
    HTTPError: HTTP Error 500: Internal Server Error



Failure in test /home/stefan/autotest/temp/python24-zope211-cmf22-plone40/lib/python/plone/app/linkintegrity/docs/testMultipleReferences.txt
Failed doctest test for testMultipleReferences.txt
  File "/home/stefan/autotest/temp/python24-zope211-cmf22-plone40/lib/python/plone/app/linkintegrity/docs/testMultipleReferences.txt", line 0

----------------------------------------------------------------------
File "/home/stefan/autotest/temp/python24-zope211-cmf22-plone40/lib/python/plone/app/linkintegrity/docs/testMultipleReferences.txt", line 22, in testMultipleReferences.txt
Failed example:
    browser.contents
Expected:
    '...<a href="http://nohost/plone/image1"...Test Image 1...
     ...This...Image...is referenced by the following items:...
     ...<li>...<a href="http://nohost/plone/doc1"...Test Page 1...</li>...
     ...Would you like to delete it anyway?...'
Got:
    '<!DOCTYPE html PUBLIC "-//W3C//DTD XHTML 1.0 Transitional//EN" "http://www.w3.org/TR/xhtml1/DTD/xhtml1-transitional.dtd">\n\n\n\n<html xmlns="http://www.w3.org/1999/xhtml" xml:lang="en" lang="en">\n\n  \n    \n    \n    \n    \n    \n\n  \n\n  <head>\n\n    <meta http-equiv="Content-Type" content="text/html;charset=utf-8" />\n\n    \n      <base href="http://nohost/plone/image1" /><!--[if lt IE 7]></base><![endif]-->\n    \n\n    <meta name="generator" content="Plone - http://plone.org" />\n\n    <link rel="kss-base-url" href="http://nohost/plone/image1/" />\n\n  \n  \n    \n      <script type="text/javascript" src="http://nohost/plone/portal_javascripts/Plone%20Default/jquery-cachekey8050.js">\n      </script>\n    \n    \n  \n\n  \n    \n      <script type="text/javascript" src="http://nohost/plone/portal_javascripts/Plone%20Default/dropdown-cachekey2601.js">\n      </script>\n    \n    \n  \n\n  \n    \n      <script type="text/javascript" src="http://nohost/plone/po!
 rtal_javascripts/Plone%20Default/resourcekukit-cachekey7458.js">\n      </script>\n    \n    \n  \n\n  \n  \n    \n    \n      <style type="text/css" media="screen"><!-- @import url(http://nohost/plone/portal_css/Plone%20Default/member-cachekey5128.css); --></style>\n    \n    \n  \n\n  \n    \n    \n      <style type="text/css"><!-- @import url(http://nohost/plone/portal_css/Plone%20Default/base-cachekey7460.css); --></style>\n    \n    \n  \n\n  \n  <link rel="kinetic-stylesheet" type="text/css" href="http://nohost/plone/portal_kss/Plone%20Default/at-cachekey8315.kss" />\n\n\na standard view\n\n<title>Test Image 1 &mdash; Plone site</title>\n\n\n    <!-- Internet Explorer CSS Fixes -->\n    <!--[if IE]>\n        <style type="text/css" media="all">@import url(http://nohost/plone/IEFixes.css);</style>\n    <![endif]-->\n\n    \n    <link rel="author" href="http://nohost/plone/author/portal_owner" title="Author information" />\n\n\n\n    <link rel="shortcut icon" type="image!
 /x-icon" href="http://nohost/plone/favicon.ico" />\n\n\n\n    <link re
l="home" href="http://nohost/plone" title="Front page" />\n\n    <link rel="contents" href="http://nohost/plone/sitemap" title="Site Map" />\n\n\n\n\n\n\n    <link rel="search" href="http://nohost/plone/search_form" title="Search this site" />\n\n\na standard view\n\n\n    <!-- Disable IE6 image toolbar -->\n    <meta http-equiv="imagetoolbar" content="no" />\n    \n    \n    \n\n    \n    \n\n    \n    \n\n    \n    \n\n  </head>\n\n  <body class="section-image1 template-delete_confirmation_page" dir="ltr">\n    <div id="visual-portal-wrapper">\n\n      <div id="portal-top">\n        <div id="portal-header">\n<p class="hiddenStructure">\n  <a accesskey="2" href="http://nohost/plone/image1/delete_confirmation#documentContent">Skip to content.</a> |\n\n  <a accesskey="6" href="http://nohost/plone/image1/delete_confirmation#portlet-navigation-tree">Skip to navigation</a>\n</p>\n\n<ul id="portal-siteactions">\n\n    <li id="siteaction-sitemap"><a href="http://nohost/plone/sitem!
 ap" accesskey="3" title="Site Map">Site Map</a></li>\n    <li id="siteaction-accessibility"><a href="http://nohost/plone/accessibility-info" accesskey="0" title="Accessibility">Accessibility</a></li>\n    <li id="siteaction-contact"><a href="http://nohost/plone/contact-info" accesskey="9" title="Contact">Contact</a></li>\n    <li id="siteaction-plone_setup"><a href="http://nohost/plone/plone_control_panel" accesskey="" title="Site Setup">Site Setup</a></li>\n\n</ul>\n\n<div id="portal-searchbox">\n    <form name="searchform" action="http://nohost/plone/search">\n\n        <label for="searchGadget" class="hiddenStructure">Search Site</label>\n\n        <div class="LSBox">\n        <input name="SearchableText" type="text" size="18" title="Search Site" accesskey="4" class="inputLabel" id="searchGadget" />\n\n        <input class="searchButton" type="submit" value="Search" />\n    \n        <div class="searchSection">\n            <input id="searchbox_currentfolder_only" class=!
 "noborder" type="checkbox" name="path" value="/plone" />\n            
<label for="searchbox_currentfolder_only" style="cursor: pointer">\n                only in current section\n            </label>\n        </div>\n\n        <div class="LSResult" id="LSResult" style=""><div class="LSShadow" id="LSShadow"></div></div>\n        </div>\n    </form>\n\n    <div id="portal-advanced-search" class="hiddenStructure">\n        <a href="http://nohost/plone/search_form" accesskey="5">\n            Advanced Search&hellip;\n        </a>\n    </div>\n\n</div>\n\n<a id="portal-logo" accesskey="1" href="http://nohost/plone">\n    <img src="http://nohost/plone/logo.jpg" alt="" title="Plone" height="57" width="252" /></a>\n\n\n    <h5 class="hiddenStructure">Sections</h5>\n\n    <ul id="portal-globalnav">\n        <li id="portaltab-index_html" class="selected">\n            <a href="http://nohost/plone" title="">Home</a></li>\n        <li id="portaltab-Members" class="plain">\n            <a href="http://nohost/plone/Members" title="Container for users\' home!
  directories">Users</a></li>\n        <li id="portaltab-news" class="plain">\n            <a href="http://nohost/plone/news" title="Site News">News</a></li>\n        <li id="portaltab-events" class="plain">\n            <a href="http://nohost/plone/events" title="Site Events">Events</a></li>\n        <li id="portaltab-doc1" class="plain">\n            <a href="http://nohost/plone/doc1" title="">Test Page 1</a></li>\n        <li id="portaltab-doc2" class="plain">\n            <a href="http://nohost/plone/doc2" title="">Test Page 2</a></li>\n        <li id="portaltab-image1/view" class="plain">\n            <a href="http://nohost/plone/image1/view" title="">Test Image 1</a></li>\n        <li id="portaltab-image2/view" class="plain">\n            <a href="http://nohost/plone/image2/view" title="">Test Image 2</a></li>\n        <li id="portaltab-image3/view" class="plain">\n            <a href="http://nohost/plone/image3/view" title="">Test Image 3</a></li>\n        <li id="por!
 taltab-folder1" class="plain">\n            <a href="http://nohost/plo
ne/folder1" title="">Test Folder 1</a></li>\n    </ul>\n\na standard view\n\n</div>\n\n<div id="portal-personaltools-wrapper">\n\n<h5 class="hiddenStructure">Personal tools</h5>\n\n<ul id="portal-personaltools" class="visualInline">\n   \n       <li><a id="user-name" href="http://nohost/plone/dashboard"><img src="http://nohost/plone/user.gif" alt="" title="User" height="16" width="16" />\n            <span class="visualCaseSensitive">test_user_1_</span></a></li>\n   \n\n    \n        <li>\n            <a href="http://nohost/plone/Members/test_user_1_">My Folder</a>\n        </li>\n    \n    \n        <li>\n            <a href="http://nohost/plone/logout">Log out</a>\n        </li>\n    \n\n</ul>\n</div>\n\n\n    \n\n\n<div id="portal-breadcrumbs">\n\n    <span id="breadcrumbs-you-are-here">You\nare here:</span>\n    <a href="http://nohost/plone">Home</a>\n    <span class="breadcrumbSeparator">\n        &rarr;\n        \n    </span>\n    <span dir="ltr">\n        \n          !
   \n            \n            <span>Test Image 1</span>\n         \n    </span>\n\n</div>\n\na standard view\n\n      </div>\n\n      <div class="visualClear" id="clear-space-before-wrapper-table"><!-- --></div>\n\n      <table id="portal-columns">\n        <tbody>\n          <tr>\n            \n            \n            \n\n            \n            <td id="portal-column-content">\n\n              \n                <div class="">\n\n                  \n\na standard view\n\n\n                  <div id="region-content" class="documentContent">\n\n                    <span id="contentTopLeft"></span>\n                    <span id="contentTopRight"></span>\n                    \n                    <a name="documentContent"></a>\n\n                    \n\n    <dl class="portalMessage info" id="kssPortalMessage" style="display:none">\n        <dt>Info</dt>\n        <dd></dd>\n    </dl>\n\n\n                    \n                    <div id="viewlet-above-content"><div id="plone!
 -lock-status">\n  \n</div>\n\na standard view\n</div>\n\n             
       \n                    \n                    \n                      \n                      <div>\n\n      \n\n      <h1 class="documentFirstHeading">\n        Do you really want to delete this item?\n      </h1>\n\n      <ul>\n          <li>Test Image 1</li>\n      </ul>\n\n      <form method="POST" action="http://nohost/plone/image1/delete_confirmation">\n        <div class="formControls">\n\n          <input type="hidden" name="form.submitted" value="1" />\n\n          <input class="destructive" type="submit" value="Delete" />\n          <input class="standalone" type="submit" value="Cancel" name="form.button.Cancel" />\n        </div>\n\n      </form>\n\n\n    </div>\n                    \n                    \n\n                    \n                    \n                      \n\na standard view\n\n                    \n                    \n\n                    <span id="contentBottomLeft"></span>\n                    <span id="contentBottomRight"></span>\n\n !
                  </div>\n\n                </div>\n\n              \n            </td>\n            \n\n            \n            <td id="portal-column-two">\n              <div class="visualPadding">\n                \n                  \n<div id="portletwrapper-706c6f6e652e7269676874636f6c756d6e0a636f6e746578740a2f706c6f6e650a63616c656e646172" class="portletWrapper kssattr-portlethash-706c6f6e652e7269676874636f6c756d6e0a636f6e746578740a2f706c6f6e650a63616c656e646172"><dl class="portlet portletCalendar">\n\n    <dt class="portletHeader">\n        <span class="portletTopLeft"></span>\n        <a href="?month:int=4&amp;year:int=2008&amp;orig_query=" rel="nofollow" title="Previous month" id="calendar-previous" class="kssCalendarChange kssattr-year-2008 kssattr-month-4 calendarPrevious">&laquo;</a>\n\n        \n            May\n            2008\n        \n\n        <a href="?month:int=6&amp;year:int=2008&amp;orig_query=" rel="nofollow" title="Next month" id="calendar-next" cla!
 ss="kssCalendarChange kssattr-year-2008 kssattr-month-6 calendarNext">
&raquo;</a>\n        <span class="portletTopRight"></span>\n    </dt>\n\n    <dd class="portletItem">\n        <table class="ploneCalendar" summary="Calendar">\n            <caption class="hiddenStructure">May</caption>\n            <thead>\n                <tr class="weekdays"><th scope="col">Mon</th><th scope="col">Tue</th><th scope="col">Wed</th><th scope="col">Thu</th><th scope="col">Fri</th><th scope="col">Sat</th><th scope="col">Sun</th>\n                </tr>\n            </thead>\n            <tbody>\n                <tr><td></td><td></td><td></td><td>1</td><td>2</td><td>3</td><td class="todaynoevent"><strong>4</strong></td>\n                </tr>\n                <tr><td>5</td><td>6</td><td>7</td><td>8</td><td>9</td><td>10</td><td>11</td>\n                </tr>\n                <tr><td>12</td><td>13</td><td>14</td><td>15</td><td>16</td><td>17</td><td>18</td>\n                </tr>\n                <tr><td>19</td><td>20</td><td>21</td><td>22</td><td>23</td><td>24</td!
 ><td>25</td>\n                </tr>\n                <tr><td>26</td><td>27</td><td>28</td><td>29</td><td>30</td><td>31</td><td></td>\n                </tr>\n            </tbody>\n\n        </table>\n        <span class="portletBottomLeft"></span>\n        <span class="portletBottomRight"></span>\n    </dd>\n</dl>\n</div>\n\n\n<div class="managePortletsLink">\n  <a title="View portlet management screen" href="http://nohost/plone/image1/@@manage-portlets">Manage portlets</a>\n</div>\n\n                \n                &nbsp;\n              </div>\n            </td>\n            \n          </tr>\n        </tbody>\n      </table>\n      \n\n      <div class="visualClear" id="clear-space-before-footer"><!-- --></div>\n      \n      \n\n      \n\n        <div id="portal-footer">\n\n<p>\n    \n    The\n    <a href="http://plone.org">Plone<sup>&reg;</sup> CMS &mdash; Open Source Content Management System</a>\n    is\n    <acronym title="Copyright">&copy;</acronym>\n    2000-2008\!
 n    by the\n    <a href="http://plone.org/foundation">Plone Foundatio
n</a>\n    et al.\n    \n</p>\n\n<p>\n    \n    Plone<sup>&reg;</sup> and the Plone logo are registered trademarks of the\n        <a href="http://plone.org/foundation">Plone Foundation</a>.\n    \n\n    \n    Distributed under the\n        <a href="http://creativecommons.org/licenses/GPL/2.0/">GNU GPL license</a>.\n    \n</p>\n\n</div>\n\n  <div id="portal-colophon">\n      \n\n      \n\n      <div class="colophonWrapper">\n      <ul>\n        <li>\n          <a href="http://plone.org" title="This site was built using Plone CMS, the Open Source Content Management System. Click for more information.">\n            Powered by Plone</a>\n        </li>\n        <li>\n          <a href="http://validator.w3.org/check/referer" title="This site is valid XHTML.">\n            Valid XHTML</a>\n        </li>\n        <li>\n          <a href="http://jigsaw.w3.org/css-validator/check/referer&amp;warning=no&amp;profile=css3&amp;usermedium=all" title="This site was built with valid CSS.">!
 \n            Valid CSS</a>\n        </li>\n        <li>\n          <a href="http://www.section508.gov" title="This site conforms to the US Government Section 508 Accessibility Guidelines.">\n            Section 508</a>\n        </li>\n        <li>\n          <a href="http://www.w3.org/WAI/WCAG1AA-Conformance" title="This site conforms to the W3C-WAI Web Content Accessibility Guidelines.">\n            WCAG</a>\n        </li>\n      </ul>\n      </div>\n\n    </div>\n\n\na standard view\n\n\n      \n\n      <div class="visualClear"><!-- --></div>\n    </div>\n<div id="kss-spinner"><img alt="" src="http://nohost/plone/spinner.png" /></div>\n</body>\n</html>\n\n'



Failure in test /home/stefan/autotest/temp/python24-zope211-cmf22-plone40/lib/python/plone/app/linkintegrity/docs/testOnOffSwitch.txt
Failed doctest test for testOnOffSwitch.txt
  File "/home/stefan/autotest/temp/python24-zope211-cmf22-plone40/lib/python/plone/app/linkintegrity/docs/testOnOffSwitch.txt", line 0

----------------------------------------------------------------------
File "/home/stefan/autotest/temp/python24-zope211-cmf22-plone40/lib/python/plone/app/linkintegrity/docs/testOnOffSwitch.txt", line 13, in testOnOffSwitch.txt
Failed example:
    browser.open('http://nohost/plone/folder_contents')
Exception raised:
    Traceback (most recent call last):
      File "/home/stefan/autotest/temp/python24-zope211/lib/python/zope/testing/doctest.py", line 1356, in __run
        compileflags, 1) in test.globs
      File "<doctest testOnOffSwitch.txt[4]>", line 1, in ?
        browser.open('http://nohost/plone/folder_contents')
      File "/home/stefan/autotest/temp/python24-zope211/lib/python/zope/testbrowser/browser.py", line 224, in open
        self.mech_browser.open(url, data)
      File "/home/stefan/autotest/temp/python24-zope211/lib/python/mechanize/_mechanize.py", line 177, in open
        return self._mech_open(url, data)
      File "/home/stefan/autotest/temp/python24-zope211/lib/python/mechanize/_mechanize.py", line 219, in _mech_open
        raise error
    HTTPError: HTTP Error 500: Internal Server Error



Failure in test /home/stefan/autotest/temp/python24-zope211-cmf22-plone40/lib/python/plone/app/linkintegrity/docs/testMultipleFilesRemovalWithHelper.txt
Failed doctest test for testMultipleFilesRemovalWithHelper.txt
  File "/home/stefan/autotest/temp/python24-zope211-cmf22-plone40/lib/python/plone/app/linkintegrity/docs/testMultipleFilesRemovalWithHelper.txt", line 0

----------------------------------------------------------------------
File "/home/stefan/autotest/temp/python24-zope211-cmf22-plone40/lib/python/plone/app/linkintegrity/docs/testMultipleFilesRemovalWithHelper.txt", line 19, in testMultipleFilesRemovalWithHelper.txt
Failed example:
    browser.open('http://nohost/plone/folder_contents')
Exception raised:
    Traceback (most recent call last):
      File "/home/stefan/autotest/temp/python24-zope211/lib/python/zope/testing/doctest.py", line 1356, in __run
        compileflags, 1) in test.globs
      File "<doctest testMultipleFilesRemovalWithHelper.txt[7]>", line 1, in ?
        browser.open('http://nohost/plone/folder_contents')
      File "/home/stefan/autotest/temp/python24-zope211/lib/python/zope/testbrowser/browser.py", line 224, in open
        self.mech_browser.open(url, data)
      File "/home/stefan/autotest/temp/python24-zope211/lib/python/mechanize/_mechanize.py", line 177, in open
        return self._mech_open(url, data)
      File "/home/stefan/autotest/temp/python24-zope211/lib/python/mechanize/_mechanize.py", line 219, in _mech_open
        raise error
    HTTPError: HTTP Error 500: Internal Server Error



Failure in test /home/stefan/autotest/temp/python24-zope211-cmf22-plone40/lib/python/plone/app/linkintegrity/docs/testConfirmationPageIntegration.txt
Failed doctest test for testConfirmationPageIntegration.txt
  File "/home/stefan/autotest/temp/python24-zope211-cmf22-plone40/lib/python/plone/app/linkintegrity/docs/testConfirmationPageIntegration.txt", line 0

----------------------------------------------------------------------
File "/home/stefan/autotest/temp/python24-zope211-cmf22-plone40/lib/python/plone/app/linkintegrity/docs/testConfirmationPageIntegration.txt", line 37, in testConfirmationPageIntegration.txt
Failed example:
    browser.contents
Expected:
    '...<a href="http://nohost/plone/image1"...Test Image 1...
     ...This...Image...is referenced by the following items:...
     ...<li>...<a href="http://nohost/plone/doc1"...Test Page 1...</li>...
     ...Would you like to delete it anyway?...'
Got:
    '<!DOCTYPE html PUBLIC "-//W3C//DTD XHTML 1.0 Transitional//EN" "http://www.w3.org/TR/xhtml1/DTD/xhtml1-transitional.dtd">\n\n\n\n<html xmlns="http://www.w3.org/1999/xhtml" xml:lang="en" lang="en">\n\n  \n    \n    \n    \n    \n    \n\n  \n\n  <head>\n\n    <meta http-equiv="Content-Type" content="text/html;charset=utf-8" />\n\n    \n      <base href="http://nohost/plone/image1" /><!--[if lt IE 7]></base><![endif]-->\n    \n\n    <meta name="generator" content="Plone - http://plone.org" />\n\n    <link rel="kss-base-url" href="http://nohost/plone/image1/" />\n\n  \n  \n    \n      <script type="text/javascript" src="http://nohost/plone/portal_javascripts/Plone%20Default/jquery-cachekey8050.js">\n      </script>\n    \n    \n  \n\n  \n    \n      <script type="text/javascript" src="http://nohost/plone/portal_javascripts/Plone%20Default/dropdown-cachekey2601.js">\n      </script>\n    \n    \n  \n\n  \n    \n      <script type="text/javascript" src="http://nohost/plone/po!
 rtal_javascripts/Plone%20Default/resourcekukit-cachekey7458.js">\n      </script>\n    \n    \n  \n\n  \n  \n    \n    \n      <style type="text/css" media="screen"><!-- @import url(http://nohost/plone/portal_css/Plone%20Default/member-cachekey5128.css); --></style>\n    \n    \n  \n\n  \n    \n    \n      <style type="text/css"><!-- @import url(http://nohost/plone/portal_css/Plone%20Default/base-cachekey7460.css); --></style>\n    \n    \n  \n\n  \n  <link rel="kinetic-stylesheet" type="text/css" href="http://nohost/plone/portal_kss/Plone%20Default/at-cachekey8315.kss" />\n\n\na standard view\n\n<title>Test Image 1 &mdash; Plone site</title>\n\n\n    <!-- Internet Explorer CSS Fixes -->\n    <!--[if IE]>\n        <style type="text/css" media="all">@import url(http://nohost/plone/IEFixes.css);</style>\n    <![endif]-->\n\n    \n    <link rel="author" href="http://nohost/plone/author/portal_owner" title="Author information" />\n\n\n\n    <link rel="shortcut icon" type="image!
 /x-icon" href="http://nohost/plone/favicon.ico" />\n\n\n\n    <link re
l="home" href="http://nohost/plone" title="Front page" />\n\n    <link rel="contents" href="http://nohost/plone/sitemap" title="Site Map" />\n\n\n\n\n\n\n    <link rel="search" href="http://nohost/plone/search_form" title="Search this site" />\n\n\na standard view\n\n\n    <!-- Disable IE6 image toolbar -->\n    <meta http-equiv="imagetoolbar" content="no" />\n    \n    \n    \n\n    \n    \n\n    \n    \n\n    \n    \n\n  </head>\n\n  <body class="section-image1 template-delete_confirmation_page" dir="ltr">\n    <div id="visual-portal-wrapper">\n\n      <div id="portal-top">\n        <div id="portal-header">\n<p class="hiddenStructure">\n  <a accesskey="2" href="http://nohost/plone/image1/delete_confirmation#documentContent">Skip to content.</a> |\n\n  <a accesskey="6" href="http://nohost/plone/image1/delete_confirmation#portlet-navigation-tree">Skip to navigation</a>\n</p>\n\n<ul id="portal-siteactions">\n\n    <li id="siteaction-sitemap"><a href="http://nohost/plone/sitem!
 ap" accesskey="3" title="Site Map">Site Map</a></li>\n    <li id="siteaction-accessibility"><a href="http://nohost/plone/accessibility-info" accesskey="0" title="Accessibility">Accessibility</a></li>\n    <li id="siteaction-contact"><a href="http://nohost/plone/contact-info" accesskey="9" title="Contact">Contact</a></li>\n    <li id="siteaction-plone_setup"><a href="http://nohost/plone/plone_control_panel" accesskey="" title="Site Setup">Site Setup</a></li>\n\n</ul>\n\n<div id="portal-searchbox">\n    <form name="searchform" action="http://nohost/plone/search">\n\n        <label for="searchGadget" class="hiddenStructure">Search Site</label>\n\n        <div class="LSBox">\n        <input name="SearchableText" type="text" size="18" title="Search Site" accesskey="4" class="inputLabel" id="searchGadget" />\n\n        <input class="searchButton" type="submit" value="Search" />\n    \n        <div class="searchSection">\n            <input id="searchbox_currentfolder_only" class=!
 "noborder" type="checkbox" name="path" value="/plone" />\n            
<label for="searchbox_currentfolder_only" style="cursor: pointer">\n                only in current section\n            </label>\n        </div>\n\n        <div class="LSResult" id="LSResult" style=""><div class="LSShadow" id="LSShadow"></div></div>\n        </div>\n    </form>\n\n    <div id="portal-advanced-search" class="hiddenStructure">\n        <a href="http://nohost/plone/search_form" accesskey="5">\n            Advanced Search&hellip;\n        </a>\n    </div>\n\n</div>\n\n<a id="portal-logo" accesskey="1" href="http://nohost/plone">\n    <img src="http://nohost/plone/logo.jpg" alt="" title="Plone" height="57" width="252" /></a>\n\n\n    <h5 class="hiddenStructure">Sections</h5>\n\n    <ul id="portal-globalnav">\n        <li id="portaltab-index_html" class="selected">\n            <a href="http://nohost/plone" title="">Home</a></li>\n        <li id="portaltab-Members" class="plain">\n            <a href="http://nohost/plone/Members" title="Container for users\' home!
  directories">Users</a></li>\n        <li id="portaltab-news" class="plain">\n            <a href="http://nohost/plone/news" title="Site News">News</a></li>\n        <li id="portaltab-events" class="plain">\n            <a href="http://nohost/plone/events" title="Site Events">Events</a></li>\n        <li id="portaltab-doc1" class="plain">\n            <a href="http://nohost/plone/doc1" title="">Test Page 1</a></li>\n        <li id="portaltab-doc2" class="plain">\n            <a href="http://nohost/plone/doc2" title="">Test Page 2</a></li>\n        <li id="portaltab-image1/view" class="plain">\n            <a href="http://nohost/plone/image1/view" title="">Test Image 1</a></li>\n        <li id="portaltab-image2/view" class="plain">\n            <a href="http://nohost/plone/image2/view" title="">Test Image 2</a></li>\n        <li id="portaltab-image3/view" class="plain">\n            <a href="http://nohost/plone/image3/view" title="">Test Image 3</a></li>\n        <li id="por!
 taltab-folder1" class="plain">\n            <a href="http://nohost/plo
ne/folder1" title="">Test Folder 1</a></li>\n    </ul>\n\na standard view\n\n</div>\n\n<div id="portal-personaltools-wrapper">\n\n<h5 class="hiddenStructure">Personal tools</h5>\n\n<ul id="portal-personaltools" class="visualInline">\n   \n       <li><a id="user-name" href="http://nohost/plone/dashboard"><img src="http://nohost/plone/user.gif" alt="" title="User" height="16" width="16" />\n            <span class="visualCaseSensitive">test_user_1_</span></a></li>\n   \n\n    \n        <li>\n            <a href="http://nohost/plone/Members/test_user_1_">My Folder</a>\n        </li>\n    \n    \n        <li>\n            <a href="http://nohost/plone/logout">Log out</a>\n        </li>\n    \n\n</ul>\n</div>\n\n\n    \n\n\n<div id="portal-breadcrumbs">\n\n    <span id="breadcrumbs-you-are-here">You\nare here:</span>\n    <a href="http://nohost/plone">Home</a>\n    <span class="breadcrumbSeparator">\n        &rarr;\n        \n    </span>\n    <span dir="ltr">\n        \n          !
   \n            \n            <span>Test Image 1</span>\n         \n    </span>\n\n</div>\n\na standard view\n\n      </div>\n\n      <div class="visualClear" id="clear-space-before-wrapper-table"><!-- --></div>\n\n      <table id="portal-columns">\n        <tbody>\n          <tr>\n            \n            \n            \n\n            \n            <td id="portal-column-content">\n\n              \n                <div class="">\n\n                  \n\na standard view\n\n\n                  <div id="region-content" class="documentContent">\n\n                    <span id="contentTopLeft"></span>\n                    <span id="contentTopRight"></span>\n                    \n                    <a name="documentContent"></a>\n\n                    \n\n    <dl class="portalMessage info" id="kssPortalMessage" style="display:none">\n        <dt>Info</dt>\n        <dd></dd>\n    </dl>\n\n\n                    \n                    <div id="viewlet-above-content"><div id="plone!
 -lock-status">\n  \n</div>\n\na standard view\n</div>\n\n             
       \n                    \n                    \n                      \n                      <div>\n\n      \n\n      <h1 class="documentFirstHeading">\n        Do you really want to delete this item?\n      </h1>\n\n      <ul>\n          <li>Test Image 1</li>\n      </ul>\n\n      <form method="POST" action="http://nohost/plone/image1/delete_confirmation">\n        <div class="formControls">\n\n          <input type="hidden" name="form.submitted" value="1" />\n\n          <input class="destructive" type="submit" value="Delete" />\n          <input class="standalone" type="submit" value="Cancel" name="form.button.Cancel" />\n        </div>\n\n      </form>\n\n\n    </div>\n                    \n                    \n\n                    \n                    \n                      \n\na standard view\n\n                    \n                    \n\n                    <span id="contentBottomLeft"></span>\n                    <span id="contentBottomRight"></span>\n\n !
                  </div>\n\n                </div>\n\n              \n            </td>\n            \n\n            \n            <td id="portal-column-two">\n              <div class="visualPadding">\n                \n                  \n<div id="portletwrapper-706c6f6e652e7269676874636f6c756d6e0a636f6e746578740a2f706c6f6e650a63616c656e646172" class="portletWrapper kssattr-portlethash-706c6f6e652e7269676874636f6c756d6e0a636f6e746578740a2f706c6f6e650a63616c656e646172"><dl class="portlet portletCalendar">\n\n    <dt class="portletHeader">\n        <span class="portletTopLeft"></span>\n        <a href="?month:int=4&amp;year:int=2008&amp;orig_query=" rel="nofollow" title="Previous month" id="calendar-previous" class="kssCalendarChange kssattr-year-2008 kssattr-month-4 calendarPrevious">&laquo;</a>\n\n        \n            May\n            2008\n        \n\n        <a href="?month:int=6&amp;year:int=2008&amp;orig_query=" rel="nofollow" title="Next month" id="calendar-next" cla!
 ss="kssCalendarChange kssattr-year-2008 kssattr-month-6 calendarNext">
&raquo;</a>\n        <span class="portletTopRight"></span>\n    </dt>\n\n    <dd class="portletItem">\n        <table class="ploneCalendar" summary="Calendar">\n            <caption class="hiddenStructure">May</caption>\n            <thead>\n                <tr class="weekdays"><th scope="col">Mon</th><th scope="col">Tue</th><th scope="col">Wed</th><th scope="col">Thu</th><th scope="col">Fri</th><th scope="col">Sat</th><th scope="col">Sun</th>\n                </tr>\n            </thead>\n            <tbody>\n                <tr><td></td><td></td><td></td><td>1</td><td>2</td><td>3</td><td class="todaynoevent"><strong>4</strong></td>\n                </tr>\n                <tr><td>5</td><td>6</td><td>7</td><td>8</td><td>9</td><td>10</td><td>11</td>\n                </tr>\n                <tr><td>12</td><td>13</td><td>14</td><td>15</td><td>16</td><td>17</td><td>18</td>\n                </tr>\n                <tr><td>19</td><td>20</td><td>21</td><td>22</td><td>23</td><td>24</td!
 ><td>25</td>\n                </tr>\n                <tr><td>26</td><td>27</td><td>28</td><td>29</td><td>30</td><td>31</td><td></td>\n                </tr>\n            </tbody>\n\n        </table>\n        <span class="portletBottomLeft"></span>\n        <span class="portletBottomRight"></span>\n    </dd>\n</dl>\n</div>\n\n\n<div class="managePortletsLink">\n  <a title="View portlet management screen" href="http://nohost/plone/image1/@@manage-portlets">Manage portlets</a>\n</div>\n\n                \n                &nbsp;\n              </div>\n            </td>\n            \n          </tr>\n        </tbody>\n      </table>\n      \n\n      <div class="visualClear" id="clear-space-before-footer"><!-- --></div>\n      \n      \n\n      \n\n        <div id="portal-footer">\n\n<p>\n    \n    The\n    <a href="http://plone.org">Plone<sup>&reg;</sup> CMS &mdash; Open Source Content Management System</a>\n    is\n    <acronym title="Copyright">&copy;</acronym>\n    2000-2008\!
 n    by the\n    <a href="http://plone.org/foundation">Plone Foundatio
n</a>\n    et al.\n    \n</p>\n\n<p>\n    \n    Plone<sup>&reg;</sup> and the Plone logo are registered trademarks of the\n        <a href="http://plone.org/foundation">Plone Foundation</a>.\n    \n\n    \n    Distributed under the\n        <a href="http://creativecommons.org/licenses/GPL/2.0/">GNU GPL license</a>.\n    \n</p>\n\n</div>\n\n  <div id="portal-colophon">\n      \n\n      \n\n      <div class="colophonWrapper">\n      <ul>\n        <li>\n          <a href="http://plone.org" title="This site was built using Plone CMS, the Open Source Content Management System. Click for more information.">\n            Powered by Plone</a>\n        </li>\n        <li>\n          <a href="http://validator.w3.org/check/referer" title="This site is valid XHTML.">\n            Valid XHTML</a>\n        </li>\n        <li>\n          <a href="http://jigsaw.w3.org/css-validator/check/referer&amp;warning=no&amp;profile=css3&amp;usermedium=all" title="This site was built with valid CSS.">!
 \n            Valid CSS</a>\n        </li>\n        <li>\n          <a href="http://www.section508.gov" title="This site conforms to the US Government Section 508 Accessibility Guidelines.">\n            Section 508</a>\n        </li>\n        <li>\n          <a href="http://www.w3.org/WAI/WCAG1AA-Conformance" title="This site conforms to the W3C-WAI Web Content Accessibility Guidelines.">\n            WCAG</a>\n        </li>\n      </ul>\n      </div>\n\n    </div>\n\n\na standard view\n\n\n      \n\n      <div class="visualClear"><!-- --></div>\n    </div>\n<div id="kss-spinner"><img alt="" src="http://nohost/plone/spinner.png" /></div>\n</body>\n</html>\n\n'



Failure in test /home/stefan/autotest/temp/python24-zope211-cmf22-plone40/lib/python/plone/app/linkintegrity/docs/testProgrammaticallyRemoval.txt
Failed doctest test for testProgrammaticallyRemoval.txt
  File "/home/stefan/autotest/temp/python24-zope211-cmf22-plone40/lib/python/plone/app/linkintegrity/docs/testProgrammaticallyRemoval.txt", line 0

----------------------------------------------------------------------
File "/home/stefan/autotest/temp/python24-zope211-cmf22-plone40/lib/python/plone/app/linkintegrity/docs/testProgrammaticallyRemoval.txt", line 9, in testProgrammaticallyRemoval.txt
Failed example:
    self.assertEqual(doc.getReferences(), [img])
Exception raised:
    Traceback (most recent call last):
      File "/home/stefan/autotest/temp/python24-zope211/lib/python/zope/testing/doctest.py", line 1356, in __run
        compileflags, 1) in test.globs
      File "<doctest testProgrammaticallyRemoval.txt[4]>", line 1, in ?
        self.assertEqual(doc.getReferences(), [img])
      File "/usr/local/python2.4/lib/python2.4/unittest.py", line 333, in failUnlessEqual
        raise self.failureException, \
    AssertionError: [] != [<ATImage at /plone/image1>]



Failure in test /home/stefan/autotest/temp/python24-zope211-cmf22-plone40/lib/python/plone/app/linkintegrity/docs/testCancelDuringMultiRemoval.txt
Failed doctest test for testCancelDuringMultiRemoval.txt
  File "/home/stefan/autotest/temp/python24-zope211-cmf22-plone40/lib/python/plone/app/linkintegrity/docs/testCancelDuringMultiRemoval.txt", line 0

----------------------------------------------------------------------
File "/home/stefan/autotest/temp/python24-zope211-cmf22-plone40/lib/python/plone/app/linkintegrity/docs/testCancelDuringMultiRemoval.txt", line 23, in testCancelDuringMultiRemoval.txt
Failed example:
    browser.open('http://nohost/plone/folder_contents')
Exception raised:
    Traceback (most recent call last):
      File "/home/stefan/autotest/temp/python24-zope211/lib/python/zope/testing/doctest.py", line 1356, in __run
        compileflags, 1) in test.globs
      File "<doctest testCancelDuringMultiRemoval.txt[8]>", line 1, in ?
        browser.open('http://nohost/plone/folder_contents')
      File "/home/stefan/autotest/temp/python24-zope211/lib/python/zope/testbrowser/browser.py", line 224, in open
        self.mech_browser.open(url, data)
      File "/home/stefan/autotest/temp/python24-zope211/lib/python/mechanize/_mechanize.py", line 177, in open
        return self._mech_open(url, data)
      File "/home/stefan/autotest/temp/python24-zope211/lib/python/mechanize/_mechanize.py", line 219, in _mech_open
        raise error
    HTTPError: HTTP Error 500: Internal Server Error

  Ran 95 tests with 21 failures and 0 errors in 33.595 seconds.
Running plone.app.portlets.tests.test_configuration.TestPortletZCMLLayer tests:
  Tear down plone.app.linkintegrity.tests.layer.PloneLinkintegrity in 0.210 seconds.
  Set up plone.app.portlets.tests.test_configuration.TestPortletZCMLLayer in 0.015 seconds.
  Ran 5 tests with 0 failures and 0 errors in 0.062 seconds.
Running plone.app.portlets.tests.test_configuration.TestPortletGSLayer tests:
  Set up plone.app.portlets.tests.test_configuration.TestPortletGSLayer in 1.601 seconds.


Failure in test testPortletTypeRegistered (plone.app.portlets.tests.test_configuration.TestGenericSetup)
Traceback (most recent call last):
  File "/usr/local/python2.4/lib/python2.4/unittest.py", line 260, in run
    testMethod()
  File "/home/stefan/autotest/temp/python24-zope211-cmf22-plone40/lib/python/plone/app/portlets/tests/test_configuration.py", line 202, in testPortletTypeRegistered
    self.failUnless(isinstance(portlet_type.title, Message))
  File "/usr/local/python2.4/lib/python2.4/unittest.py", line 309, in failUnless
    if not expr: raise self.failureException, msg
AssertionError

  Ran 12 tests with 1 failures and 0 errors in 4.719 seconds.
Running plone.app.viewletmanager.tests.test_exportimport.Layer tests:
  Tear down plone.app.portlets.tests.test_configuration.TestPortletGSLayer in 0.000 seconds.
  Tear down plone.app.portlets.tests.test_configuration.TestPortletZCMLLayer in 0.000 seconds.
  Tear down Products.PloneTestCase.layer.PloneSite in 0.766 seconds.
  Tear down Products.PloneTestCase.layer.ZCML in 0.038 seconds.
  Tear down Testing.ZopeTestCase.layer.ZopeLite in 0.000 seconds.
  Set up plone.app.viewletmanager.tests.test_exportimport.Layer in 0.000 seconds.
  Ran 15 tests with 0 failures and 0 errors in 0.147 seconds.
Running plone.browserlayer.tests.test_doctest.PloneBrowserLayerLayer tests:
  Tear down plone.app.viewletmanager.tests.test_exportimport.Layer in 0.000 seconds.
  Set up Testing.ZopeTestCase.layer.ZopeLite in 0.060 seconds.
  Set up Products.PloneTestCase.layer.ZCML in 3.769 seconds.
  Set up Products.PloneTestCase.layer.PloneSite in 10.393 seconds.
  Set up plone.browserlayer.tests.test_doctest.PloneBrowserLayerLayer in 0.010 seconds.
  Ran 9 tests with 0 failures and 0 errors in 1.772 seconds.
Running plone.theme.tests.test_doctest.PloneThemeLayer tests:
  Tear down plone.browserlayer.tests.test_doctest.PloneBrowserLayerLayer in 0.000 seconds.
  Set up plone.theme.tests.test_doctest.PloneThemeLayer in 0.012 seconds.
  Ran 5 tests with 0 failures and 0 errors in 0.168 seconds.
Tearing down left over layers:
  Tear down plone.theme.tests.test_doctest.PloneThemeLayer in 0.000 seconds.
  Tear down Products.PloneTestCase.layer.PloneSite in 0.723 seconds.
  Tear down Products.PloneTestCase.layer.ZCML in 0.021 seconds.
  Tear down Testing.ZopeTestCase.layer.ZopeLite in 0.000 seconds.
Total: 1328 tests, 38 failures, 1 errors in 7 minutes 25.110 seconds.

FAILED (failures=38, errors=1)




More information about the Testbot mailing list