[Testbot] FAILED (failures=14, errors=1) : ATCT-trunk Plone-trunk Zope-2.11 Python-2.4.4

ATContentTypes Tests plone-tests at epy.co.at
Fri May 2 05:05:16 UTC 2008


ATContentTypes Tests : FAILED (failures=14, errors=1)
ATCT-trunk Plone-trunk Zope-2.11 Python-2.4.4

Running /usr/local/python2.4/bin/python /home/stefan/autotest/temp/python24-zope211/test.py -q -1 --config-file etc/zope.conf --package Products.ATContentTypes
/home/stefan/autotest/temp/python24-zope211-cmf22-plone40/Products/ATContentTypes/tests/atcttestcase.py:62: DeprecationWarning: ITranslatable: Please use Products.LinguaPlone.interfaces.ITranslatable instead. This interface will be removed in Plone 5.0
  from Products.CMFPlone.interfaces.Translatable import ITranslatable
Parsing /home/stefan/autotest/temp/python24-zope211-cmf22-plone40/etc/zope.conf
Running Products.PloneTestCase.layer.PloneSite tests:
  Set up Testing.ZopeTestCase.layer.ZopeLite in 2.801 seconds.
  Set up Products.PloneTestCase.layer.ZCML in 11.241 seconds.
  Set up Products.PloneTestCase.layer.PloneSite/home/stefan/autotest/temp/python24-zope211-cmf22-plone40/lib/python/Products/PlonePAS/setuphandlers.py:43: DeprecationWarning: portal_groups.listGroups is deprecated and will be removed in Plone 3.5. Use PAS searchGroups instead
  existing = gtool.listGroupIds()
 in 14.553 seconds.


Failure in test test_typeInfo (Products.ATContentTypes.tests.test_atdocument.TestSiteATDocument)
Traceback (most recent call last):
  File "/usr/local/python2.4/lib/python2.4/unittest.py", line 260, in run
    testMethod()
  File "/home/stefan/autotest/temp/python24-zope211-cmf22-plone40/Products/ATContentTypes/tests/atcttestcase.py", line 144, in test_typeInfo
    self.failUnlessEqual(ti.getIcon(), self.icon)
  File "/usr/local/python2.4/lib/python2.4/unittest.py", line 333, in failUnlessEqual
    raise self.failureException, \
AssertionError: 'document_icon.png' != 'document_icon.gif'



Failure in test test_text_setEmptyText (Products.ATContentTypes.tests.test_atdocument.TestATDocumentFields)
Traceback (most recent call last):
  File "/usr/local/python2.4/lib/python2.4/unittest.py", line 260, in run
    testMethod()
  File "/home/stefan/autotest/temp/python24-zope211-cmf22-plone40/Products/ATContentTypes/tests/test_atdocument.py", line 254, in test_text_setEmptyText
    self.assertEquals(accessor(), '')
  File "/usr/local/python2.4/lib/python2.4/unittest.py", line 333, in failUnlessEqual
    raise self.failureException, \
AssertionError: '<p>Hello World!</p>' != ''



Failure in test test_typeInfo (Products.ATContentTypes.tests.test_atevent.TestSiteATEvent)
Traceback (most recent call last):
  File "/usr/local/python2.4/lib/python2.4/unittest.py", line 260, in run
    testMethod()
  File "/home/stefan/autotest/temp/python24-zope211-cmf22-plone40/Products/ATContentTypes/tests/atcttestcase.py", line 144, in test_typeInfo
    self.failUnlessEqual(ti.getIcon(), self.icon)
  File "/usr/local/python2.4/lib/python2.4/unittest.py", line 333, in failUnlessEqual
    raise self.failureException, \
AssertionError: 'event_icon.png' != 'event_icon.gif'



Failure in test test_typeInfo (Products.ATContentTypes.tests.test_atfavorite.TestSiteATFavorite)
Traceback (most recent call last):
  File "/usr/local/python2.4/lib/python2.4/unittest.py", line 260, in run
    testMethod()
  File "/home/stefan/autotest/temp/python24-zope211-cmf22-plone40/Products/ATContentTypes/tests/atcttestcase.py", line 144, in test_typeInfo
    self.failUnlessEqual(ti.getIcon(), self.icon)
  File "/usr/local/python2.4/lib/python2.4/unittest.py", line 333, in failUnlessEqual
    raise self.failureException, \
AssertionError: 'favorite_icon.png' != 'favorite_icon.gif'



Failure in test test_typeInfo (Products.ATContentTypes.tests.test_atfile.TestSiteATFile)
Traceback (most recent call last):
  File "/usr/local/python2.4/lib/python2.4/unittest.py", line 260, in run
    testMethod()
  File "/home/stefan/autotest/temp/python24-zope211-cmf22-plone40/Products/ATContentTypes/tests/atcttestcase.py", line 144, in test_typeInfo
    self.failUnlessEqual(ti.getIcon(), self.icon)
  File "/usr/local/python2.4/lib/python2.4/unittest.py", line 333, in failUnlessEqual
    raise self.failureException, \
AssertionError: 'file_icon.png' != 'file_icon.gif'



Failure in test test_typeInfo (Products.ATContentTypes.tests.test_atfolder.TestSiteATFolder)
Traceback (most recent call last):
  File "/usr/local/python2.4/lib/python2.4/unittest.py", line 260, in run
    testMethod()
  File "/home/stefan/autotest/temp/python24-zope211-cmf22-plone40/Products/ATContentTypes/tests/atcttestcase.py", line 144, in test_typeInfo
    self.failUnlessEqual(ti.getIcon(), self.icon)
  File "/usr/local/python2.4/lib/python2.4/unittest.py", line 333, in failUnlessEqual
    raise self.failureException, \
AssertionError: 'folder_icon.png' != 'folder_icon.gif'



Failure in test test_typeInfo (Products.ATContentTypes.tests.test_atfolder.TestSiteATBTreeFolder)
Traceback (most recent call last):
  File "/usr/local/python2.4/lib/python2.4/unittest.py", line 260, in run
    testMethod()
  File "/home/stefan/autotest/temp/python24-zope211-cmf22-plone40/Products/ATContentTypes/tests/atcttestcase.py", line 144, in test_typeInfo
    self.failUnlessEqual(ti.getIcon(), self.icon)
  File "/usr/local/python2.4/lib/python2.4/unittest.py", line 333, in failUnlessEqual
    raise self.failureException, \
AssertionError: 'folder_icon.png' != 'folder_icon.gif'



Error in test test_bobo_hook (Products.ATContentTypes.tests.test_atimage.TestSiteATImage)
Traceback (most recent call last):
  File "/usr/local/python2.4/lib/python2.4/unittest.py", line 260, in run
    testMethod()
  File "/home/stefan/autotest/temp/python24-zope211-cmf22-plone40/Products/ATContentTypes/tests/test_atimage.py", line 146, in test_bobo_hook
    img = atct.__bobo_traverse__(REQUEST, 'image')
  File "/home/stefan/autotest/temp/python24-zope211-cmf22-plone40/lib/python/Products/Archetypes/BaseObject.py", line 1139, in __bobo_traverse__
    raise AttributeError(name)
AttributeError: image



Failure in test test_typeInfo (Products.ATContentTypes.tests.test_atimage.TestSiteATImage)
Traceback (most recent call last):
  File "/usr/local/python2.4/lib/python2.4/unittest.py", line 260, in run
    testMethod()
  File "/home/stefan/autotest/temp/python24-zope211-cmf22-plone40/Products/ATContentTypes/tests/atcttestcase.py", line 144, in test_typeInfo
    self.failUnlessEqual(ti.getIcon(), self.icon)
  File "/usr/local/python2.4/lib/python2.4/unittest.py", line 333, in failUnlessEqual
    raise self.failureException, \
AssertionError: 'image_icon.png' != 'image_icon.gif'



Failure in test test_typeInfo (Products.ATContentTypes.tests.test_atlink.TestSiteATLink)
Traceback (most recent call last):
  File "/usr/local/python2.4/lib/python2.4/unittest.py", line 260, in run
    testMethod()
  File "/home/stefan/autotest/temp/python24-zope211-cmf22-plone40/Products/ATContentTypes/tests/atcttestcase.py", line 144, in test_typeInfo
    self.failUnlessEqual(ti.getIcon(), self.icon)
  File "/usr/local/python2.4/lib/python2.4/unittest.py", line 333, in failUnlessEqual
    raise self.failureException, \
AssertionError: 'link_icon.png' != 'link_icon.gif'



Failure in test test_typeInfo (Products.ATContentTypes.tests.test_atnewsitem.TestSiteATNewsItem)
Traceback (most recent call last):
  File "/usr/local/python2.4/lib/python2.4/unittest.py", line 260, in run
    testMethod()
  File "/home/stefan/autotest/temp/python24-zope211-cmf22-plone40/Products/ATContentTypes/tests/atcttestcase.py", line 144, in test_typeInfo
    self.failUnlessEqual(ti.getIcon(), self.icon)
  File "/usr/local/python2.4/lib/python2.4/unittest.py", line 333, in failUnlessEqual
    raise self.failureException, \
AssertionError: 'newsitem_icon.png' != 'newsitem_icon.gif'



Failure in test test_typeInfo (Products.ATContentTypes.tests.test_attopic.TestSiteATTopic)
Traceback (most recent call last):
  File "/usr/local/python2.4/lib/python2.4/unittest.py", line 260, in run
    testMethod()
  File "/home/stefan/autotest/temp/python24-zope211-cmf22-plone40/Products/ATContentTypes/tests/atcttestcase.py", line 144, in test_typeInfo
    self.failUnlessEqual(ti.getIcon(), self.icon)
  File "/usr/local/python2.4/lib/python2.4/unittest.py", line 333, in failUnlessEqual
    raise self.failureException, \
AssertionError: 'topic_icon.png' != 'topic_icon.gif'



Failure in test /home/stefan/autotest/temp/python24-zope211-cmf22-plone40/Products/ATContentTypes/tests/events.txt
Failed doctest test for events.txt
  File "/home/stefan/autotest/temp/python24-zope211-cmf22-plone40/Products/ATContentTypes/tests/events.txt", line 0

----------------------------------------------------------------------
File "/home/stefan/autotest/temp/python24-zope211-cmf22-plone40/Products/ATContentTypes/tests/events.txt", line 31, in events.txt
Failed example:
    handler.print_and_flush() #doctest: +ELLIPSIS
Differences (ndiff with -expected +actual):
    - 7 events:
    ? ^
    + 12 events:
    ? ^^
      [(<ATDocument at a>,
    -   <zope.app.event.objectevent.ObjectCreatedEvent object at ...>),
    ?                                                            ^^^
    +   <zope.app.event.objectevent.ObjectCreatedEvent object at 0x42d83aac>),
    ?                                                            ^^^^^^^^^^
    -  (<ATDocument at a>, <OFS.event.ObjectWillBeAddedEvent object at ...>),
    ?                                                                  ^^^
    +  (<ATDocument at a>, <OFS.event.ObjectWillBeAddedEvent object at 0x42d83e2c>),
    ?                                                                  ^^^^^^^^^^
    -  (<ATDocument at /.../Members/test_user_1_/a>,
    ?                   ^^^
    +  (<ATDocument at /plone/Members/test_user_1_/a>,
    ?                   ^^^^^
    +   <Products.DCWorkflow.events.BeforeTransitionEvent object at 0x436ad82c>),
    -   <zope.app.container.contained.ObjectAddedEvent object at ...>),
    -  (<ATFolder at /.../Members/test_user_1_>,
    -   <zope.app.container.contained.ContainerModifiedEvent object at ...>),
    -  (<ATDocument at /.../Members/test_user_1_/a>,
    ?                   ^^^
    +  (<ATDocument at /plone/Members/test_user_1_/a>,
    ?                   ^^^^^
    -   <zope.app.event.objectevent.ObjectModifiedEvent object at ...),
    +   <Products.DCWorkflow.events.AfterTransitionEvent object at 0x436ad36c>),
    -  (<ATDocument at /.../Members/test_user_1_/a>,
    ?                   ^^^
    +  (<ATDocument at /plone/Members/test_user_1_/a>,
    ?                   ^^^^^
    -   <Products.DCWorkflow.events.BeforeTransitionEvent object at ...>),
    +   <zope.app.container.contained.ObjectAddedEvent object at 0x42d8302c>),
    +  (<ATFolder at /plone/Members/test_user_1_>,
    +   <zope.app.container.contained.ContainerModifiedEvent object at 0x4312746c>),
    -  (<ATDocument at /.../Members/test_user_1_/a>,
    ?                   ^^^
    +  (<ATDocument at /plone/Members/test_user_1_/a>,
    ?                   ^^^^^
    +   <zope.app.event.objectevent.ObjectModifiedEvent object at 0x43667d4c>),
    +  (<ATDocument at /plone/Members/test_user_1_/a>,
    +   <zope.app.event.objectevent.ObjectCreatedEvent object at 0x435124ec>),
    +  (<ATDocument at /plone/Members/test_user_1_/a>,
    +   <Products.DCWorkflow.events.BeforeTransitionEvent object at 0x43512ccc>),
    +  (<ATDocument at /plone/Members/test_user_1_/a>,
    -   <Products.DCWorkflow.events.AfterTransitionEvent object at ...>)]
    ?                                                              ^^^  ^
    +   <Products.DCWorkflow.events.AfterTransitionEvent object at 0x43512b2c>),
    ?                                                              ^^^^^^^^^^  ^
    +  (<ATDocument at /plone/Members/test_user_1_/a>,
    +   <zope.app.container.contained.ObjectAddedEvent object at 0x4351282c>),
    +  (<ATFolder at /plone/Members/test_user_1_>,
    +   <zope.app.container.contained.ContainerModifiedEvent object at 0x434cc0cc>)]



Failure in test /home/stefan/autotest/temp/python24-zope211-cmf22-plone40/Products/ATContentTypes/tests/editing.txt
Failed doctest test for editing.txt
  File "/home/stefan/autotest/temp/python24-zope211-cmf22-plone40/Products/ATContentTypes/tests/editing.txt", line 0

----------------------------------------------------------------------
File "/home/stefan/autotest/temp/python24-zope211-cmf22-plone40/Products/ATContentTypes/tests/editing.txt", line 17, in editing.txt
Failed example:
    browser.getControl('Log in').click()
Exception raised:
    Traceback (most recent call last):
      File "/home/stefan/autotest/temp/python24-zope211/lib/python/zope/testing/doctest.py", line 1356, in __run
        compileflags, 1) in test.globs
      File "<doctest editing.txt[6]>", line 1, in ?
        browser.getControl('Log in').click()
      File "/home/stefan/autotest/temp/python24-zope211/lib/python/zope/testbrowser/browser.py", line 591, in click
        self.browser._clickSubmit(self.mech_form, self.mech_control, (1,1))
      File "/home/stefan/autotest/temp/python24-zope211/lib/python/zope/testbrowser/browser.py", line 380, in _clickSubmit
        self.mech_browser.open(form.click(
      File "/home/stefan/autotest/temp/python24-zope211/lib/python/mechanize/_mechanize.py", line 177, in open
        return self._mech_open(url, data)
      File "/home/stefan/autotest/temp/python24-zope211/lib/python/mechanize/_mechanize.py", line 202, in _mech_open
        response = UserAgent.open(self, self.request, data)
      File "/home/stefan/autotest/temp/python24-zope211/lib/python/mechanize/_opener.py", line 235, in open
        response = urlopen(self, req, data)
      File "/usr/local/python2.4/lib/python2.4/urllib2.py", line 376, in _open
        '_open', req)
      File "/usr/local/python2.4/lib/python2.4/urllib2.py", line 337, in _call_chain
        result = func(*args)
      File "/home/stefan/autotest/temp/python24-zope211/lib/python/Products/Five/testbrowser.py", line 79, in http_open
        return self.do_open(PublisherConnection, req)
      File "/usr/local/python2.4/lib/python2.4/urllib2.py", line 993, in do_open
        h.request(req.get_method(), req.get_selector(), req.data, headers)
      File "/home/stefan/autotest/temp/python24-zope211/lib/python/zope/testbrowser/testing.py", line 84, in request
        self.response = self.caller(request_string, handle_errors)
      File "/home/stefan/autotest/temp/python24-zope211/lib/python/Testing/ZopeTestCase/functional.py", line 40, in wrapped_func
        return func(*args, **kw)
      File "/home/stefan/autotest/temp/python24-zope211/lib/python/Testing/ZopeTestCase/zopedoctest/functional.py", line 182, in http
        debug=not handle_errors,
      File "/home/stefan/autotest/temp/python24-zope211/lib/python/ZPublisher/Test.py", line 199, in publish_module
        response = publish(request, module_name, after_list, debug=debug)
      File "/home/stefan/autotest/temp/python24-zope211/lib/python/ZPublisher/Publish.py", line 150, in publish
        sys.exc_info()[2],
      File "/home/stefan/autotest/temp/python24-zope211/lib/python/Zope2/App/startup.py", line 252, in __call__
        f(client, REQUEST, t, v, traceback, error_log_url=error_log_url)
      File "/home/stefan/autotest/temp/python24-zope211/lib/python/ZPublisher/Publish.py", line 119, in publish
        request, bind=1)
      File "/home/stefan/autotest/temp/python24-zope211/lib/python/ZPublisher/mapply.py", line 88, in mapply
        if debug is not None: return debug(object,args,context)
      File "/home/stefan/autotest/temp/python24-zope211/lib/python/ZPublisher/Publish.py", line 42, in call_object
        result=apply(object,args) # Type s<cr> to step into published object.
      File "/home/stefan/autotest/temp/python24-zope211-cmf22-plone40/lib/python/Products/CMFFormController/FSControllerPageTemplate.py", line 90, in __call__
        return self._call(FSControllerPageTemplate.inheritedAttribute('__call__'), *args, **kwargs)
      File "/home/stefan/autotest/temp/python24-zope211-cmf22-plone40/lib/python/Products/CMFFormController/BaseControllerPageTemplate.py", line 28, in _call
        return self.getNext(controller_state, REQUEST)
      File "/home/stefan/autotest/temp/python24-zope211-cmf22-plone40/lib/python/Products/CMFFormController/ControllerBase.py", line 231, in getNext
        return next_action.getAction()(controller_state)
      File "/home/stefan/autotest/temp/python24-zope211-cmf22-plone40/lib/python/Products/CMFFormController/Actions/TraverseTo.py", line 38, in __call__
        REQUEST, bind=1)
      File "/home/stefan/autotest/temp/python24-zope211/lib/python/ZPublisher/mapply.py", line 88, in mapply
        if debug is not None: return debug(object,args,context)
      File "/home/stefan/autotest/temp/python24-zope211/lib/python/ZPublisher/Publish.py", line 42, in call_object
        result=apply(object,args) # Type s<cr> to step into published object.
      File "/home/stefan/autotest/temp/python24-zope211-cmf22-plone40/lib/python/Products/CMFFormController/FSControllerPythonScript.py", line 104, in __call__
        result = FSControllerPythonScript.inheritedAttribute('__call__')(self, *args, **kwargs)
      File "/home/stefan/autotest/temp/python24-zope211-cmf22-plone40/lib/python/Products/CMFFormController/Script.py", line 145, in __call__
        return BaseFSPythonScript.__call__(self, *args, **kw)
      File "/home/stefan/autotest/temp/python24-zope211-cmf22-plone40/lib/python/Products/CMFCore/FSPythonScript.py", line 140, in __call__
        return Script.__call__(self, *args, **kw)
      File "/home/stefan/autotest/temp/python24-zope211/lib/python/Shared/DC/Scripts/Bindings.py", line 313, in __call__
        return self._bindAndExec(args, kw, None)
      File "/home/stefan/autotest/temp/python24-zope211/lib/python/Shared/DC/Scripts/Bindings.py", line 350, in _bindAndExec
        return self._exec(bound_data, args, kw)
      File "/home/stefan/autotest/temp/python24-zope211-cmf22-plone40/lib/python/Products/CMFCore/FSPythonScript.py", line 196, in _exec
        result = f(*args, **kw)
      File "Script (Python)", line 24, in logged_in
      File "/home/stefan/autotest/temp/python24-zope211-cmf22-plone40/lib/python/Products/CMFPlone/MembershipTool.py", line 310, in loginUser
        pas.credentials_cookie_auth.login()
      File "/home/stefan/autotest/temp/python24-zope211-cmf22-plone40/lib/python/Products/PlonePAS/plugins/cookie_handler.py", line 87, in login
        user_pas.updateCredentials(request, response, login, password)
      File "/home/stefan/autotest/temp/python24-zope211-cmf22-plone40/lib/python/Products/PluggableAuthService/PluggableAuthService.py", line 1098, in updateCredentials
        updater.updateCredentials(request, response, login, new_password)
      File "/home/stefan/autotest/temp/python24-zope211-cmf22-plone40/lib/python/plone/session/plugins/session.py", line 133, in updateCredentials
        self.setupSession(info["id"], response)
      File "/home/stefan/autotest/temp/python24-zope211-cmf22-plone40/lib/python/plone/session/plugins/session.py", line 85, in setupSession
        cookie=self.source.createIdentifier(userid)
      File "/home/stefan/autotest/temp/python24-zope211-cmf22-plone40/lib/python/plone/session/sources/hash.py", line 41, in createIdentifier
        signature=self.signUserid(userid)
      File "/home/stefan/autotest/temp/python24-zope211-cmf22-plone40/lib/python/plone/session/sources/hash.py", line 35, in signUserid
        secret = self.getSigningSecret()
      File "/home/stefan/autotest/temp/python24-zope211-cmf22-plone40/lib/python/plone/session/sources/hash.py", line 30, in getSigningSecret
        return self.getSecrets()[0]
      File "/home/stefan/autotest/temp/python24-zope211-cmf22-plone40/lib/python/plone/session/sources/hash.py", line 25, in getSecrets
        raise NoKeyManager
    NoKeyManager: <!DOCTYPE html PUBLIC "-//W3C//DTD XHTML 1.0 Transitional//EN" "http://www.w3.org/TR/xhtml1/DTD/xhtml1-transitional.dtd">



    <html xmlns="http://www.w3.org/1999/xhtml" xml:lang="en" lang="en">

      
        
        
        
        
        

      

      <head>

        <meta http-equiv="Content-Type" content="text/html;charset=utf-8" />

        
          <base href="http://nohost/plone/" /><!--[if lt IE 7]></base><![endif]-->
        

        <meta name="generator" content="Plone - http://plone.org" />

        <link rel="kss-base-url" href="http://nohost/plone/" />

      
      
        
          <script type="text/javascript" src="http://nohost/plone/portal_javascripts/Plone%20Default/jquery-cachekey6202.js">
          </script>
        
        
      

      
        
          <script type="text/javascript" src="http://nohost/plone/portal_javascripts/Plone%20Default/dropdown-cachekey0928.js">
          </script>
        
        
      

      
        
          <script type="text/javascript" src="http://nohost/plone/portal_javascripts/Plone%20Default/resourcekukit-cachekey5990.js">
          </script>
        
        
      

      
      
        
        
          <style type="text/css" media="screen"><!-- @import url(http://nohost/plone/portal_css/Plone%20Default/member-cachekey4658.css); --></style>
        
        
      

      
        
        
          <style type="text/css"><!-- @import url(http://nohost/plone/portal_css/Plone%20Default/base-cachekey4182.css); --></style>
        
        
      

      
      <link rel="kinetic-stylesheet" type="text/css" href="http://nohost/plone/portal_kss/Plone%20Default/at-cachekey5190.kss" />


    <title>Plone site</title>


        <!-- Internet Explorer CSS Fixes -->
        <!--[if IE]>
            <style type="text/css" media="all">@import url(http://nohost/plone/IEFixes.css);</style>
        <![endif]-->

        
        <link rel="author" href="http://nohost/plone/author/" title="Author information" />



        <link rel="shortcut icon" type="image/x-icon" href="http://nohost/plone/favicon.ico" />



        <link rel="home" href="http://nohost/plone" title="Front page" />

        <link rel="contents" href="http://nohost/plone/sitemap" title="Site Map" />






        <link rel="search" href="http://nohost/plone/search_form" title="Search this site" />



        <!-- Disable IE6 image toolbar -->
        <meta http-equiv="imagetoolbar" content="no" />
        
        
        

        
        

        
        

        
        

      </head>

      <body class="None template-default_error_message" dir="ltr">
        <div id="visual-portal-wrapper">

          <div id="portal-top">
            <div id="portal-header">
    <p class="hiddenStructure">
      <a accesskey="2" href="http://nohost/plone/login_form#documentContent">Skip to content.</a> |

      <a accesskey="6" href="http://nohost/plone/login_form#portlet-navigation-tree">Skip to navigation</a>
    </p>

    <ul id="portal-siteactions">

        <li id="siteaction-sitemap"><a href="http://nohost/plone/sitemap" accesskey="3" title="Site Map">Site Map</a></li>
        <li id="siteaction-accessibility"><a href="http://nohost/plone/accessibility-info" accesskey="0" title="Accessibility">Accessibility</a></li>
        <li id="siteaction-contact"><a href="http://nohost/plone/contact-info" accesskey="9" title="Contact">Contact</a></li>

    </ul>

    <div id="portal-searchbox">
        <form name="searchform" action="http://nohost/plone/search">

            <label for="searchGadget" class="hiddenStructure">Search Site</label>

            <div class="LSBox">
            <input name="SearchableText" type="text" size="18" title="Search Site" accesskey="4" class="inputLabel" id="searchGadget" />

            <input class="searchButton" type="submit" value="Search" />
        
            <div class="searchSection">
                <input id="searchbox_currentfolder_only" class="noborder" type="checkbox" name="path" value="/plone" />
                <label for="searchbox_currentfolder_only" style="cursor: pointer">
                    only in current section
                </label>
            </div>

            <div class="LSResult" id="LSResult" style=""><div class="LSShadow" id="LSShadow"></div></div>
            </div>
        </form>

        <div id="portal-advanced-search" class="hiddenStructure">
            <a href="http://nohost/plone/search_form" accesskey="5">
                Advanced Search&hellip;
            </a>
        </div>

    </div>

    <a id="portal-logo" accesskey="1" href="http://nohost/plone">
        <img src="http://nohost/plone/logo.jpg" alt="" title="Plone" height="57" width="252" /></a>


        <h5 class="hiddenStructure">Sections</h5>

        <ul id="portal-globalnav">
            <li id="portaltab-index_html" class="selected">
                <a href="http://nohost/plone" title="">Home</a></li>
            <li id="portaltab-Members" class="plain">
                <a href="http://nohost/plone/Members" title="Container for users' home directories">Users</a></li>
            <li id="portaltab-news" class="plain">
                <a href="http://nohost/plone/news" title="Site News">News</a></li>
            <li id="portaltab-events" class="plain">
                <a href="http://nohost/plone/events" title="Site Events">Events</a></li>
        </ul>

    </div>

    <div id="portal-personaltools-wrapper">

    <h5 class="hiddenStructure">Personal tools</h5>

    <ul id="portal-personaltools" class="visualInline">
       
           <li><a id="user-name" href="http://nohost/plone/dashboard"><img src="http://nohost/plone/user.gif" alt="" title="User" height="16" width="16" />
                <span class="visualCaseSensitive">test_user_1_</span></a></li>
       

        
            <li>
                <a href="http://nohost/plone/Members/test_user_1_">My Folder</a>
            </li>
        
        
            <li>
                <a href="http://nohost/plone/logout">Log out</a>
            </li>
        

    </ul>
    </div>


        


    <div id="portal-breadcrumbs">

        <span id="breadcrumbs-you-are-here">You
    are here:</span>
        <a href="http://nohost/plone">Home</a>
        

    </div>

          </div>

          <div class="visualClear" id="clear-space-before-wrapper-table"><!-- --></div>

          <table id="portal-columns">
            <tbody>
              <tr>
                
                
                

                
                <td id="portal-column-content">

                  
                    <div class="">

                      


                      <div id="region-content" class="documentContent">

                        <span id="contentTopLeft"></span>
                        <span id="contentTopRight"></span>
                        
                        <a name="documentContent"></a>

                        

        <dl class="portalMessage info" id="kssPortalMessage" style="display:none">
            <dt>Info</dt>
            <dd></dd>
        </dl>


                        
                        <div id="viewlet-above-content"></div>

                        
                        
                        
                          
                          <div>

            

            <div>

                <h1 class="documentFirstHeading">
                    We're sorry, but there seems to be an error&hellip;
                </h1>

                
                    <p>
                    The error has been logged as entry number 
                    <code>1209704320.960.256207898084</code>.
                    </p>
                    
                    <p>
                    If you need to report this to the 
                    <span> <a href="http://nohost/plone/contact-info">site administration</a></span>,
                    please include this entry number in your message.
                    </p>
                
                    

                

                

            </div>
            

    </div>
                        
                        

                        
                        
                          

                        
                        

                        <span id="contentBottomLeft"></span>
                        <span id="contentBottomRight"></span>

                      </div>

                    </div>

                  
                </td>
                

                
                
                
              </tr>
            </tbody>
          </table>
          

          <div class="visualClear" id="clear-space-before-footer"><!-- --></div>
          
          

          

            <div id="portal-footer">

    <p>
        
        The
        <a href="http://plone.org">Plone<sup>&reg;</sup> CMS &mdash; Open Source Content Management System</a>
        is
        <acronym title="Copyright">&copy;</acronym>
        2000-2008
        by the
        <a href="http://plone.org/foundation">Plone Foundation</a>
        et al.
        
    </p>

    <p>
        
        Plone<sup>&reg;</sup> and the Plone logo are registered trademarks of the
            <a href="http://plone.org/foundation">Plone Foundation</a>.
        

        
        Distributed under the
            <a href="http://creativecommons.org/licenses/GPL/2.0/">GNU GPL license</a>.
        
    </p>

    </div>

      <div id="portal-colophon">
          

          

          <div class="colophonWrapper">
          <ul>
            <li>
              <a href="http://plone.org" title="This site was built using Plone CMS, the Open Source Content Management System. Click for more information.">
                Powered by Plone</a>
            </li>
            <li>
              <a href="http://validator.w3.org/check/referer" title="This site is valid XHTML.">
                Valid XHTML</a>
            </li>
            <li>
              <a href="http://jigsaw.w3.org/css-validator/check/referer&amp;warning=no&amp;profile=css3&amp;usermedium=all" title="This site was built with valid CSS.">
                Valid CSS</a>
            </li>
            <li>
              <a href="http://www.section508.gov" title="This site conforms to the US Government Section 508 Accessibility Guidelines.">
                Section 508</a>
            </li>
            <li>
              <a href="http://www.w3.org/WAI/WCAG1AA-Conformance" title="This site conforms to the W3C-WAI Web Content Accessibility Guidelines.">
                WCAG</a>
            </li>
          </ul>
          </div>

        </div>



          

          <div class="visualClear"><!-- --></div>
        </div>
    <div id="kss-spinner"><img alt="" src="http://nohost/plone/spinner.png" /></div>
    </body>
    </html>


----------------------------------------------------------------------
File "/home/stefan/autotest/temp/python24-zope211-cmf22-plone40/Products/ATContentTypes/tests/editing.txt", line 35, in editing.txt
Failed example:
    browser.open(url+'/edit')
Exception raised:
    Traceback (most recent call last):
      File "/home/stefan/autotest/temp/python24-zope211/lib/python/zope/testing/doctest.py", line 1356, in __run
        compileflags, 1) in test.globs
      File "<doctest editing.txt[12]>", line 1, in ?
        browser.open(url+'/edit')
      File "/home/stefan/autotest/temp/python24-zope211/lib/python/zope/testbrowser/browser.py", line 224, in open
        self.mech_browser.open(url, data)
      File "/home/stefan/autotest/temp/python24-zope211/lib/python/mechanize/_mechanize.py", line 177, in open
        return self._mech_open(url, data)
      File "/home/stefan/autotest/temp/python24-zope211/lib/python/mechanize/_mechanize.py", line 202, in _mech_open
        response = UserAgent.open(self, self.request, data)
      File "/home/stefan/autotest/temp/python24-zope211/lib/python/mechanize/_opener.py", line 235, in open
        response = urlopen(self, req, data)
      File "/usr/local/python2.4/lib/python2.4/urllib2.py", line 376, in _open
        '_open', req)
      File "/usr/local/python2.4/lib/python2.4/urllib2.py", line 337, in _call_chain
        result = func(*args)
      File "/home/stefan/autotest/temp/python24-zope211/lib/python/Products/Five/testbrowser.py", line 79, in http_open
        return self.do_open(PublisherConnection, req)
      File "/usr/local/python2.4/lib/python2.4/urllib2.py", line 993, in do_open
        h.request(req.get_method(), req.get_selector(), req.data, headers)
      File "/home/stefan/autotest/temp/python24-zope211/lib/python/zope/testbrowser/testing.py", line 84, in request
        self.response = self.caller(request_string, handle_errors)
      File "/home/stefan/autotest/temp/python24-zope211/lib/python/Testing/ZopeTestCase/functional.py", line 40, in wrapped_func
        return func(*args, **kw)
      File "/home/stefan/autotest/temp/python24-zope211/lib/python/Testing/ZopeTestCase/zopedoctest/functional.py", line 182, in http
        debug=not handle_errors,
      File "/home/stefan/autotest/temp/python24-zope211/lib/python/ZPublisher/Test.py", line 199, in publish_module
        response = publish(request, module_name, after_list, debug=debug)
      File "/home/stefan/autotest/temp/python24-zope211/lib/python/ZPublisher/Publish.py", line 150, in publish
        sys.exc_info()[2],
      File "/home/stefan/autotest/temp/python24-zope211/lib/python/Zope2/App/startup.py", line 252, in __call__
        f(client, REQUEST, t, v, traceback, error_log_url=error_log_url)
      File "/home/stefan/autotest/temp/python24-zope211/lib/python/ZPublisher/Publish.py", line 119, in publish
        request, bind=1)
      File "/home/stefan/autotest/temp/python24-zope211/lib/python/ZPublisher/mapply.py", line 88, in mapply
        if debug is not None: return debug(object,args,context)
      File "/home/stefan/autotest/temp/python24-zope211/lib/python/ZPublisher/Publish.py", line 42, in call_object
        result=apply(object,args) # Type s<cr> to step into published object.
      File "/home/stefan/autotest/temp/python24-zope211-cmf22-plone40/lib/python/Products/CMFFormController/FSControllerPageTemplate.py", line 90, in __call__
        return self._call(FSControllerPageTemplate.inheritedAttribute('__call__'), *args, **kwargs)
      File "/home/stefan/autotest/temp/python24-zope211-cmf22-plone40/lib/python/Products/CMFFormController/BaseControllerPageTemplate.py", line 31, in _call
        return inherited_call(self, *args, **kwargs)
      File "/home/stefan/autotest/temp/python24-zope211/lib/python/Shared/DC/Scripts/Bindings.py", line 313, in __call__
        return self._bindAndExec(args, kw, None)
      File "/home/stefan/autotest/temp/python24-zope211/lib/python/Shared/DC/Scripts/Bindings.py", line 350, in _bindAndExec
        return self._exec(bound_data, args, kw)
      File "/home/stefan/autotest/temp/python24-zope211-cmf22-plone40/lib/python/Products/CMFCore/FSPageTemplate.py", line 216, in _exec
        result = self.pt_render(extra_context=bound_names)
      File "/home/stefan/autotest/temp/python24-zope211-cmf22-plone40/lib/python/Products/CMFCore/FSPageTemplate.py", line 155, in pt_render
        result = FSPageTemplate.inheritedAttribute('pt_render')(
      File "/home/stefan/autotest/temp/python24-zope211/lib/python/Products/PageTemplates/PageTemplate.py", line 89, in pt_render
        return super(PageTemplate, self).pt_render(c, source=source)
      File "/home/stefan/autotest/temp/python24-zope211/lib/python/zope/pagetemplate/pagetemplate.py", line 115, in pt_render
        strictinsert=0, sourceAnnotations=sourceAnnotations)()
      File "/home/stefan/autotest/temp/python24-zope211/lib/python/zope/tal/talinterpreter.py", line 271, in __call__
        self.interpret(self.program)
      File "/home/stefan/autotest/temp/python24-zope211/lib/python/zope/tal/talinterpreter.py", line 346, in interpret
        handlers[opcode](self, args)
      File "/home/stefan/autotest/temp/python24-zope211/lib/python/zope/tal/talinterpreter.py", line 891, in do_useMacro
        self.interpret(macro)
      File "/home/stefan/autotest/temp/python24-zope211/lib/python/zope/tal/talinterpreter.py", line 346, in interpret
        handlers[opcode](self, args)
      File "/home/stefan/autotest/temp/python24-zope211/lib/python/zope/tal/talinterpreter.py", line 586, in do_setLocal_tal
        self.engine.setLocal(name, self.engine.evaluateValue(expr))
      File "/home/stefan/autotest/temp/python24-zope211/lib/python/zope/tales/tales.py", line 696, in evaluate
        return expression(self)
      File "/home/stefan/autotest/temp/python24-zope211/lib/python/zope/tales/expressions.py", line 217, in __call__
        return self._eval(econtext)
      File "/home/stefan/autotest/temp/python24-zope211/lib/python/Products/PageTemplates/Expressions.py", line 131, in _eval
        ob = self._subexprs[-1](econtext)
      File "/home/stefan/autotest/temp/python24-zope211/lib/python/zope/tales/expressions.py", line 124, in _eval
        ob = self._traverser(ob, element, econtext)
      File "/home/stefan/autotest/temp/python24-zope211/lib/python/Products/PageTemplates/Expressions.py", line 80, in boboAwareZopeTraverse
        object = object.restrictedTraverse(name)
      File "/home/stefan/autotest/temp/python24-zope211/lib/python/OFS/Traversable.py", line 301, in restrictedTraverse
        return self.unrestrictedTraverse(path, default, restricted=True)
      File "/home/stefan/autotest/temp/python24-zope211/lib/python/OFS/Traversable.py", line 195, in unrestrictedTraverse
        if restricted and not validate(
    Unauthorized: <!DOCTYPE html PUBLIC "-//W3C//DTD XHTML 1.0 Transitional//EN" "http://www.w3.org/TR/xhtml1/DTD/xhtml1-transitional.dtd">



    <html xmlns="http://www.w3.org/1999/xhtml" xml:lang="en" lang="en">

      
        
        
        
        
        

      

      <head>

        <meta http-equiv="Content-Type" content="text/html;charset=utf-8" />

        
          <base href="http://nohost/plone/Members/test_user_1_/document" /><!--[if lt IE 7]></base><![endif]-->
        

        <meta name="generator" content="Plone - http://plone.org" />

        <link rel="kss-base-url" href="http://nohost/plone/Members/test_user_1_/document/" />

      
      
        
          <script type="text/javascript" src="http://nohost/plone/portal_javascripts/Plone%20Default/jquery-cachekey6202.js">
          </script>
        
        
      

      
      
        
        
          <style type="text/css"><!-- @import url(http://nohost/plone/portal_css/Plone%20Default/base-cachekey4182.css); --></style>
        
        
      

      
      <link rel="kinetic-stylesheet" type="text/css" href="http://nohost/plone/portal_kss/Plone%20Default/at-cachekey5190.kss" />


    <title>Test document &mdash; Plone site</title>


        <!-- Internet Explorer CSS Fixes -->
        <!--[if IE]>
            <style type="text/css" media="all">@import url(http://nohost/plone/IEFixes.css);</style>
        <![endif]-->

        
        <link rel="author" href="http://nohost/plone/author/test_user_1_" title="Author information" />



        <link rel="shortcut icon" type="image/x-icon" href="http://nohost/plone/favicon.ico" />



        <link rel="home" href="http://nohost/plone" title="Front page" />

        <link rel="contents" href="http://nohost/plone/sitemap" title="Site Map" />






        <link rel="search" href="http://nohost/plone/search_form" title="Search this site" />



        <!-- Disable IE6 image toolbar -->
        <meta http-equiv="imagetoolbar" content="no" />
        
        
        

        
        

        
        

        
        

      </head>

      <body class="section-Members template-default_error_message" dir="ltr">
        <div id="visual-portal-wrapper">

          <div id="portal-top">
            <div id="portal-header">
    <p class="hiddenStructure">
      <a accesskey="2" href="http://nohost/plone/Members/test_user_1_/document/edit#documentContent">Skip to content.</a> |

      <a accesskey="6" href="http://nohost/plone/Members/test_user_1_/document/edit#portlet-navigation-tree">Skip to navigation</a>
    </p>

    <ul id="portal-siteactions">

        <li id="siteaction-sitemap"><a href="http://nohost/plone/sitemap" accesskey="3" title="Site Map">Site Map</a></li>
        <li id="siteaction-accessibility"><a href="http://nohost/plone/accessibility-info" accesskey="0" title="Accessibility">Accessibility</a></li>
        <li id="siteaction-contact"><a href="http://nohost/plone/contact-info" accesskey="9" title="Contact">Contact</a></li>

    </ul>

    <div id="portal-searchbox">
        <form name="searchform" action="http://nohost/plone/search">

            <label for="searchGadget" class="hiddenStructure">Search Site</label>

            <div class="LSBox">
            <input name="SearchableText" type="text" size="18" title="Search Site" accesskey="4" class="inputLabel" id="searchGadget" />

            <input class="searchButton" type="submit" value="Search" />
        
            <div class="searchSection">
                <input id="searchbox_currentfolder_only" class="noborder" type="checkbox" name="path" value="/plone/Members/test_user_1_" />
                <label for="searchbox_currentfolder_only" style="cursor: pointer">
                    only in current section
                </label>
            </div>

            <div class="LSResult" id="LSResult" style=""><div class="LSShadow" id="LSShadow"></div></div>
            </div>
        </form>

        <div id="portal-advanced-search" class="hiddenStructure">
            <a href="http://nohost/plone/search_form" accesskey="5">
                Advanced Search&hellip;
            </a>
        </div>

    </div>

    <a id="portal-logo" accesskey="1" href="http://nohost/plone">
        <img src="http://nohost/plone/logo.jpg" alt="" title="Plone" height="57" width="252" /></a>


        <h5 class="hiddenStructure">Sections</h5>

        <ul id="portal-globalnav">
            <li id="portaltab-index_html" class="plain">
                <a href="http://nohost/plone" title="">Home</a></li>
            <li id="portaltab-Members" class="selected">
                <a href="http://nohost/plone/Members" title="Container for users' home directories">Users</a></li>
            <li id="portaltab-news" class="plain">
                <a href="http://nohost/plone/news" title="Site News">News</a></li>
            <li id="portaltab-events" class="plain">
                <a href="http://nohost/plone/events" title="Site Events">Events</a></li>
        </ul>

    </div>

    <div id="portal-personaltools-wrapper">

    <h5 class="hiddenStructure">Personal tools</h5>

    <ul id="portal-personaltools" class="visualInline">
       

        
            <li>
                <a href="http://nohost/plone/login_form">Log in</a>
            </li>
        

    </ul>
    </div>


        


    <div id="portal-breadcrumbs">

        <span id="breadcrumbs-you-are-here">You
    are here:</span>
        <a href="http://nohost/plone">Home</a>
        <span class="breadcrumbSeparator">
            &rarr;
            
        </span>
        <span dir="ltr">
            
                <a href="http://nohost/plone/Members">Users</a>
                <span class="breadcrumbSeparator">
                    &rarr;
                    
                </span>
                
             
        </span>
        <span dir="ltr">
            
                <a href="http://nohost/plone/Members/test_user_1_">test_user_1_</a>
                <span class="breadcrumbSeparator">
                    &rarr;
                    
                </span>
                
             
        </span>
        <span dir="ltr">
            
                
                
                <span>Test document</span>
             
        </span>

    </div>

          </div>

          <div class="visualClear" id="clear-space-before-wrapper-table"><!-- --></div>

          <table id="portal-columns">
            <tbody>
              <tr>
                
                
                

                
                <td id="portal-column-content">

                  
                    <div class="">

                      


                      <div id="region-content" class="documentContent">

                        <span id="contentTopLeft"></span>
                        <span id="contentTopRight"></span>
                        
                        <a name="documentContent"></a>

                        

        <dl class="portalMessage info" id="kssPortalMessage" style="display:none">
            <dt>Info</dt>
            <dd></dd>
        </dl>


                        
                        <div id="viewlet-above-content"></div>

                        
                        
                        
                          
                          <div>

            

            <div>

                <h1 class="documentFirstHeading">
                    We're sorry, but there seems to be an error&hellip;
                </h1>

                

                
                    <p>
                    If you are certain you have the correct web address but are encountering an error, please
                    contact the <span> <a href="http://nohost/plone/contact-info">site administration</a></span>.
                    </p>
                

            </div>
            

    </div>
                        
                        

                        
                        
                          

                        
                        

                        <span id="contentBottomLeft"></span>
                        <span id="contentBottomRight"></span>

                      </div>

                    </div>

                  
                </td>
                

                
                
                
              </tr>
            </tbody>
          </table>
          

          <div class="visualClear" id="clear-space-before-footer"><!-- --></div>
          
          

          

            <div id="portal-footer">

    <p>
        
        The
        <a href="http://plone.org">Plone<sup>&reg;</sup> CMS &mdash; Open Source Content Management System</a>
        is
        <acronym title="Copyright">&copy;</acronym>
        2000-2008
        by the
        <a href="http://plone.org/foundation">Plone Foundation</a>
        et al.
        
    </p>

    <p>
        
        Plone<sup>&reg;</sup> and the Plone logo are registered trademarks of the
            <a href="http://plone.org/foundation">Plone Foundation</a>.
        

        
        Distributed under the
            <a href="http://creativecommons.org/licenses/GPL/2.0/">GNU GPL license</a>.
        
    </p>

    </div>

      <div id="portal-colophon">
          

          

          <div class="colophonWrapper">
          <ul>
            <li>
              <a href="http://plone.org" title="This site was built using Plone CMS, the Open Source Content Management System. Click for more information.">
                Powered by Plone</a>
            </li>
            <li>
              <a href="http://validator.w3.org/check/referer" title="This site is valid XHTML.">
                Valid XHTML</a>
            </li>
            <li>
              <a href="http://jigsaw.w3.org/css-validator/check/referer&amp;warning=no&amp;profile=css3&amp;usermedium=all" title="This site was built with valid CSS.">
                Valid CSS</a>
            </li>
            <li>
              <a href="http://www.section508.gov" title="This site conforms to the US Government Section 508 Accessibility Guidelines.">
                Section 508</a>
            </li>
            <li>
              <a href="http://www.w3.org/WAI/WCAG1AA-Conformance" title="This site conforms to the W3C-WAI Web Content Accessibility Guidelines.">
                WCAG</a>
            </li>
          </ul>
          </div>

        </div>



          

          <div class="visualClear"><!-- --></div>
        </div>
    <div id="kss-spinner"><img alt="" src="http://nohost/plone/spinner.png" /></div>
    </body>
    </html>


----------------------------------------------------------------------
File "/home/stefan/autotest/temp/python24-zope211-cmf22-plone40/Products/ATContentTypes/tests/editing.txt", line 36, in editing.txt
Failed example:
    browser.getControl('Title').value = ''
Exception raised:
    Traceback (most recent call last):
      File "/home/stefan/autotest/temp/python24-zope211/lib/python/zope/testing/doctest.py", line 1356, in __run
        compileflags, 1) in test.globs
      File "<doctest editing.txt[13]>", line 1, in ?
        browser.getControl('Title').value = ''
      File "/home/stefan/autotest/temp/python24-zope211/lib/python/zope/testbrowser/browser.py", line 335, in getControl
        intermediate, msg = self._get_all_controls(
      File "/home/stefan/autotest/temp/python24-zope211/lib/python/mechanize/_mechanize.py", line 307, in forms
        if not self.viewing_html():
      File "/home/stefan/autotest/temp/python24-zope211/lib/python/mechanize/_mechanize.py", line 314, in viewing_html
        raise BrowserStateError("not viewing any document")
    BrowserStateError: not viewing any document
----------------------------------------------------------------------
File "/home/stefan/autotest/temp/python24-zope211-cmf22-plone40/Products/ATContentTypes/tests/editing.txt", line 37, in editing.txt
Failed example:
    browser.getControl('Save').click()
Exception raised:
    Traceback (most recent call last):
      File "/home/stefan/autotest/temp/python24-zope211/lib/python/zope/testing/doctest.py", line 1356, in __run
        compileflags, 1) in test.globs
      File "<doctest editing.txt[14]>", line 1, in ?
        browser.getControl('Save').click()
      File "/home/stefan/autotest/temp/python24-zope211/lib/python/zope/testbrowser/browser.py", line 335, in getControl
        intermediate, msg = self._get_all_controls(
      File "/home/stefan/autotest/temp/python24-zope211/lib/python/mechanize/_mechanize.py", line 307, in forms
        if not self.viewing_html():
      File "/home/stefan/autotest/temp/python24-zope211/lib/python/mechanize/_mechanize.py", line 314, in viewing_html
        raise BrowserStateError("not viewing any document")
    BrowserStateError: not viewing any document
----------------------------------------------------------------------
File "/home/stefan/autotest/temp/python24-zope211-cmf22-plone40/Products/ATContentTypes/tests/editing.txt", line 54, in editing.txt
Failed example:
    browser.open(url+'/edit')
Exception raised:
    Traceback (most recent call last):
      File "/home/stefan/autotest/temp/python24-zope211/lib/python/zope/testing/doctest.py", line 1356, in __run
        compileflags, 1) in test.globs
      File "<doctest editing.txt[20]>", line 1, in ?
        browser.open(url+'/edit')
      File "/home/stefan/autotest/temp/python24-zope211/lib/python/zope/testbrowser/browser.py", line 224, in open
        self.mech_browser.open(url, data)
      File "/home/stefan/autotest/temp/python24-zope211/lib/python/mechanize/_mechanize.py", line 177, in open
        return self._mech_open(url, data)
      File "/home/stefan/autotest/temp/python24-zope211/lib/python/mechanize/_mechanize.py", line 202, in _mech_open
        response = UserAgent.open(self, self.request, data)
      File "/home/stefan/autotest/temp/python24-zope211/lib/python/mechanize/_opener.py", line 235, in open
        response = urlopen(self, req, data)
      File "/usr/local/python2.4/lib/python2.4/urllib2.py", line 376, in _open
        '_open', req)
      File "/usr/local/python2.4/lib/python2.4/urllib2.py", line 337, in _call_chain
        result = func(*args)
      File "/home/stefan/autotest/temp/python24-zope211/lib/python/Products/Five/testbrowser.py", line 79, in http_open
        return self.do_open(PublisherConnection, req)
      File "/usr/local/python2.4/lib/python2.4/urllib2.py", line 993, in do_open
        h.request(req.get_method(), req.get_selector(), req.data, headers)
      File "/home/stefan/autotest/temp/python24-zope211/lib/python/zope/testbrowser/testing.py", line 84, in request
        self.response = self.caller(request_string, handle_errors)
      File "/home/stefan/autotest/temp/python24-zope211/lib/python/Testing/ZopeTestCase/functional.py", line 40, in wrapped_func
        return func(*args, **kw)
      File "/home/stefan/autotest/temp/python24-zope211/lib/python/Testing/ZopeTestCase/zopedoctest/functional.py", line 182, in http
        debug=not handle_errors,
      File "/home/stefan/autotest/temp/python24-zope211/lib/python/ZPublisher/Test.py", line 199, in publish_module
        response = publish(request, module_name, after_list, debug=debug)
      File "/home/stefan/autotest/temp/python24-zope211/lib/python/ZPublisher/Publish.py", line 150, in publish
        sys.exc_info()[2],
      File "/home/stefan/autotest/temp/python24-zope211/lib/python/Zope2/App/startup.py", line 252, in __call__
        f(client, REQUEST, t, v, traceback, error_log_url=error_log_url)
      File "/home/stefan/autotest/temp/python24-zope211/lib/python/ZPublisher/Publish.py", line 119, in publish
        request, bind=1)
      File "/home/stefan/autotest/temp/python24-zope211/lib/python/ZPublisher/mapply.py", line 88, in mapply
        if debug is not None: return debug(object,args,context)
      File "/home/stefan/autotest/temp/python24-zope211/lib/python/ZPublisher/Publish.py", line 42, in call_object
        result=apply(object,args) # Type s<cr> to step into published object.
      File "/home/stefan/autotest/temp/python24-zope211-cmf22-plone40/lib/python/Products/CMFFormController/FSControllerPageTemplate.py", line 90, in __call__
        return self._call(FSControllerPageTemplate.inheritedAttribute('__call__'), *args, **kwargs)
      File "/home/stefan/autotest/temp/python24-zope211-cmf22-plone40/lib/python/Products/CMFFormController/BaseControllerPageTemplate.py", line 31, in _call
        return inherited_call(self, *args, **kwargs)
      File "/home/stefan/autotest/temp/python24-zope211/lib/python/Shared/DC/Scripts/Bindings.py", line 313, in __call__
        return self._bindAndExec(args, kw, None)
      File "/home/stefan/autotest/temp/python24-zope211/lib/python/Shared/DC/Scripts/Bindings.py", line 350, in _bindAndExec
        return self._exec(bound_data, args, kw)
      File "/home/stefan/autotest/temp/python24-zope211-cmf22-plone40/lib/python/Products/CMFCore/FSPageTemplate.py", line 216, in _exec
        result = self.pt_render(extra_context=bound_names)
      File "/home/stefan/autotest/temp/python24-zope211-cmf22-plone40/lib/python/Products/CMFCore/FSPageTemplate.py", line 155, in pt_render
        result = FSPageTemplate.inheritedAttribute('pt_render')(
      File "/home/stefan/autotest/temp/python24-zope211/lib/python/Products/PageTemplates/PageTemplate.py", line 89, in pt_render
        return super(PageTemplate, self).pt_render(c, source=source)
      File "/home/stefan/autotest/temp/python24-zope211/lib/python/zope/pagetemplate/pagetemplate.py", line 115, in pt_render
        strictinsert=0, sourceAnnotations=sourceAnnotations)()
      File "/home/stefan/autotest/temp/python24-zope211/lib/python/zope/tal/talinterpreter.py", line 271, in __call__
        self.interpret(self.program)
      File "/home/stefan/autotest/temp/python24-zope211/lib/python/zope/tal/talinterpreter.py", line 346, in interpret
        handlers[opcode](self, args)
      File "/home/stefan/autotest/temp/python24-zope211/lib/python/zope/tal/talinterpreter.py", line 891, in do_useMacro
        self.interpret(macro)
      File "/home/stefan/autotest/temp/python24-zope211/lib/python/zope/tal/talinterpreter.py", line 346, in interpret
        handlers[opcode](self, args)
      File "/home/stefan/autotest/temp/python24-zope211/lib/python/zope/tal/talinterpreter.py", line 586, in do_setLocal_tal
        self.engine.setLocal(name, self.engine.evaluateValue(expr))
      File "/home/stefan/autotest/temp/python24-zope211/lib/python/zope/tales/tales.py", line 696, in evaluate
        return expression(self)
      File "/home/stefan/autotest/temp/python24-zope211/lib/python/zope/tales/expressions.py", line 217, in __call__
        return self._eval(econtext)
      File "/home/stefan/autotest/temp/python24-zope211/lib/python/Products/PageTemplates/Expressions.py", line 131, in _eval
        ob = self._subexprs[-1](econtext)
      File "/home/stefan/autotest/temp/python24-zope211/lib/python/zope/tales/expressions.py", line 124, in _eval
        ob = self._traverser(ob, element, econtext)
      File "/home/stefan/autotest/temp/python24-zope211/lib/python/Products/PageTemplates/Expressions.py", line 80, in boboAwareZopeTraverse
        object = object.restrictedTraverse(name)
      File "/home/stefan/autotest/temp/python24-zope211/lib/python/OFS/Traversable.py", line 301, in restrictedTraverse
        return self.unrestrictedTraverse(path, default, restricted=True)
      File "/home/stefan/autotest/temp/python24-zope211/lib/python/OFS/Traversable.py", line 195, in unrestrictedTraverse
        if restricted and not validate(
    Unauthorized: <!DOCTYPE html PUBLIC "-//W3C//DTD XHTML 1.0 Transitional//EN" "http://www.w3.org/TR/xhtml1/DTD/xhtml1-transitional.dtd">



    <html xmlns="http://www.w3.org/1999/xhtml" xml:lang="en" lang="en">

      
        
        
        
        
        

      

      <head>

        <meta http-equiv="Content-Type" content="text/html;charset=utf-8" />

        
          <base href="http://nohost/plone/Members/test_user_1_/document" /><!--[if lt IE 7]></base><![endif]-->
        

        <meta name="generator" content="Plone - http://plone.org" />

        <link rel="kss-base-url" href="http://nohost/plone/Members/test_user_1_/document/" />

      
      
        
          <script type="text/javascript" src="http://nohost/plone/portal_javascripts/Plone%20Default/jquery-cachekey6202.js">
          </script>
        
        
      

      
      
        
        
          <style type="text/css"><!-- @import url(http://nohost/plone/portal_css/Plone%20Default/base-cachekey4182.css); --></style>
        
        
      

      
      <link rel="kinetic-stylesheet" type="text/css" href="http://nohost/plone/portal_kss/Plone%20Default/at-cachekey5190.kss" />


    <title>Test document &mdash; Plone site</title>


        <!-- Internet Explorer CSS Fixes -->
        <!--[if IE]>
            <style type="text/css" media="all">@import url(http://nohost/plone/IEFixes.css);</style>
        <![endif]-->

        
        <link rel="author" href="http://nohost/plone/author/test_user_1_" title="Author information" />



        <link rel="shortcut icon" type="image/x-icon" href="http://nohost/plone/favicon.ico" />



        <link rel="home" href="http://nohost/plone" title="Front page" />

        <link rel="contents" href="http://nohost/plone/sitemap" title="Site Map" />






        <link rel="search" href="http://nohost/plone/search_form" title="Search this site" />



        <!-- Disable IE6 image toolbar -->
        <meta http-equiv="imagetoolbar" content="no" />
        
        
        

        
        

        
        

        
        

      </head>

      <body class="section-Members template-default_error_message" dir="ltr">
        <div id="visual-portal-wrapper">

          <div id="portal-top">
            <div id="portal-header">
    <p class="hiddenStructure">
      <a accesskey="2" href="http://nohost/plone/Members/test_user_1_/document/edit#documentContent">Skip to content.</a> |

      <a accesskey="6" href="http://nohost/plone/Members/test_user_1_/document/edit#portlet-navigation-tree">Skip to navigation</a>
    </p>

    <ul id="portal-siteactions">

        <li id="siteaction-sitemap"><a href="http://nohost/plone/sitemap" accesskey="3" title="Site Map">Site Map</a></li>
        <li id="siteaction-accessibility"><a href="http://nohost/plone/accessibility-info" accesskey="0" title="Accessibility">Accessibility</a></li>
        <li id="siteaction-contact"><a href="http://nohost/plone/contact-info" accesskey="9" title="Contact">Contact</a></li>

    </ul>

    <div id="portal-searchbox">
        <form name="searchform" action="http://nohost/plone/search">

            <label for="searchGadget" class="hiddenStructure">Search Site</label>

            <div class="LSBox">
            <input name="SearchableText" type="text" size="18" title="Search Site" accesskey="4" class="inputLabel" id="searchGadget" />

            <input class="searchButton" type="submit" value="Search" />
        
            <div class="searchSection">
                <input id="searchbox_currentfolder_only" class="noborder" type="checkbox" name="path" value="/plone/Members/test_user_1_" />
                <label for="searchbox_currentfolder_only" style="cursor: pointer">
                    only in current section
                </label>
            </div>

            <div class="LSResult" id="LSResult" style=""><div class="LSShadow" id="LSShadow"></div></div>
            </div>
        </form>

        <div id="portal-advanced-search" class="hiddenStructure">
            <a href="http://nohost/plone/search_form" accesskey="5">
                Advanced Search&hellip;
            </a>
        </div>

    </div>

    <a id="portal-logo" accesskey="1" href="http://nohost/plone">
        <img src="http://nohost/plone/logo.jpg" alt="" title="Plone" height="57" width="252" /></a>


        <h5 class="hiddenStructure">Sections</h5>

        <ul id="portal-globalnav">
            <li id="portaltab-index_html" class="plain">
                <a href="http://nohost/plone" title="">Home</a></li>
            <li id="portaltab-Members" class="selected">
                <a href="http://nohost/plone/Members" title="Container for users' home directories">Users</a></li>
            <li id="portaltab-news" class="plain">
                <a href="http://nohost/plone/news" title="Site News">News</a></li>
            <li id="portaltab-events" class="plain">
                <a href="http://nohost/plone/events" title="Site Events">Events</a></li>
        </ul>

    </div>

    <div id="portal-personaltools-wrapper">

    <h5 class="hiddenStructure">Personal tools</h5>

    <ul id="portal-personaltools" class="visualInline">
       

        
            <li>
                <a href="http://nohost/plone/login_form">Log in</a>
            </li>
        

    </ul>
    </div>


        


    <div id="portal-breadcrumbs">

        <span id="breadcrumbs-you-are-here">You
    are here:</span>
        <a href="http://nohost/plone">Home</a>
        <span class="breadcrumbSeparator">
            &rarr;
            
        </span>
        <span dir="ltr">
            
                <a href="http://nohost/plone/Members">Users</a>
                <span class="breadcrumbSeparator">
                    &rarr;
                    
                </span>
                
             
        </span>
        <span dir="ltr">
            
                <a href="http://nohost/plone/Members/test_user_1_">test_user_1_</a>
                <span class="breadcrumbSeparator">
                    &rarr;
                    
                </span>
                
             
        </span>
        <span dir="ltr">
            
                
                
                <span>Test document</span>
             
        </span>

    </div>

          </div>

          <div class="visualClear" id="clear-space-before-wrapper-table"><!-- --></div>

          <table id="portal-columns">
            <tbody>
              <tr>
                
                
                

                
                <td id="portal-column-content">

                  
                    <div class="">

                      


                      <div id="region-content" class="documentContent">

                        <span id="contentTopLeft"></span>
                        <span id="contentTopRight"></span>
                        
                        <a name="documentContent"></a>

                        

        <dl class="portalMessage info" id="kssPortalMessage" style="display:none">
            <dt>Info</dt>
            <dd></dd>
        </dl>


                        
                        <div id="viewlet-above-content"></div>

                        
                        
                        
                          
                          <div>

            

            <div>

                <h1 class="documentFirstHeading">
                    We're sorry, but there seems to be an error&hellip;
                </h1>

                

                
                    <p>
                    If you are certain you have the correct web address but are encountering an error, please
                    contact the <span> <a href="http://nohost/plone/contact-info">site administration</a></span>.
                    </p>
                

            </div>
            

    </div>
                        
                        

                        
                        
                          

                        
                        

                        <span id="contentBottomLeft"></span>
                        <span id="contentBottomRight"></span>

                      </div>

                    </div>

                  
                </td>
                

                
                
                
              </tr>
            </tbody>
          </table>
          

          <div class="visualClear" id="clear-space-before-footer"><!-- --></div>
          
          

          

            <div id="portal-footer">

    <p>
        
        The
        <a href="http://plone.org">Plone<sup>&reg;</sup> CMS &mdash; Open Source Content Management System</a>
        is
        <acronym title="Copyright">&copy;</acronym>
        2000-2008
        by the
        <a href="http://plone.org/foundation">Plone Foundation</a>
        et al.
        
    </p>

    <p>
        
        Plone<sup>&reg;</sup> and the Plone logo are registered trademarks of the
            <a href="http://plone.org/foundation">Plone Foundation</a>.
        

        
        Distributed under the
            <a href="http://creativecommons.org/licenses/GPL/2.0/">GNU GPL license</a>.
        
    </p>

    </div>

      <div id="portal-colophon">
          

          

          <div class="colophonWrapper">
          <ul>
            <li>
              <a href="http://plone.org" title="This site was built using Plone CMS, the Open Source Content Management System. Click for more information.">
                Powered by Plone</a>
            </li>
            <li>
              <a href="http://validator.w3.org/check/referer" title="This site is valid XHTML.">
                Valid XHTML</a>
            </li>
            <li>
              <a href="http://jigsaw.w3.org/css-validator/check/referer&amp;warning=no&amp;profile=css3&amp;usermedium=all" title="This site was built with valid CSS.">
                Valid CSS</a>
            </li>
            <li>
              <a href="http://www.section508.gov" title="This site conforms to the US Government Section 508 Accessibility Guidelines.">
                Section 508</a>
            </li>
            <li>
              <a href="http://www.w3.org/WAI/WCAG1AA-Conformance" title="This site conforms to the W3C-WAI Web Content Accessibility Guidelines.">
                WCAG</a>
            </li>
          </ul>
          </div>

        </div>



          

          <div class="visualClear"><!-- --></div>
        </div>
    <div id="kss-spinner"><img alt="" src="http://nohost/plone/spinner.png" /></div>
    </body>
    </html>


----------------------------------------------------------------------
File "/home/stefan/autotest/temp/python24-zope211-cmf22-plone40/Products/ATContentTypes/tests/editing.txt", line 55, in editing.txt
Failed example:
    browser.getControl('Title').value = ''
Exception raised:
    Traceback (most recent call last):
      File "/home/stefan/autotest/temp/python24-zope211/lib/python/zope/testing/doctest.py", line 1356, in __run
        compileflags, 1) in test.globs
      File "<doctest editing.txt[21]>", line 1, in ?
        browser.getControl('Title').value = ''
      File "/home/stefan/autotest/temp/python24-zope211/lib/python/zope/testbrowser/browser.py", line 335, in getControl
        intermediate, msg = self._get_all_controls(
      File "/home/stefan/autotest/temp/python24-zope211/lib/python/mechanize/_mechanize.py", line 307, in forms
        if not self.viewing_html():
      File "/home/stefan/autotest/temp/python24-zope211/lib/python/mechanize/_mechanize.py", line 314, in viewing_html
        raise BrowserStateError("not viewing any document")
    BrowserStateError: not viewing any document
----------------------------------------------------------------------
File "/home/stefan/autotest/temp/python24-zope211-cmf22-plone40/Products/ATContentTypes/tests/editing.txt", line 56, in editing.txt
Failed example:
    browser.getControl('Save').click()
Exception raised:
    Traceback (most recent call last):
      File "/home/stefan/autotest/temp/python24-zope211/lib/python/zope/testing/doctest.py", line 1356, in __run
        compileflags, 1) in test.globs
      File "<doctest editing.txt[22]>", line 1, in ?
        browser.getControl('Save').click()
      File "/home/stefan/autotest/temp/python24-zope211/lib/python/zope/testbrowser/browser.py", line 335, in getControl
        intermediate, msg = self._get_all_controls(
      File "/home/stefan/autotest/temp/python24-zope211/lib/python/mechanize/_mechanize.py", line 307, in forms
        if not self.viewing_html():
      File "/home/stefan/autotest/temp/python24-zope211/lib/python/mechanize/_mechanize.py", line 314, in viewing_html
        raise BrowserStateError("not viewing any document")
    BrowserStateError: not viewing any document



Failure in test /home/stefan/autotest/temp/python24-zope211-cmf22-plone40/Products/ATContentTypes/tests/reindex_sanity.txt
Failed doctest test for reindex_sanity.txt
  File "/home/stefan/autotest/temp/python24-zope211-cmf22-plone40/Products/ATContentTypes/tests/reindex_sanity.txt", line 0

----------------------------------------------------------------------
File "/home/stefan/autotest/temp/python24-zope211-cmf22-plone40/Products/ATContentTypes/tests/reindex_sanity.txt", line 89, in reindex_sanity.txt
Failed example:
    _ = self.folder.invokeFactory(type_name='Document',
                                  id='new_doc1')
Expected:
    Catalog:  uid_catalog
    Indexing: Members/test_user_1_/new_doc1 []
    ------------------------------------------------------------
    Catalog:  portal_catalog
    Indexing: /plone/Members/test_user_1_/new_doc1 []
    ------------------------------------------------------------
    Catalog:  portal_catalog
    Indexing: /plone/Members/test_user_1_/new_doc1 ['review_state']
    ------------------------------------------------------------
    Catalog:  portal_catalog
    Indexing: /plone/Members/test_user_1_/new_doc1 ['allowedRolesAndUsers']
    ------------------------------------------------------------
    Catalog:  portal_catalog
    Indexing: /plone/Members/test_user_1_/new_doc1 []
    ------------------------------------------------------------
    Catalog:  uid_catalog
    Indexing: Members/test_user_1_/new_doc1 []
    ------------------------------------------------------------
Got:
    Catalog:  uid_catalog
    Indexing: Members/test_user_1_/new_doc1 []
    ------------------------------------------------------------
    Catalog:  portal_catalog
    Indexing: /plone/Members/test_user_1_/new_doc1 ['review_state']
    ------------------------------------------------------------
    Catalog:  portal_catalog
    Indexing: /plone/Members/test_user_1_/new_doc1 []
    ------------------------------------------------------------
    Catalog:  uid_catalog
    Indexing: Members/test_user_1_/new_doc1 []
    ------------------------------------------------------------
    Catalog:  portal_catalog
    Indexing: /plone/Members/test_user_1_/new_doc1 ['review_state']
    ------------------------------------------------------------
    Catalog:  portal_catalog
    Indexing: /plone/Members/test_user_1_/new_doc1 ['allowedRolesAndUsers']
    ------------------------------------------------------------
    Catalog:  portal_catalog
    Indexing: /plone/Members/test_user_1_/new_doc1 []
    ------------------------------------------------------------

  Ran 826 tests with 14 failures and 1 errors in 5 minutes 34.461 seconds.
Tearing down left over layers:
  Tear down Products.PloneTestCase.layer.PloneSite in 0.749 seconds.
  Tear down Products.PloneTestCase.layer.ZCML in 0.039 seconds.
  Tear down Testing.ZopeTestCase.layer.ZopeLite in 0.000 seconds.

FAILED (failures=14, errors=1)




More information about the Testbot mailing list