[Testbot] FAILED (failures=2) : Plone-3.1 Zope-2.10 Python-2.4.4

plone.* Tests plone-tests at epy.co.at
Thu May 1 03:37:13 UTC 2008


plone.* Tests : FAILED (failures=2)
Plone-3.1 Zope-2.10 Python-2.4.4

Running /usr/local/python2.4/bin/python /home/stefan/autotest/temp/python24-zope210/test.py -q -1 --config-file etc/zope.conf --package plone
Installing CMFCore ... done (0.505s)
Installing CMFDefault ... done (0.329s)
Installing CMFCalendar ... done (0.062s)
Installing CMFTopic ... done (0.035s)
Installing DCWorkflow ... done (0.071s)
Installing CMFActionIcons ... done (0.029s)
Installing CMFQuickInstallerTool ... done (0.094s)
Installing CMFFormController ... done (0.502s)
Installing GroupUserFolder ... done (0.581s)
Installing ZCTextIndex ... done (0.080s)
Installing CMFPlone ... done (3.088s)
Installing Archetypes ... done (0.159s)
Installing ATContentTypes ... done (0.055s)
Installing ATReferenceBrowserWidget ... done (0.018s)
Installing CMFDynamicViewFTI ... done (0.016s)
Installing ExternalEditor ... done (0.020s)
Installing ExtendedPathIndex ... done (0.021s)
Installing ResourceRegistries ... done (0.018s)
Installing SecureMailHost ... done (0.018s)
Installing CMFPlacefulWorkflow ... done (0.390s)
Installing PasswordResetTool ... done (0.021s)
Installing PluggableAuthService ... done (0.032s)
Installing PluginRegistry ... done (0.023s)
Installing PlonePAS ... done (0.029s)
Installing kupu ... done (0.398s)
Installing CMFEditions ... done (0.035s)
Installing CMFDiffTool ... done (0.028s)
Installing PloneLanguageTool ... done (0.029s)
/home/stefan/autotest/temp/python24-zope210/lib/python/zope/testing/testrunner.py:1251: DeprecationWarning: Non-ASCII character '\xc3' in file /home/stefan/autotest/temp/python24-zope210-cmf21-plone31/lib/python/plone/app/contentrules/tests/test_configuration.py on line 171, but no encoding declared; see http://www.python.org/peps/pep-0263.html for details
  __import__(name)
Parsing /home/stefan/autotest/temp/python24-zope210-cmf21-plone31/etc/zope.conf
Running unit tests:
/home/stefan/autotest/temp/python24-zope210/lib/python/zope/configuration/fields.py:417: UserWarning: You did not specify an i18n translation domain for the 'title' field in /home/stefan/autotest/temp/python24-zope210-cmf21-plone31/lib/python/kss/core/permission.zcml
  warnings.warn(
  Ran 369 tests with 0 failures and 0 errors in 7.081 seconds.
Running Products.PloneTestCase.layer.ZCML tests:
  Set up Products.PloneTestCase.layer.ZCML in 4.500 seconds.
Installing plone.app.form ... NOT FOUND
Installing plone.portlet.collection ... done (0.038s)
Installing plone.portlet.static ... done (0.033s)
  Ran 36 tests with 0 failures and 0 errors in 0.238 seconds.
Running Products.PloneTestCase.layer.PloneSite tests:
  Set up Products.PloneTestCase.layer.PloneSite in 9.651 seconds.


Failure in test test_initPortletNode_i18n (plone.app.portlets.tests.test_exportimport.TestImportPortlets)
Traceback (most recent call last):
  File "/home/stefan/autotest/temp/python24-zope210/lib/python/Testing/ZopeTestCase/profiler.py", line 98, in __call__
    testMethod()
  File "/home/stefan/autotest/temp/python24-zope210-cmf21-plone31/lib/python/plone/app/portlets/tests/test_exportimport.py", line 109, in test_initPortletNode_i18n
    self.failUnless(isinstance(portlet.title, Message))
  File "/usr/local/python2.4/lib/python2.4/unittest.py", line 309, in failUnless
    if not expr: raise self.failureException, msg
AssertionError

/home/stefan/autotest/temp/python24-zope210/lib/python/zope/configuration/fields.py:417: UserWarning: You did not specify an i18n translation domain for the 'description' field in <string>
  warnings.warn(
/home/stefan/autotest/temp/python24-zope210/lib/python/zope/configuration/fields.py:417: UserWarning: You did not specify an i18n translation domain for the 'title' field in <string>
  warnings.warn(
  Ran 748 tests with 1 failures and 0 errors in 247.217 seconds.
Running plone.app.contentrules.tests.test_configuration.TestContentrulesGSLayer tests:
  Set up plone.app.contentrules.tests.test_configuration.TestContentrulesGSLayer in 0.495 seconds.
  Ran 6 tests with 0 failures and 0 errors in 1.497 seconds.
Running plone.app.customerize.tests.layer.PloneCustomerize tests:
  Tear down plone.app.contentrules.tests.test_configuration.TestContentrulesGSLayer in 0.005 seconds.
  Set up plone.app.customerize.tests.layer.PloneCustomerize in 0.000 seconds.
  Ran 11 tests with 0 failures and 0 errors in 6.364 seconds.
Running plone.app.kss.tests.kss_and_plone_layer.KSSAndPloneLayer tests:
  Tear down plone.app.customerize.tests.layer.PloneCustomerize in 0.000 seconds.
  Set up plone.app.kss.tests.kss_and_plone_layer.KSSAndPloneLayer in 0.012 seconds.
  Ran 13 tests with 0 failures and 0 errors in 3.258 seconds.
Running plone.app.linkintegrity.tests.layer.PloneLinkintegrity tests:
  Tear down plone.app.kss.tests.kss_and_plone_layer.KSSAndPloneLayer in 0.000 seconds.
  Set up plone.app.linkintegrity.tests.layer.PloneLinkintegrity in 1.412 seconds.
  Ran 95 tests with 0 failures and 0 errors in 56.804 seconds.
Running plone.app.portlets.tests.test_configuration.TestPortletZCMLLayer tests:
  Tear down plone.app.linkintegrity.tests.layer.PloneLinkintegrity in 0.226 seconds.
  Set up plone.app.portlets.tests.test_configuration.TestPortletZCMLLayer in 0.016 seconds.
  Ran 5 tests with 0 failures and 0 errors in 0.058 seconds.
Running plone.app.portlets.tests.test_configuration.TestPortletGSLayer tests:
  Set up plone.app.portlets.tests.test_configuration.TestPortletGSLayer in 1.564 seconds.


Failure in test testPortletTypeRegistered (plone.app.portlets.tests.test_configuration.TestGenericSetup)
Traceback (most recent call last):
  File "/home/stefan/autotest/temp/python24-zope210/lib/python/Testing/ZopeTestCase/profiler.py", line 98, in __call__
    testMethod()
  File "/home/stefan/autotest/temp/python24-zope210-cmf21-plone31/lib/python/plone/app/portlets/tests/test_configuration.py", line 202, in testPortletTypeRegistered
    self.failUnless(isinstance(portlet_type.title, Message))
  File "/usr/local/python2.4/lib/python2.4/unittest.py", line 309, in failUnless
    if not expr: raise self.failureException, msg
AssertionError

  Ran 12 tests with 1 failures and 0 errors in 4.629 seconds.
Running plone.app.viewletmanager.tests.test_exportimport.Layer tests:
  Tear down plone.app.portlets.tests.test_configuration.TestPortletGSLayer in 0.000 seconds.
  Tear down plone.app.portlets.tests.test_configuration.TestPortletZCMLLayer in 0.000 seconds.
  Tear down Products.PloneTestCase.layer.PloneSite in 0.743 seconds.
  Tear down Products.PloneTestCase.layer.ZCML in 0.020 seconds.
  Set up plone.app.viewletmanager.tests.test_exportimport.Layer in 0.000 seconds.
Installing plone.app.form ... NOT FOUND
Installing plone.browserlayer ... NOT FOUND
  Ran 15 tests with 0 failures and 0 errors in 0.141 seconds.
Running plone.browserlayer.tests.test_doctest.PloneBrowserLayerLayer tests:
  Tear down plone.app.viewletmanager.tests.test_exportimport.Layer in 0.000 seconds.
  Set up Products.PloneTestCase.layer.ZCML in 4.396 seconds.
  Set up Products.PloneTestCase.layer.PloneSite in 9.309 seconds.
  Set up plone.browserlayer.tests.test_doctest.PloneBrowserLayerLayer in 0.010 seconds.
  Ran 9 tests with 0 failures and 0 errors in 1.371 seconds.
Running plone.theme.tests.test_doctest.PloneThemeLayer tests:
  Tear down plone.browserlayer.tests.test_doctest.PloneBrowserLayerLayer in 0.000 seconds.
  Set up plone.theme.tests.test_doctest.PloneThemeLayer in 0.012 seconds.
  Ran 5 tests with 0 failures and 0 errors in 0.177 seconds.
Tearing down left over layers:
  Tear down plone.theme.tests.test_doctest.PloneThemeLayer in 0.000 seconds.
  Tear down Products.PloneTestCase.layer.PloneSite in 0.706 seconds.
  Tear down Products.PloneTestCase.layer.ZCML in 0.019 seconds.
Total: 1324 tests, 2 failures, 0 errors

FAILED (failures=2)




More information about the Testbot mailing list